DEBUG: Executing python function do_testimage
NOTE: rootfs file: /home/autobuilder/yocto-autobuilder/yocto-worker/nightly-mips/build/build/tmp/work/qemumips-poky-linux/core-image-sato-sdk/1.0-r0/testimage/core-image-sato-sdk-qemumips-testimage.ext4
NOTE: Qemu log file: /home/autobuilder/yocto-autobuilder/yocto-worker/nightly-mips/build/build/tmp/work/qemumips-poky-linux/core-image-sato-sdk/1.0-r0/testimage/qemu_boot_log.20150825090915
NOTE: SSH log file: /home/autobuilder/yocto-autobuilder/yocto-worker/nightly-mips/build/build/tmp/work/qemumips-poky-linux/core-image-sato-sdk/1.0-r0/testimage/ssh_target_log.20150825090915
NOTE: Created listening socket for qemu serial console on: 127.0.0.1:49173
NOTE: runqemu started, pid is 25240
NOTE: waiting at most 60 seconds for qemu pid
NOTE: qemu started - qemu procces pid is 25486
NOTE: Target IP: 192.168.7.6
NOTE: Server IP: 192.168.7.5
NOTE: Waiting at most 1500 seconds for login banner
NOTE: Connection from 127.0.0.1:59420
NOTE: Reached login banner
NOTE: Logged as root in serial console
NOTE: Test modules  ['oeqa.runtime.ping', 'oeqa.runtime.ssh', 'oeqa.runtime.df', 'oeqa.runtime.connman', 'oeqa.runtime.syslog', 'oeqa.runtime.xorg', 'oeqa.runtime.scp', 'oeqa.runtime.vnc', 'oeqa.runtime.date', 'oeqa.runtime.perl', 'oeqa.runtime.ldd', 'oeqa.runtime.gcc', 'oeqa.runtime.kernelmodule', 'oeqa.runtime.dmesg', 'oeqa.runtime.python', 'oeqa.runtime.parselogs', 'oeqa.runtime.smart', 'oeqa.runtime.rpm']
NOTE: Found 55 tests
test_ping (oeqa.runtime.ping.PingTest) ... ok
test_ssh (oeqa.runtime.ssh.SshTest) ... ok
test_df (oeqa.runtime.df.DfTest) ... ok
test_connmand_help (oeqa.runtime.connman.ConnmanTest) ... ok
test_connmand_running (oeqa.runtime.connman.ConnmanTest) ... ok
test_only_one_connmand_in_background (oeqa.runtime.connman.ConnmanTest) ... ok
test_syslog_running (oeqa.runtime.syslog.SyslogTest) ... ok
test_syslog_logger (oeqa.runtime.syslog.SyslogTestConfig) ... ok
test_syslog_restart (oeqa.runtime.syslog.SyslogTestConfig) ... ok
test_syslog_startup_config (oeqa.runtime.syslog.SyslogTestConfig) ... ok
test_xorg_running (oeqa.runtime.xorg.XorgTest) ... ok
test_scp_file (oeqa.runtime.scp.ScpTest) ... ok
test_vnc (oeqa.runtime.vnc.VNCTest) ... ok
test_date (oeqa.runtime.date.DateTest) ... ok
test_perl_exists (oeqa.runtime.perl.PerlTest) ... ok
test_perl_works (oeqa.runtime.perl.PerlTest) ... ok
test_ldd_exists (oeqa.runtime.ldd.LddTest) ... ok
test_ldd_rtldlist_check (oeqa.runtime.ldd.LddTest) ... ok
test_gcc_compile (oeqa.runtime.gcc.GccCompileTest) ... ok
test_gpp2_compile (oeqa.runtime.gcc.GccCompileTest) ... ok
test_gpp_compile (oeqa.runtime.gcc.GccCompileTest) ... ok
test_make (oeqa.runtime.gcc.GccCompileTest) ... ok
test_kernel_module (oeqa.runtime.kernelmodule.KernelModuleTest) ... FAIL
test_dmesg (oeqa.runtime.dmesg.DmesgTest) ... WARNING: test_dmesg failed: getting data from target and saving into /tmp/oe-saved-tests/201508251234_test_dmesg
ok
test_python_exists (oeqa.runtime.python.PythonTest) ... WARNING: test_python_exists failed: getting data from target and saving into /tmp/oe-saved-tests/201508251235_test_python_exists
ok
test_python_stdout (oeqa.runtime.python.PythonTest) ... WARNING: test_python_stdout failed: getting data from target and saving into /tmp/oe-saved-tests/201508251236_test_python_stdout
ok
test_python_testfile (oeqa.runtime.python.PythonTest) ... WARNING: test_python_testfile failed: getting data from target and saving into /tmp/oe-saved-tests/201508251236_test_python_testfile
ok
test_parselogs (oeqa.runtime.parselogs.ParseLogsTest) ... Machine information: 
*******************************
Machine name: qemumips
CPU: 
Arch: mips
Physical cores: 
Logical cores: 1
*******************************

WARNING: test_parselogs failed: getting data from target and saving into /tmp/oe-saved-tests/201508251238_test_parselogs
ok
test_smart_help (oeqa.runtime.smart.SmartBasicTest) ... WARNING: test_smart_help failed: getting data from target and saving into /tmp/oe-saved-tests/201508251239_test_smart_help
ok
test_smart_info (oeqa.runtime.smart.SmartBasicTest) ... WARNING: test_smart_info failed: getting data from target and saving into /tmp/oe-saved-tests/201508251243_test_smart_info
ok
test_smart_query (oeqa.runtime.smart.SmartBasicTest) ... WARNING: test_smart_query failed: getting data from target and saving into /tmp/oe-saved-tests/201508251245_test_smart_query
ok
test_smart_search (oeqa.runtime.smart.SmartBasicTest) ... WARNING: test_smart_search failed: getting data from target and saving into /tmp/oe-saved-tests/201508251248_test_smart_search
ok
test_smart_stats (oeqa.runtime.smart.SmartBasicTest) ... WARNING: test_smart_stats failed: getting data from target and saving into /tmp/oe-saved-tests/201508251249_test_smart_stats
ok
test_smart_version (oeqa.runtime.smart.SmartBasicTest) ... WARNING: test_smart_version failed: getting data from target and saving into /tmp/oe-saved-tests/201508251250_test_smart_version
ok
test_smart_add_rpmdir (oeqa.runtime.smart.SmartRepoTest) ... WARNING: test_smart_add_rpmdir failed: getting data from target and saving into /tmp/oe-saved-tests/201508251253_test_smart_add_rpmdir
ok
test_smart_channel (oeqa.runtime.smart.SmartRepoTest) ... WARNING: test_smart_channel failed: getting data from target and saving into /tmp/oe-saved-tests/201508251254_test_smart_channel
ok
test_smart_channel_add (oeqa.runtime.smart.SmartRepoTest) ... FAIL
WARNING: test_smart_channel_add failed: getting data from target and saving into /tmp/oe-saved-tests/201508251257_test_smart_channel_add
test_smart_channel_help (oeqa.runtime.smart.SmartRepoTest) ... WARNING: test_smart_channel_help failed: getting data from target and saving into /tmp/oe-saved-tests/201508251258_test_smart_channel_help
ok
test_smart_channel_list (oeqa.runtime.smart.SmartRepoTest) ... WARNING: test_smart_channel_list failed: getting data from target and saving into /tmp/oe-saved-tests/201508251259_test_smart_channel_list
ok
test_smart_channel_rpmsys (oeqa.runtime.smart.SmartRepoTest) ... WARNING: test_smart_channel_rpmsys failed: getting data from target and saving into /tmp/oe-saved-tests/201508251300_test_smart_channel_rpmsys
ok
test_smart_channel_show (oeqa.runtime.smart.SmartRepoTest) ... WARNING: test_smart_channel_show failed: getting data from target and saving into /tmp/oe-saved-tests/201508251301_test_smart_channel_show
ok
test_smart_install (oeqa.runtime.smart.SmartRepoTest) ... WARNING: test_smart_install failed: getting data from target and saving into /tmp/oe-saved-tests/201508251317_test_smart_install
ok
test_smart_install_dependency (oeqa.runtime.smart.SmartRepoTest) ... WARNING: test_smart_install_dependency failed: getting data from target and saving into /tmp/oe-saved-tests/201508251327_test_smart_install_dependency
ok
test_smart_install_from_disk (oeqa.runtime.smart.SmartRepoTest) ... WARNING: test_smart_install_from_disk failed: getting data from target and saving into /tmp/oe-saved-tests/201508251338_test_smart_install_from_disk
ok
test_smart_install_from_http (oeqa.runtime.smart.SmartRepoTest) ... WARNING: test_smart_install_from_http failed: getting data from target and saving into /tmp/oe-saved-tests/201508251353_test_smart_install_from_http
ok
test_smart_local_dir (oeqa.runtime.smart.SmartRepoTest) ... WARNING: test_smart_local_dir failed: getting data from target and saving into /tmp/oe-saved-tests/201508251403_test_smart_local_dir
ok
test_smart_reinstall (oeqa.runtime.smart.SmartRepoTest) ... WARNING: test_smart_reinstall failed: getting data from target and saving into /tmp/oe-saved-tests/201508251405_test_smart_reinstall
ok
test_smart_remote_repo (oeqa.runtime.smart.SmartRepoTest) ... WARNING: test_smart_remote_repo failed: getting data from target and saving into /tmp/oe-saved-tests/201508251416_test_smart_remote_repo
ok
test_smart_remove_package (oeqa.runtime.smart.SmartRepoTest) ... WARNING: test_smart_remove_package failed: getting data from target and saving into /tmp/oe-saved-tests/201508251430_test_smart_remove_package
ok
test_rpm_help (oeqa.runtime.rpm.RpmBasicTest) ... WARNING: test_rpm_help failed: getting data from target and saving into /tmp/oe-saved-tests/201508251431_test_rpm_help
ok
test_rpm_query (oeqa.runtime.rpm.RpmBasicTest) ... WARNING: test_rpm_query failed: getting data from target and saving into /tmp/oe-saved-tests/201508251431_test_rpm_query
ok
test_check_rpm_install_removal_log_file_size (oeqa.runtime.rpm.RpmInstallRemoveTest) ... WARNING: test_check_rpm_install_removal_log_file_size failed: getting data from target and saving into /tmp/oe-saved-tests/201508251442_test_check_rpm_install_removal_log_file_size
ok
test_rpm_install (oeqa.runtime.rpm.RpmInstallRemoveTest) ... WARNING: test_rpm_install failed: getting data from target and saving into /tmp/oe-saved-tests/201508251442_test_rpm_install
ok
test_rpm_query_nonroot (oeqa.runtime.rpm.RpmInstallRemoveTest) ... WARNING: test_rpm_query_nonroot failed: getting data from target and saving into /tmp/oe-saved-tests/201508251443_test_rpm_query_nonroot
ok
test_rpm_remove (oeqa.runtime.rpm.RpmInstallRemoveTest) ... WARNING: test_rpm_remove failed: getting data from target and saving into /tmp/oe-saved-tests/201508251445_test_rpm_remove
ok

======================================================================
FAIL: test_kernel_module (oeqa.runtime.kernelmodule.KernelModuleTest)
----------------------------------------------------------------------
Traceback (most recent call last):
  File "/home/autobuilder/yocto-autobuilder/yocto-worker/nightly-mips/build/meta/lib/oeqa/utils/decorators.py", line 102, in wrapped_f
    return func(*args)
  File "/home/autobuilder/yocto-autobuilder/yocto-worker/nightly-mips/build/meta/lib/oeqa/utils/decorators.py", line 90, in wrapped_f
    return f(*args)
  File "/home/autobuilder/yocto-autobuilder/yocto-worker/nightly-mips/build/meta/lib/oeqa/utils/decorators.py", line 90, in wrapped_f
    return f(*args)
  File "/home/autobuilder/yocto-autobuilder/yocto-worker/nightly-mips/build/meta/lib/oeqa/runtime/kernelmodule.py", line 31, in test_kernel_module
    self.assertEqual(status, 0, msg="\n".join([cmd, output]))
AssertionError: 255 != 0 : cd /usr/src/kernel && make scripts
  HOSTCC  scripts/basic/fixdep
  HOSTCC  scripts/basic/bin2c
  HOSTCC  scripts/kconfig/conf.o
  SHIPPED scripts/kconfig/zconf.tab.c
  SHIPPED scripts/kconfig/zconf.lex.c
  SHIPPED scripts/kconfig/zconf.hash.c
  HOSTCC  scripts/kconfig/zconf.tab.o

Process killed - no output for 900 seconds. Total running time: 1102 seconds.

======================================================================
FAIL: test_smart_channel_add (oeqa.runtime.smart.SmartRepoTest)
----------------------------------------------------------------------
Traceback (most recent call last):
  File "/home/autobuilder/yocto-autobuilder/yocto-worker/nightly-mips/build/meta/lib/oeqa/utils/decorators.py", line 102, in wrapped_f
    return func(*args)
  File "/home/autobuilder/yocto-autobuilder/yocto-worker/nightly-mips/build/meta/lib/oeqa/runtime/smart.py", line 80, in test_smart_channel_add
    self.smart('update')
  File "/home/autobuilder/yocto-autobuilder/yocto-worker/nightly-mips/build/meta/lib/oeqa/utils/decorators.py", line 90, in wrapped_f
    return f(*args)
  File "/home/autobuilder/yocto-autobuilder/yocto-worker/nightly-mips/build/meta/lib/oeqa/runtime/smart.py", line 22, in smart
    self.assertEqual(status, expected, message)
AssertionError: 1 != 0 : smart update
Loading cache...
Updating cache...               ######################################## [100%]

                                                                               
Fetching information for 'mips32r2'...
                                                                               
-> http://192.168.7.5:52857/rpm/mips32r2/repodata/repomd.xml
repomd.xml                      ######################################## [ 16%]
                                                                               
-> http://192.168.7.5:52857/rpm/mips32r2/repodata/filelists.xml.gz
filelists.xml.gz                ######################################## [ 25%]
                                                                               
-> http://192.168.7.5:52857/rpm/mips32r2/repodata/primary.xml.gz
primary.xml.gz                  ######################################## [ 33%]
                                                                               
Fetching information for 'qemumips'...
                                                                               
-> http://192.168.7.5:52857/rpm/qemumips/repodata/repomd.xml
repomd.xml                      ######################################## [ 50%]
                                                                               
-> http://192.168.7.5:52857/rpm/qemumips/repodata/primary.xml.gz
primary.xml.gz                  ######################################## [ 58%]
                                                                               
-> http://192.168.7.5:52857/rpm/qemumips/repodata/filelists.xml.gz
filelists.xml.gz                ######################################## [ 66%]
Traceback (most recent call last):
  File "/usr/bin/smart", line 200, in <module>
    main(sys.argv[1:])
  File "/usr/bin/smart", line 173, in main
    exitcode = iface.run(opts.command, opts.argv)
  File "/usr/lib/python2.7/site-packages/smart/interface.py", line 53, in run
    result = _command.main(self._ctrl, opts)
  File "/usr/lib/python2.7/site-packages/smart/commands/update.py", line 82, in main
    failed = not ctrl.reloadChannels(channels, caching=NEVER)
  File "/usr/lib/python2.7/site-packages/smart/control.py", line 388, in reloadChannels
    if not channel.fetch(self._fetcher, progress):
  File "/usr/lib/python2.7/site-packages/smart/channels/rpm_md.py", line 242, in fetch
    digest = getFileDigest(item.getTargetPath())
  File "/usr/lib/python2.7/site-packages/smart/util/filetools.py", line 34, in getFileDigest
    file = open(path)
TypeError: coercing to Unicode: need string or buffer, NoneType found

----------------------------------------------------------------------
Ran 55 tests in 9198.056s

FAILED (failures=2)
NOTE: Sending SIGTERM to runqemu
DEBUG: Python function do_testimage finished
ERROR: Function failed: core-image-sato-sdk - FAILED - check the task log and the ssh log

Error details

Submitted on:
25/08/15 05:08
Error type:
Recipe
Task:
do_testimage
Recipe:
core-image-sato-sdk
Recipe version:
1.0-r0
Machine:
qemumips
Distro:
poky
Build system:
x86_64-linux
Target system:
mips-poky-linux
Host distro:
CentOS-Linux-7.1.1503
Branch:
master
Commit:
a3d228a484cf471e999b6537987e2897d8a7bd4e
View commit
Build:
#8240
Submitter:
yocto-autobuilder-autogenerated-ab-centos
Link back:
http://10.237.112.88:8010/builders/nightly-mips/builds/32
Similar errors:
1
Open a bug