### Shell environment set up for builds. ###

You can now run 'bitbake <target>'

Common targets are:
    core-image-minimal
    core-image-sato
    meta-toolchain
    meta-ide-support

You can also run generated qemu images with a command like 'runqemu qemux86'
2018-11-29 17:20:49,948 - oe-selftest - INFO - Adding layer libraries:
2018-11-29 17:20:49,948 - oe-selftest - INFO - 	/home/pokybuild/yocto-worker/oe-selftest-ubuntu/build/meta/lib
2018-11-29 17:20:49,948 - oe-selftest - INFO - 	/home/pokybuild/yocto-worker/oe-selftest-ubuntu/build/meta-yocto-bsp/lib
2018-11-29 17:20:49,948 - oe-selftest - INFO - 	/home/pokybuild/yocto-worker/oe-selftest-ubuntu/build/meta-selftest/lib
2018-11-29 17:20:49,950 - oe-selftest - INFO - Running bitbake -e to test the configuration is valid/parsable
2018-11-29 17:20:51,673 - oe-selftest - INFO - Adding: "include selftest.inc" in /home/pokybuild/yocto-worker/oe-selftest-ubuntu/build/build-st-7530/conf/local.conf
2018-11-29 17:20:51,674 - oe-selftest - INFO - Adding: "include bblayers.inc" in bblayers.conf
2018-11-29 17:20:51,676 - oe-selftest - INFO - Adding: "include selftest.inc" in /home/pokybuild/yocto-worker/oe-selftest-ubuntu/build/build-st-7585/conf/local.conf
2018-11-29 17:20:51,677 - oe-selftest - INFO - Adding: "include bblayers.inc" in bblayers.conf
2018-11-29 17:20:51,686 - oe-selftest - INFO - Adding: "include selftest.inc" in /home/pokybuild/yocto-worker/oe-selftest-ubuntu/build/build-st-7599/conf/local.conf
2018-11-29 17:20:51,686 - oe-selftest - INFO - Adding: "include bblayers.inc" in bblayers.conf
2018-11-29 17:20:51,702 - oe-selftest - INFO - Adding: "include selftest.inc" in /home/pokybuild/yocto-worker/oe-selftest-ubuntu/build/build-st-7536/conf/local.conf
2018-11-29 17:20:51,703 - oe-selftest - INFO - Adding: "include bblayers.inc" in bblayers.conf
2018-11-29 17:20:51,703 - oe-selftest - INFO - Adding: "include selftest.inc" in /home/pokybuild/yocto-worker/oe-selftest-ubuntu/build/build-st-7564/conf/local.conf
2018-11-29 17:20:51,704 - oe-selftest - INFO - Adding: "include bblayers.inc" in bblayers.conf
2018-11-29 17:20:51,704 - oe-selftest - INFO - Adding: "include selftest.inc" in /home/pokybuild/yocto-worker/oe-selftest-ubuntu/build/build-st-7550/conf/local.conf
2018-11-29 17:20:51,705 - oe-selftest - INFO - Adding: "include bblayers.inc" in bblayers.conf
2018-11-29 17:20:51,707 - oe-selftest - INFO - Adding: "include selftest.inc" in /home/pokybuild/yocto-worker/oe-selftest-ubuntu/build/build-st-7567/conf/local.conf
2018-11-29 17:20:51,708 - oe-selftest - INFO - Adding: "include bblayers.inc" in bblayers.conf
2018-11-29 17:20:51,713 - oe-selftest - INFO - Adding: "include selftest.inc" in /home/pokybuild/yocto-worker/oe-selftest-ubuntu/build/build-st-7548/conf/local.conf
2018-11-29 17:20:51,714 - oe-selftest - INFO - Adding: "include bblayers.inc" in bblayers.conf
2018-11-29 17:20:51,714 - oe-selftest - INFO - oelib.types.TestBooleanType.test_bool_equality (subunit.RemotedTestCase)
2018-11-29 17:20:51,715 - oe-selftest - INFO -  ... ok
2018-11-29 17:20:51,715 - oe-selftest - INFO - 13: 1/10 1/338 (0.00s) (oelib.types.TestBooleanType.test_bool_equality)
2018-11-29 17:20:51,715 - oe-selftest - INFO - Adding: "include selftest.inc" in /home/pokybuild/yocto-worker/oe-selftest-ubuntu/build/build-st-7591/conf/local.conf
2018-11-29 17:20:51,715 - oe-selftest - INFO - oelib.types.TestBooleanType.test_false (subunit.RemotedTestCase)
2018-11-29 17:20:51,716 - oe-selftest - INFO -  ... ok
2018-11-29 17:20:51,716 - oe-selftest - INFO - 13: 2/10 2/338 (0.00s) (oelib.types.TestBooleanType.test_false)
2018-11-29 17:20:51,716 - oe-selftest - INFO - Adding: "include bblayers.inc" in bblayers.conf
2018-11-29 17:20:51,716 - oe-selftest - INFO - oelib.types.TestBooleanType.test_invalid (subunit.RemotedTestCase)
2018-11-29 17:20:51,716 - oe-selftest - INFO -  ... ok
2018-11-29 17:20:51,716 - oe-selftest - INFO - 13: 3/10 3/338 (0.00s) (oelib.types.TestBooleanType.test_invalid)
2018-11-29 17:20:51,717 - oe-selftest - INFO - oelib.types.TestBooleanType.test_true (subunit.RemotedTestCase)
2018-11-29 17:20:51,717 - oe-selftest - INFO -  ... ok
2018-11-29 17:20:51,717 - oe-selftest - INFO - 13: 4/10 4/338 (0.00s) (oelib.types.TestBooleanType.test_true)
2018-11-29 17:20:51,720 - oe-selftest - INFO - Adding: "include selftest.inc" in /home/pokybuild/yocto-worker/oe-selftest-ubuntu/build/build-st-7587/conf/local.conf
2018-11-29 17:20:51,720 - oe-selftest - INFO - Adding: "include selftest.inc" in /home/pokybuild/yocto-worker/oe-selftest-ubuntu/build/build-st-7582/conf/local.conf
2018-11-29 17:20:51,720 - oe-selftest - INFO - Adding: "include bblayers.inc" in bblayers.conf
2018-11-29 17:20:51,720 - oe-selftest - INFO - Adding: "include bblayers.inc" in bblayers.conf
2018-11-29 17:20:51,721 - oe-selftest - INFO - Adding: "include selftest.inc" in /home/pokybuild/yocto-worker/oe-selftest-ubuntu/build/build-st-7556/conf/local.conf
2018-11-29 17:20:51,721 - oe-selftest - INFO - Adding: "include bblayers.inc" in bblayers.conf
2018-11-29 17:20:51,723 - oe-selftest - INFO - selftest.ExternalLayer.test_list_imported (subunit.RemotedTestCase)
2018-11-29 17:20:51,723 - oe-selftest - INFO -  ... ok
2018-11-29 17:20:51,723 - oe-selftest - INFO - 3: 1/8 5/338 (0.01s) (selftest.ExternalLayer.test_list_imported)
2018-11-29 17:20:51,724 - oe-selftest - INFO - oelib.license.TestIsIncluded.test_tests (subunit.RemotedTestCase)
2018-11-29 17:20:51,724 - oe-selftest - INFO -  ... ok
2018-11-29 17:20:51,724 - oe-selftest - INFO - 12: 1/69 6/338 (0.01s) (oelib.license.TestIsIncluded.test_tests)
2018-11-29 17:20:51,744 - oe-selftest - INFO - Adding: "include selftest.inc" in /home/pokybuild/yocto-worker/oe-selftest-ubuntu/build/build-st-7543/conf/local.conf
2018-11-29 17:20:51,745 - oe-selftest - INFO - Adding: "include bblayers.inc" in bblayers.conf
2018-11-29 17:20:51,751 - oe-selftest - INFO - oelib.utils.TestPackagesFilterOutSystem.test_filter (subunit.RemotedTestCase)
2018-11-29 17:20:51,751 - oe-selftest - INFO -  ... ok
2018-11-29 17:20:51,751 - oe-selftest - INFO - 2: 1/9 7/338 (0.01s) (oelib.utils.TestPackagesFilterOutSystem.test_filter)
2018-11-29 17:20:51,768 - oe-selftest - INFO - oelib.utils.TestMultiprocessLaunch.test_multiprocesslaunch (subunit.RemotedTestCase)
2018-11-29 17:20:51,768 - oe-selftest - INFO -  ... ok
2018-11-29 17:20:51,768 - oe-selftest - INFO - 9: 1/25 8/338 (0.05s) (oelib.utils.TestMultiprocessLaunch.test_multiprocesslaunch)
2018-11-29 17:20:51,769 - oe-selftest - INFO - Adding: "include selftest.inc" in /home/pokybuild/yocto-worker/oe-selftest-ubuntu/build/build-st-7579/conf/local.conf
2018-11-29 17:20:51,770 - oe-selftest - INFO - Adding: "include bblayers.inc" in bblayers.conf
2018-11-29 17:20:53,340 - oe-selftest - INFO - Adding: "include selftest.inc" in /home/pokybuild/yocto-worker/oe-selftest-ubuntu/build/build-st-7573/conf/local.conf
2018-11-29 17:20:53,341 - oe-selftest - INFO - Adding: "include bblayers.inc" in bblayers.conf
2018-11-29 17:20:55,775 - oe-selftest - INFO - liboe.LibOE.test_copy_hardlink_tree_count (subunit.RemotedTestCase)
2018-11-29 17:20:55,775 - oe-selftest - INFO -  ... ok
2018-11-29 17:20:55,775 - oe-selftest - INFO - 14: 1/24 9/338 (0.33s) (liboe.LibOE.test_copy_hardlink_tree_count)
2018-11-29 17:20:55,911 - oe-selftest - INFO - liboe.LibOE.test_copy_tree_special (subunit.RemotedTestCase)
2018-11-29 17:20:55,911 - oe-selftest - INFO -  ... ok
2018-11-29 17:20:55,911 - oe-selftest - INFO - 14: 2/24 10/338 (0.14s) (liboe.LibOE.test_copy_tree_special)
2018-11-29 17:22:22,079 - oe-selftest - INFO - bbtests.BitbakeTests.test_bbappend_order (subunit.RemotedTestCase)
2018-11-29 17:22:22,079 - oe-selftest - INFO -  ... ok
2018-11-29 17:22:22,079 - oe-selftest - INFO - 1: 1/76 11/338 (90.38s) (bbtests.BitbakeTests.test_bbappend_order)
2018-11-29 17:22:23,207 - oe-selftest - INFO - bblayers.BitbakeLayers.test_bitbakelayers_add_remove (subunit.RemotedTestCase)
2018-11-29 17:22:23,207 - oe-selftest - INFO -  ... ok
2018-11-29 17:22:23,207 - oe-selftest - INFO - 10: 1/20 12/338 (91.49s) (bblayers.BitbakeLayers.test_bitbakelayers_add_remove)
2018-11-29 17:22:31,291 - oe-selftest - INFO - bbtests.BitbakeTests.test_bitbake_g (subunit.RemotedTestCase)
2018-11-29 17:22:31,291 - oe-selftest - INFO -  ... ok
2018-11-29 17:22:31,292 - oe-selftest - INFO - 1: 2/76 13/338 (9.22s) (bbtests.BitbakeTests.test_bitbake_g)
2018-11-29 17:22:32,948 - oe-selftest - INFO - recipetool.RecipetoolAppendsrcTests.test_recipetool_appendsrcfile_basic (subunit.RemotedTestCase)
2018-11-29 17:22:33,163 - oe-selftest - INFO -  ... ok
2018-11-29 17:22:33,163 - oe-selftest - INFO - 8: 1/13 14/338 (77.91s) (recipetool.RecipetoolAppendsrcTests.test_recipetool_appendsrcfile_basic)
2018-11-29 17:22:33,591 - oe-selftest - INFO - bbtests.BitbakeTests.test_bitbake_invalid_recipe (subunit.RemotedTestCase)
2018-11-29 17:22:33,592 - oe-selftest - INFO -  ... ok
2018-11-29 17:22:33,592 - oe-selftest - INFO - 1: 3/76 15/338 (2.31s) (bbtests.BitbakeTests.test_bitbake_invalid_recipe)
2018-11-29 17:22:36,700 - oe-selftest - INFO - bblayers.BitbakeLayers.test_bitbakelayers_createlayer (subunit.RemotedTestCase)
2018-11-29 17:22:36,700 - oe-selftest - INFO -  ... ok
2018-11-29 17:22:36,701 - oe-selftest - INFO - 10: 2/20 16/338 (13.50s) (bblayers.BitbakeLayers.test_bitbakelayers_createlayer)
2018-11-29 17:22:40,255 - oe-selftest - INFO - bbtests.BitbakeTests.test_bitbake_invalid_target (subunit.RemotedTestCase)
2018-11-29 17:22:40,255 - oe-selftest - INFO -  ... ok
2018-11-29 17:22:40,255 - oe-selftest - INFO - 1: 4/76 17/338 (6.66s) (bbtests.BitbakeTests.test_bitbake_invalid_target)
2018-11-29 17:22:45,500 - oe-selftest - INFO - liboe.LibOE.test_copy_tree_xattr (subunit.RemotedTestCase)
2018-11-29 17:22:45,501 - oe-selftest - INFO -  ... ok
2018-11-29 17:22:45,501 - oe-selftest - INFO - 14: 3/24 18/338 (109.59s) (liboe.LibOE.test_copy_tree_xattr)
2018-11-29 17:22:59,595 - oe-selftest - INFO - buildoptions.ArchiverTest.test_arch_work_dir_and_export_source (subunit.RemotedTestCase)
2018-11-29 17:22:59,595 - oe-selftest - INFO -  ... ok
2018-11-29 17:22:59,595 - oe-selftest - INFO - 0: 1/21 19/338 (127.92s) (buildoptions.ArchiverTest.test_arch_work_dir_and_export_source)
2018-11-29 17:22:59,596 - oe-selftest - INFO - oelib.elf.TestElf.test_machine_name (subunit.RemotedTestCase)
2018-11-29 17:22:59,596 - oe-selftest - INFO -  ... ok
2018-11-29 17:22:59,596 - oe-selftest - INFO - 0: 2/21 20/338 (0.01s) (oelib.elf.TestElf.test_machine_name)
2018-11-29 17:23:05,097 - oe-selftest - INFO - bbtests.BitbakeTests.test_checkuri (subunit.RemotedTestCase)
2018-11-29 17:23:05,098 - oe-selftest - INFO -  ... ok
2018-11-29 17:23:05,098 - oe-selftest - INFO - 1: 5/76 21/338 (24.85s) (bbtests.BitbakeTests.test_checkuri)
2018-11-29 17:23:07,104 - oe-selftest - INFO - bblayers.BitbakeLayers.test_bitbakelayers_flatten (subunit.RemotedTestCase)
2018-11-29 17:23:07,104 - oe-selftest - INFO -  ... ok
2018-11-29 17:23:07,105 - oe-selftest - INFO - 10: 3/20 22/338 (30.40s) (bblayers.BitbakeLayers.test_bitbakelayers_flatten)
2018-11-29 17:23:26,378 - oe-selftest - INFO - recipetool.RecipetoolAppendsrcTests.test_recipetool_appendsrcfile_basic_wildcard (subunit.RemotedTestCase)
2018-11-29 17:23:26,378 - oe-selftest - INFO -  ... ok
2018-11-29 17:23:26,378 - oe-selftest - INFO - 8: 2/13 23/338 (53.43s) (recipetool.RecipetoolAppendsrcTests.test_recipetool_appendsrcfile_basic_wildcard)
2018-11-29 17:23:31,594 - oe-selftest - INFO - bblayers.BitbakeLayers.test_bitbakelayers_showappends (subunit.RemotedTestCase)
2018-11-29 17:23:31,595 - oe-selftest - INFO -  ... ok
2018-11-29 17:23:31,595 - oe-selftest - INFO - 10: 4/20 24/338 (24.51s) (bblayers.BitbakeLayers.test_bitbakelayers_showappends)
2018-11-29 17:23:36,169 - oe-selftest - INFO - buildoptions.ToolchainOptions.test_toolchain_fortran (subunit.RemotedTestCase)
2018-11-29 17:23:36,169 - oe-selftest - INFO -  ... ok
2018-11-29 17:23:36,170 - oe-selftest - INFO - 0: 3/21 25/338 (36.58s) (buildoptions.ToolchainOptions.test_toolchain_fortran)
2018-11-29 17:23:36,194 - oe-selftest - INFO - runcmd.RunCmdTests.test_list_not_found (subunit.RemotedTestCase)
2018-11-29 17:23:36,194 - oe-selftest - INFO -  ... ok
2018-11-29 17:23:36,195 - oe-selftest - INFO - 0: 4/21 26/338 (0.03s) (runcmd.RunCmdTests.test_list_not_found)
2018-11-29 17:23:36,574 - oe-selftest - INFO - runcmd.RunCmdTests.test_list_okay (subunit.RemotedTestCase)
2018-11-29 17:23:36,575 - oe-selftest - INFO -  ... ok
2018-11-29 17:23:36,575 - oe-selftest - INFO - 0: 5/21 27/338 (0.38s) (runcmd.RunCmdTests.test_list_okay)
2018-11-29 17:23:36,576 - oe-selftest - INFO - runcmd.RunCmdTests.test_log (subunit.RemotedTestCase)
2018-11-29 17:23:36,577 - oe-selftest - INFO -  ... ok
2018-11-29 17:23:36,577 - oe-selftest - INFO - 0: 6/21 28/338 (0.01s) (runcmd.RunCmdTests.test_log)
2018-11-29 17:23:36,597 - oe-selftest - INFO - runcmd.RunCmdTests.test_log_split (subunit.RemotedTestCase)
2018-11-29 17:23:36,597 - oe-selftest - INFO -  ... ok
2018-11-29 17:23:36,597 - oe-selftest - INFO - 0: 7/21 29/338 (0.02s) (runcmd.RunCmdTests.test_log_split)
2018-11-29 17:23:36,605 - oe-selftest - INFO - runcmd.RunCmdTests.test_no_shell (subunit.RemotedTestCase)
2018-11-29 17:23:36,605 - oe-selftest - INFO -  ... ok
2018-11-29 17:23:36,605 - oe-selftest - INFO - 0: 8/21 30/338 (0.01s) (runcmd.RunCmdTests.test_no_shell)
2018-11-29 17:23:36,615 - oe-selftest - INFO - runcmd.RunCmdTests.test_output (subunit.RemotedTestCase)
2018-11-29 17:23:36,615 - oe-selftest - INFO -  ... ok
2018-11-29 17:23:36,615 - oe-selftest - INFO - 0: 9/21 31/338 (0.01s) (runcmd.RunCmdTests.test_output)
2018-11-29 17:23:36,632 - oe-selftest - INFO - runcmd.RunCmdTests.test_output_split (subunit.RemotedTestCase)
2018-11-29 17:23:36,633 - oe-selftest - INFO -  ... ok
2018-11-29 17:23:36,633 - oe-selftest - INFO - 0: 10/21 32/338 (0.02s) (runcmd.RunCmdTests.test_output_split)
2018-11-29 17:23:36,683 - oe-selftest - INFO - runcmd.RunCmdTests.test_result_assertion (subunit.RemotedTestCase)
2018-11-29 17:23:36,683 - oe-selftest - INFO -  ... ok
2018-11-29 17:23:36,683 - oe-selftest - INFO - 0: 11/21 33/338 (0.05s) (runcmd.RunCmdTests.test_result_assertion)
2018-11-29 17:23:36,707 - oe-selftest - INFO - runcmd.RunCmdTests.test_result_exception (subunit.RemotedTestCase)
2018-11-29 17:23:36,707 - oe-selftest - INFO -  ... ok
2018-11-29 17:23:36,707 - oe-selftest - INFO - 0: 12/21 34/338 (0.03s) (runcmd.RunCmdTests.test_result_exception)
2018-11-29 17:23:36,739 - oe-selftest - INFO - runcmd.RunCmdTests.test_result_false (subunit.RemotedTestCase)
2018-11-29 17:23:36,739 - oe-selftest - INFO -  ... ok
2018-11-29 17:23:36,740 - oe-selftest - INFO - 0: 13/21 35/338 (0.04s) (runcmd.RunCmdTests.test_result_false)
2018-11-29 17:23:36,775 - oe-selftest - INFO - runcmd.RunCmdTests.test_result_okay (subunit.RemotedTestCase)
2018-11-29 17:23:36,775 - oe-selftest - INFO -  ... ok
2018-11-29 17:23:36,775 - oe-selftest - INFO - 0: 14/21 36/338 (0.04s) (runcmd.RunCmdTests.test_result_okay)
2018-11-29 17:23:36,813 - oe-selftest - INFO - runcmd.RunCmdTests.test_shell (subunit.RemotedTestCase)
2018-11-29 17:23:36,813 - oe-selftest - INFO -  ... ok
2018-11-29 17:23:36,813 - oe-selftest - INFO - 0: 15/21 37/338 (0.05s) (runcmd.RunCmdTests.test_shell)
2018-11-29 17:23:36,847 - oe-selftest - INFO - runcmd.RunCmdTests.test_stdin (subunit.RemotedTestCase)
2018-11-29 17:23:36,848 - oe-selftest - INFO -  ... FAIL
2018-11-29 17:23:36,848 - oe-selftest - INFO - 0: 16/21 38/338 (0.04s) (runcmd.RunCmdTests.test_stdin)
2018-11-29 17:23:36,848 - oe-selftest - INFO - testtools.testresult.real._StringException: Traceback (most recent call last):
  File "/home/pokybuild/yocto-worker/oe-selftest-ubuntu/build/meta/lib/oeqa/core/decorator/__init__.py", line 32, in wrapped_f
    return func(*args, **kwargs)
  File "/home/pokybuild/yocto-worker/oe-selftest-ubuntu/build/meta/lib/oeqa/selftest/cases/runcmd.py", line 110, in test_stdin
    self.assertEqual(numthreads, threading.active_count())
  File "/usr/lib/python3.5/unittest/case.py", line 820, in assertEqual
    assertion_func(first, second, msg=msg)
  File "/usr/lib/python3.5/unittest/case.py", line 813, in _baseAssertEqual
    raise self.failureException(msg)
AssertionError: 1 != 2


2018-11-29 17:23:41,899 - oe-selftest - INFO - runcmd.RunCmdTests.test_stdin_timeout (subunit.RemotedTestCase)
2018-11-29 17:23:41,899 - oe-selftest - INFO -  ... ok
2018-11-29 17:23:41,899 - oe-selftest - INFO - 0: 17/21 39/338 (5.06s) (runcmd.RunCmdTests.test_stdin_timeout)
2018-11-29 17:23:42,546 - oe-selftest - INFO - package.VersionOrdering.test_dpkg (subunit.RemotedTestCase)
2018-11-29 17:23:42,546 - oe-selftest - INFO -  ... ok
2018-11-29 17:23:42,547 - oe-selftest - INFO - 14: 4/24 40/338 (0.40s) (package.VersionOrdering.test_dpkg)
2018-11-29 17:23:42,876 - oe-selftest - INFO - package.VersionOrdering.test_opkg (subunit.RemotedTestCase)
2018-11-29 17:23:42,876 - oe-selftest - INFO -  ... ok
2018-11-29 17:23:42,876 - oe-selftest - INFO - 14: 5/24 41/338 (0.33s) (package.VersionOrdering.test_opkg)
2018-11-29 17:23:43,552 - oe-selftest - INFO - package.VersionOrdering.test_rpm (subunit.RemotedTestCase)
2018-11-29 17:23:43,552 - oe-selftest - INFO -  ... ok
2018-11-29 17:23:43,552 - oe-selftest - INFO - 14: 6/24 42/338 (0.68s) (package.VersionOrdering.test_rpm)
2018-11-29 17:23:47,631 - oe-selftest - INFO - runcmd.RunCmdTests.test_timeout (subunit.RemotedTestCase)
2018-11-29 17:23:47,632 - oe-selftest - INFO -  ... ok
2018-11-29 17:23:47,632 - oe-selftest - INFO - 0: 18/21 43/338 (5.74s) (runcmd.RunCmdTests.test_timeout)
2018-11-29 17:23:47,774 - oe-selftest - INFO - signing.LockedSignatures.test_locked_signatures (subunit.RemotedTestCase)
2018-11-29 17:23:47,774 - oe-selftest - INFO -  ... ok
2018-11-29 17:23:47,774 - oe-selftest - INFO - 7: 1/11 44/338 (176.07s) (signing.LockedSignatures.test_locked_signatures)
2018-11-29 17:23:52,466 - oe-selftest - INFO - bblayers.BitbakeLayers.test_bitbakelayers_showcrossdepends (subunit.RemotedTestCase)
2018-11-29 17:23:52,467 - oe-selftest - INFO -  ... ok
2018-11-29 17:23:52,467 - oe-selftest - INFO - 10: 5/20 45/338 (20.88s) (bblayers.BitbakeLayers.test_bitbakelayers_showcrossdepends)
2018-11-29 17:23:52,651 - oe-selftest - INFO - runcmd.RunCmdTests.test_timeout_split (subunit.RemotedTestCase)
2018-11-29 17:23:52,651 - oe-selftest - INFO -  ... ok
2018-11-29 17:23:52,651 - oe-selftest - INFO - 0: 19/21 46/338 (5.03s) (runcmd.RunCmdTests.test_timeout_split)
2018-11-29 17:23:57,455 - oe-selftest - INFO - bblayers.BitbakeLayers.test_bitbakelayers_showlayers (subunit.RemotedTestCase)
2018-11-29 17:23:57,455 - oe-selftest - INFO -  ... ok
2018-11-29 17:23:57,455 - oe-selftest - INFO - 10: 6/20 47/338 (5.00s) (bblayers.BitbakeLayers.test_bitbakelayers_showlayers)
2018-11-29 17:23:58,163 - oe-selftest - INFO - recipetool.RecipetoolAppendsrcTests.test_recipetool_appendsrcfile_existing_in_src_uri (subunit.RemotedTestCase)
2018-11-29 17:23:58,164 - oe-selftest - INFO -  ... ok
2018-11-29 17:23:58,164 - oe-selftest - INFO - 8: 3/13 48/338 (31.79s) (recipetool.RecipetoolAppendsrcTests.test_recipetool_appendsrcfile_existing_in_src_uri)
2018-11-29 17:24:09,672 - oe-selftest - INFO - bblayers.BitbakeLayers.test_bitbakelayers_showoverlayed (subunit.RemotedTestCase)
2018-11-29 17:24:09,672 - oe-selftest - INFO -  ... ok
2018-11-29 17:24:09,672 - oe-selftest - INFO - 10: 7/20 49/338 (12.22s) (bblayers.BitbakeLayers.test_bitbakelayers_showoverlayed)
2018-11-29 17:24:29,623 - oe-selftest - INFO - archiver.Archiver.test_archiver_allows_to_filter_on_recipe_name (subunit.RemotedTestCase)
2018-11-29 17:24:29,623 - oe-selftest - INFO -  ... ok
2018-11-29 17:24:29,623 - oe-selftest - INFO - 7: 2/11 50/338 (41.85s) (archiver.Archiver.test_archiver_allows_to_filter_on_recipe_name)
2018-11-29 17:24:40,501 - oe-selftest - INFO - recipetool.RecipetoolAppendsrcTests.test_recipetool_appendsrcfile_existing_in_src_uri_diff_params (subunit.RemotedTestCase)
2018-11-29 17:24:40,501 - oe-selftest - INFO -  ... ok
2018-11-29 17:24:40,501 - oe-selftest - INFO - 8: 4/13 51/338 (42.34s) (recipetool.RecipetoolAppendsrcTests.test_recipetool_appendsrcfile_existing_in_src_uri_diff_params)
2018-11-29 17:24:43,181 - oe-selftest - INFO - bblayers.BitbakeLayers.test_bitbakelayers_showrecipes (subunit.RemotedTestCase)
2018-11-29 17:24:43,181 - oe-selftest - INFO -  ... ok
2018-11-29 17:24:43,181 - oe-selftest - INFO - 10: 8/20 52/338 (33.51s) (bblayers.BitbakeLayers.test_bitbakelayers_showrecipes)
2018-11-29 17:25:06,136 - oe-selftest - INFO - archiver.Archiver.test_archiver_filters_by_type (subunit.RemotedTestCase)
2018-11-29 17:25:06,136 - oe-selftest - INFO -  ... ok
2018-11-29 17:25:06,136 - oe-selftest - INFO - 7: 3/11 53/338 (36.51s) (archiver.Archiver.test_archiver_filters_by_type)
2018-11-29 17:25:09,276 - oe-selftest - INFO - devtool.DevtoolTests.test_create_workspace (subunit.RemotedTestCase)
2018-11-29 17:25:09,276 - oe-selftest - INFO -  ... ok
2018-11-29 17:25:09,277 - oe-selftest - INFO - 10: 9/20 54/338 (20.13s) (devtool.DevtoolTests.test_create_workspace)
2018-11-29 17:25:09,917 - oe-selftest - INFO - oelib.types.TestList.test_list_nosep (subunit.RemotedTestCase)
2018-11-29 17:25:11,281 - oe-selftest - INFO -  ... ok
2018-11-29 17:25:11,281 - oe-selftest - INFO - 10: 10/20 55/338 (0.00s) (oelib.types.TestList.test_list_nosep)
2018-11-29 17:25:11,282 - oe-selftest - INFO - oelib.types.TestList.test_list_usersep (subunit.RemotedTestCase)
2018-11-29 17:25:11,282 - oe-selftest - INFO -  ... ok
2018-11-29 17:25:11,282 - oe-selftest - INFO - 10: 11/20 56/338 (1.37s) (oelib.types.TestList.test_list_usersep)
2018-11-29 17:25:44,547 - oe-selftest - INFO - archiver.Archiver.test_archiver_filters_by_type_and_name (subunit.RemotedTestCase)
2018-11-29 17:25:44,548 - oe-selftest - INFO -  ... ok
2018-11-29 17:25:44,548 - oe-selftest - INFO - 7: 4/11 57/338 (38.39s) (archiver.Archiver.test_archiver_filters_by_type_and_name)
2018-11-29 17:25:53,452 - oe-selftest - INFO - recipetool.RecipetoolAppendsrcTests.test_recipetool_appendsrcfile_replace_file_srcdir (subunit.RemotedTestCase)
2018-11-29 17:25:53,453 - oe-selftest - INFO -  ... ok
2018-11-29 17:25:53,453 - oe-selftest - INFO - 8: 5/13 58/338 (72.96s) (recipetool.RecipetoolAppendsrcTests.test_recipetool_appendsrcfile_replace_file_srcdir)
2018-11-29 17:26:30,862 - oe-selftest - INFO - recipetool.RecipetoolAppendsrcTests.test_recipetool_appendsrcfile_srcdir_basic (subunit.RemotedTestCase)
2018-11-29 17:26:30,863 - oe-selftest - INFO -  ... ok
2018-11-29 17:26:30,863 - oe-selftest - INFO - 8: 6/13 59/338 (37.41s) (recipetool.RecipetoolAppendsrcTests.test_recipetool_appendsrcfile_srcdir_basic)
2018-11-29 17:27:01,923 - oe-selftest - INFO - recipetool.RecipetoolAppendsrcTests.test_recipetool_appendsrcfile_subdir_basic (subunit.RemotedTestCase)
2018-11-29 17:27:01,923 - oe-selftest - INFO -  ... ok
2018-11-29 17:27:01,923 - oe-selftest - INFO - 8: 7/13 60/338 (31.06s) (recipetool.RecipetoolAppendsrcTests.test_recipetool_appendsrcfile_subdir_basic)
2018-11-29 17:27:35,783 - oe-selftest - INFO - recipetool.RecipetoolAppendsrcTests.test_recipetool_appendsrcfile_subdir_basic_dirdest (subunit.RemotedTestCase)
2018-11-29 17:27:35,784 - oe-selftest - INFO -  ... ok
2018-11-29 17:27:35,784 - oe-selftest - INFO - 8: 8/13 61/338 (33.87s) (recipetool.RecipetoolAppendsrcTests.test_recipetool_appendsrcfile_subdir_basic_dirdest)
2018-11-29 17:28:31,470 - oe-selftest - INFO - recipetool.RecipetoolAppendsrcTests.test_recipetool_appendsrcfiles_basic (subunit.RemotedTestCase)
2018-11-29 17:28:31,470 - oe-selftest - INFO -  ... ok
2018-11-29 17:28:31,470 - oe-selftest - INFO - 8: 9/13 62/338 (55.69s) (recipetool.RecipetoolAppendsrcTests.test_recipetool_appendsrcfiles_basic)
2018-11-29 17:29:22,738 - oe-selftest - INFO - recipetool.RecipetoolAppendsrcTests.test_recipetool_appendsrcfiles_basic_subdir (subunit.RemotedTestCase)
2018-11-29 17:29:22,738 - oe-selftest - INFO -  ... ok
2018-11-29 17:29:22,738 - oe-selftest - INFO - 8: 10/13 63/338 (51.27s) (recipetool.RecipetoolAppendsrcTests.test_recipetool_appendsrcfiles_basic_subdir)
2018-11-29 17:29:26,575 - oe-selftest - INFO - oelib.license.TestSimpleCombinations.test_tests (subunit.RemotedTestCase)
2018-11-29 17:29:26,575 - oe-selftest - INFO -  ... ok
2018-11-29 17:29:26,575 - oe-selftest - INFO - 8: 11/13 64/338 (0.01s) (oelib.license.TestSimpleCombinations.test_tests)
2018-11-29 17:30:37,983 - oe-selftest - INFO - buildoptions.DiskMonTest.test_stoptask_behavior (subunit.RemotedTestCase)
2018-11-29 17:30:37,983 - oe-selftest - INFO -  ... ok
2018-11-29 17:30:37,983 - oe-selftest - INFO - 8: 12/13 65/338 (71.41s) (buildoptions.DiskMonTest.test_stoptask_behavior)
2018-11-29 17:30:37,984 - oe-selftest - INFO - oelib.license.TestComplexCombinations.test_tests (subunit.RemotedTestCase)
2018-11-29 17:30:37,984 - oe-selftest - INFO -  ... ok
2018-11-29 17:30:37,984 - oe-selftest - INFO - 8: 13/13 66/338 (0.01s) (oelib.license.TestComplexCombinations.test_tests)
2018-11-29 17:31:23,659 - oe-selftest - INFO - archiver.Archiver.test_archiver_srpm_mode (subunit.RemotedTestCase)
2018-11-29 17:31:23,659 - oe-selftest - INFO -  ... ok
2018-11-29 17:31:23,659 - oe-selftest - INFO - 7: 5/11 67/338 (339.11s) (archiver.Archiver.test_archiver_srpm_mode)
2018-11-29 17:31:30,314 - oe-selftest - INFO - recipeutils.RecipeUtilsTests.test_patch_recipe_appends (subunit.RemotedTestCase)
2018-11-29 17:31:30,314 - oe-selftest - INFO -  ... ok
2018-11-29 17:31:30,314 - oe-selftest - INFO - 7: 6/11 68/338 (0.48s) (recipeutils.RecipeUtilsTests.test_patch_recipe_appends)
2018-11-29 17:31:30,683 - oe-selftest - INFO - recipeutils.RecipeUtilsTests.test_patch_recipe_singleappend (subunit.RemotedTestCase)
2018-11-29 17:31:30,683 - oe-selftest - INFO -  ... ok
2018-11-29 17:31:30,683 - oe-selftest - INFO - 7: 7/11 69/338 (0.36s) (recipeutils.RecipeUtilsTests.test_patch_recipe_singleappend)
2018-11-29 17:31:31,123 - oe-selftest - INFO - recipeutils.RecipeUtilsTests.test_patch_recipe_varflag (subunit.RemotedTestCase)
2018-11-29 17:31:31,123 - oe-selftest - INFO -  ... ok
2018-11-29 17:31:31,123 - oe-selftest - INFO - 7: 8/11 70/338 (0.45s) (recipeutils.RecipeUtilsTests.test_patch_recipe_varflag)
2018-11-29 17:31:31,131 - oe-selftest - INFO - recipeutils.RecipeUtilsTests.test_split_var_value (subunit.RemotedTestCase)
2018-11-29 17:31:31,131 - oe-selftest - INFO -  ... ok
2018-11-29 17:31:31,131 - oe-selftest - INFO - 7: 9/11 71/338 (0.01s) (recipeutils.RecipeUtilsTests.test_split_var_value)
2018-11-29 17:31:31,137 - oe-selftest - INFO - recipeutils.RecipeUtilsTests.test_validate_pn (subunit.RemotedTestCase)
2018-11-29 17:31:31,137 - oe-selftest - INFO -  ... ok
2018-11-29 17:31:31,137 - oe-selftest - INFO - 7: 10/11 72/338 (0.01s) (recipeutils.RecipeUtilsTests.test_validate_pn)
2018-11-29 17:31:56,639 - oe-selftest - INFO - distrodata.Distrodata.test_checkpkg (subunit.RemotedTestCase)
2018-11-29 17:31:56,639 - oe-selftest - INFO -  ... skipped 'Skip by the command line argument "distrodata.Distrodata.test_checkpkg"\n'
2018-11-29 17:31:56,640 - oe-selftest - INFO - 3: 2/8 73/338 (0.01s) (distrodata.Distrodata.test_checkpkg)
2018-11-29 17:31:56,640 - oe-selftest - INFO - Skip by the command line argument "distrodata.Distrodata.test_checkpkg"

2018-11-29 17:32:18,929 - oe-selftest - INFO - distrodata.Distrodata.test_maintainers (subunit.RemotedTestCase)
2018-11-29 17:32:18,930 - oe-selftest - INFO -  ... ok
2018-11-29 17:32:18,930 - oe-selftest - INFO - 3: 3/8 74/338 (22.30s) (distrodata.Distrodata.test_maintainers)
2018-11-29 17:33:09,111 - oe-selftest - INFO - oescripts.BuildhistoryDiffTests.test_buildhistory_diff (subunit.RemotedTestCase)
2018-11-29 17:33:09,111 - oe-selftest - INFO -  ... ok
2018-11-29 17:33:09,111 - oe-selftest - INFO - 7: 11/11 75/338 (97.97s) (oescripts.BuildhistoryDiffTests.test_buildhistory_diff)
2018-11-29 17:34:28,455 - oe-selftest - INFO - prservice.BitbakePrTests.test_import_export_override_db (subunit.RemotedTestCase)
2018-11-29 17:34:28,455 - oe-selftest - INFO -  ... ok
2018-11-29 17:34:28,455 - oe-selftest - INFO - 10: 12/20 76/338 (551.74s) (prservice.BitbakePrTests.test_import_export_override_db)
2018-11-29 17:35:22,048 - oe-selftest - INFO - devtool.DevtoolModifyTests.test_devtool_buildclean (subunit.RemotedTestCase)
2018-11-29 17:35:22,048 - oe-selftest - INFO -  ... ok
2018-11-29 17:35:22,048 - oe-selftest - INFO - 14: 7/24 77/338 (691.34s) (devtool.DevtoolModifyTests.test_devtool_buildclean)
2018-11-29 17:36:09,819 - oe-selftest - INFO - prservice.BitbakePrTests.test_import_export_replace_db (subunit.RemotedTestCase)
2018-11-29 17:36:09,819 - oe-selftest - INFO -  ... ok
2018-11-29 17:36:09,819 - oe-selftest - INFO - 10: 13/20 78/338 (101.37s) (prservice.BitbakePrTests.test_import_export_replace_db)
2018-11-29 17:37:48,089 - oe-selftest - INFO - prservice.BitbakePrTests.test_pr_service_deb_arch_dep (subunit.RemotedTestCase)
2018-11-29 17:37:48,089 - oe-selftest - INFO -  ... ok
2018-11-29 17:37:48,089 - oe-selftest - INFO - 10: 14/20 79/338 (98.28s) (prservice.BitbakePrTests.test_pr_service_deb_arch_dep)
2018-11-29 17:38:11,111 - oe-selftest - INFO - bbtests.BitbakeTests.test_continue (subunit.RemotedTestCase)
2018-11-29 17:38:11,115 - oe-selftest - INFO -  ... ok
2018-11-29 17:38:11,115 - oe-selftest - INFO - 1: 6/76 80/338 (906.02s) (bbtests.BitbakeTests.test_continue)
2018-11-29 17:38:19,207 - oe-selftest - INFO - bbtests.BitbakeTests.test_dry_run (subunit.RemotedTestCase)
2018-11-29 17:38:19,207 - oe-selftest - INFO -  ... ok
2018-11-29 17:38:19,207 - oe-selftest - INFO - 1: 7/76 81/338 (8.10s) (bbtests.BitbakeTests.test_dry_run)
2018-11-29 17:38:23,344 - oe-selftest - INFO - bbtests.BitbakeTests.test_environment (subunit.RemotedTestCase)
2018-11-29 17:38:23,344 - oe-selftest - INFO -  ... ok
2018-11-29 17:38:23,344 - oe-selftest - INFO - 1: 8/76 82/338 (4.14s) (bbtests.BitbakeTests.test_environment)
2018-11-29 17:38:38,411 - oe-selftest - INFO - bbtests.BitbakeTests.test_event_handler (subunit.RemotedTestCase)
2018-11-29 17:38:38,412 - oe-selftest - INFO -  ... ok
2018-11-29 17:38:38,420 - oe-selftest - INFO - 1: 9/76 83/338 (15.07s) (bbtests.BitbakeTests.test_event_handler)
2018-11-29 17:39:43,482 - oe-selftest - INFO - prservice.BitbakePrTests.test_pr_service_deb_arch_indep (subunit.RemotedTestCase)
2018-11-29 17:39:43,482 - oe-selftest - INFO -  ... ok
2018-11-29 17:39:43,482 - oe-selftest - INFO - 10: 15/20 84/338 (115.39s) (prservice.BitbakePrTests.test_pr_service_deb_arch_indep)
2018-11-29 17:40:47,523 - oe-selftest - INFO - bbtests.BitbakeTests.test_force_task_1 (subunit.RemotedTestCase)
2018-11-29 17:40:47,524 - oe-selftest - INFO -  ... ok
2018-11-29 17:40:47,524 - oe-selftest - INFO - 1: 10/76 85/338 (129.13s) (bbtests.BitbakeTests.test_force_task_1)
2018-11-29 17:41:07,112 - oe-selftest - INFO - prservice.BitbakePrTests.test_pr_service_ipk_arch_dep (subunit.RemotedTestCase)
2018-11-29 17:41:07,112 - oe-selftest - INFO -  ... ok
2018-11-29 17:41:07,112 - oe-selftest - INFO - 10: 16/20 86/338 (83.63s) (prservice.BitbakePrTests.test_pr_service_ipk_arch_dep)
2018-11-29 17:41:56,352 - oe-selftest - INFO - prservice.BitbakePrTests.test_pr_service_ipk_arch_indep (subunit.RemotedTestCase)
2018-11-29 17:41:56,352 - oe-selftest - INFO -  ... ok
2018-11-29 17:41:56,352 - oe-selftest - INFO - 10: 17/20 87/338 (49.24s) (prservice.BitbakePrTests.test_pr_service_ipk_arch_indep)
2018-11-29 17:42:11,303 - oe-selftest - INFO - bbtests.BitbakeTests.test_force_task_2 (subunit.RemotedTestCase)
2018-11-29 17:42:11,304 - oe-selftest - INFO -  ... ok
2018-11-29 17:42:11,304 - oe-selftest - INFO - 1: 11/76 88/338 (83.78s) (bbtests.BitbakeTests.test_force_task_2)
2018-11-29 17:43:17,955 - oe-selftest - INFO - prservice.BitbakePrTests.test_pr_service_rpm_arch_dep (subunit.RemotedTestCase)
2018-11-29 17:43:17,955 - oe-selftest - INFO -  ... ok
2018-11-29 17:43:17,955 - oe-selftest - INFO - 10: 18/20 89/338 (81.60s) (prservice.BitbakePrTests.test_pr_service_rpm_arch_dep)
2018-11-29 17:44:25,274 - oe-selftest - INFO - prservice.BitbakePrTests.test_pr_service_rpm_arch_indep (subunit.RemotedTestCase)
2018-11-29 17:44:25,275 - oe-selftest - INFO -  ... ok
2018-11-29 17:44:25,275 - oe-selftest - INFO - 10: 19/20 90/338 (67.32s) (prservice.BitbakePrTests.test_pr_service_rpm_arch_indep)
2018-11-29 17:44:28,231 - oe-selftest - INFO - prservice.BitbakePrTests.test_stopping_prservice_message (subunit.RemotedTestCase)
2018-11-29 17:44:28,231 - oe-selftest - INFO -  ... ok
2018-11-29 17:44:28,231 - oe-selftest - INFO - 10: 20/20 91/338 (2.96s) (prservice.BitbakePrTests.test_stopping_prservice_message)
2018-11-29 18:01:11,531 - oe-selftest - INFO - bbtests.BitbakeTests.test_image_manifest (subunit.RemotedTestCase)
2018-11-29 18:01:11,531 - oe-selftest - INFO -  ... ok
2018-11-29 18:01:11,531 - oe-selftest - INFO - 1: 12/76 92/338 (1140.23s) (bbtests.BitbakeTests.test_image_manifest)
2018-11-29 18:01:27,144 - oe-selftest - INFO - bbtests.BitbakeTests.test_invalid_patch (subunit.RemotedTestCase)
2018-11-29 18:01:27,144 - oe-selftest - INFO -  ... ok
2018-11-29 18:01:27,144 - oe-selftest - INFO - 1: 13/76 93/338 (15.61s) (bbtests.BitbakeTests.test_invalid_patch)
2018-11-29 18:01:43,377 - oe-selftest - INFO - bbtests.BitbakeTests.test_invalid_recipe_src_uri (subunit.RemotedTestCase)
2018-11-29 18:01:43,377 - oe-selftest - INFO -  ... ok
2018-11-29 18:01:43,377 - oe-selftest - INFO - 1: 14/76 94/338 (16.23s) (bbtests.BitbakeTests.test_invalid_recipe_src_uri)
2018-11-29 18:01:45,315 - oe-selftest - INFO - bbtests.BitbakeTests.test_just_parse (subunit.RemotedTestCase)
2018-11-29 18:01:45,315 - oe-selftest - INFO -  ... ok
2018-11-29 18:01:45,315 - oe-selftest - INFO - 1: 15/76 95/338 (1.94s) (bbtests.BitbakeTests.test_just_parse)
2018-11-29 18:01:59,377 - oe-selftest - INFO - bbtests.BitbakeTests.test_local_sstate (subunit.RemotedTestCase)
2018-11-29 18:01:59,377 - oe-selftest - INFO -  ... ok
2018-11-29 18:01:59,377 - oe-selftest - INFO - 1: 16/76 96/338 (14.06s) (bbtests.BitbakeTests.test_local_sstate)
2018-11-29 18:02:21,373 - oe-selftest - INFO - bbtests.BitbakeTests.test_non_gplv3 (subunit.RemotedTestCase)
2018-11-29 18:02:21,373 - oe-selftest - INFO -  ... ok
2018-11-29 18:02:21,373 - oe-selftest - INFO - 1: 17/76 97/338 (22.00s) (bbtests.BitbakeTests.test_non_gplv3)
2018-11-29 18:02:22,676 - oe-selftest - INFO - bbtests.BitbakeTests.test_postfile (subunit.RemotedTestCase)
2018-11-29 18:02:22,676 - oe-selftest - INFO -  ... ok
2018-11-29 18:02:22,676 - oe-selftest - INFO - 1: 18/76 98/338 (1.30s) (bbtests.BitbakeTests.test_postfile)
2018-11-29 18:02:25,150 - oe-selftest - INFO - bbtests.BitbakeTests.test_prefile (subunit.RemotedTestCase)
2018-11-29 18:02:25,151 - oe-selftest - INFO -  ... ok
2018-11-29 18:02:25,151 - oe-selftest - INFO - 1: 19/76 99/338 (2.47s) (bbtests.BitbakeTests.test_prefile)
2018-11-29 18:02:32,812 - oe-selftest - INFO - bbtests.BitbakeTests.test_rename_downloaded_file (subunit.RemotedTestCase)
2018-11-29 18:02:32,812 - oe-selftest - INFO -  ... ok
2018-11-29 18:02:32,813 - oe-selftest - INFO - 1: 20/76 100/338 (7.66s) (bbtests.BitbakeTests.test_rename_downloaded_file)
2018-11-29 18:02:33,886 - oe-selftest - INFO - bbtests.BitbakeTests.test_run_bitbake_from_dir_1 (subunit.RemotedTestCase)
2018-11-29 18:02:33,886 - oe-selftest - INFO -  ... ok
2018-11-29 18:02:33,886 - oe-selftest - INFO - 1: 21/76 101/338 (1.07s) (bbtests.BitbakeTests.test_run_bitbake_from_dir_1)
2018-11-29 18:02:34,995 - oe-selftest - INFO - bbtests.BitbakeTests.test_run_bitbake_from_dir_2 (subunit.RemotedTestCase)
2018-11-29 18:02:34,995 - oe-selftest - INFO -  ... ok
2018-11-29 18:02:34,995 - oe-selftest - INFO - 1: 22/76 102/338 (1.11s) (bbtests.BitbakeTests.test_run_bitbake_from_dir_2)
2018-11-29 18:02:36,318 - oe-selftest - INFO - bbtests.BitbakeTests.test_run_bitbake_from_dir_3 (subunit.RemotedTestCase)
2018-11-29 18:02:36,318 - oe-selftest - INFO -  ... ok
2018-11-29 18:02:36,318 - oe-selftest - INFO - 1: 23/76 103/338 (1.32s) (bbtests.BitbakeTests.test_run_bitbake_from_dir_3)
2018-11-29 18:02:49,764 - oe-selftest - INFO - bbtests.BitbakeTests.test_setscene_only (subunit.RemotedTestCase)
2018-11-29 18:02:49,764 - oe-selftest - INFO -  ... ok
2018-11-29 18:02:49,764 - oe-selftest - INFO - 1: 24/76 104/338 (13.45s) (bbtests.BitbakeTests.test_setscene_only)
2018-11-29 18:02:52,229 - oe-selftest - INFO - bbtests.BitbakeTests.test_version (subunit.RemotedTestCase)
2018-11-29 18:02:52,229 - oe-selftest - INFO -  ... ok
2018-11-29 18:02:52,229 - oe-selftest - INFO - 1: 25/76 105/338 (2.47s) (bbtests.BitbakeTests.test_version)
2018-11-29 18:02:53,952 - oe-selftest - INFO - bbtests.BitbakeTests.test_warnings_errors (subunit.RemotedTestCase)
2018-11-29 18:02:53,952 - oe-selftest - INFO -  ... ok
2018-11-29 18:02:53,952 - oe-selftest - INFO - 1: 26/76 106/338 (1.72s) (bbtests.BitbakeTests.test_warnings_errors)
2018-11-29 18:03:21,254 - oe-selftest - INFO - runqemu.RunqemuTests.test_boot_deploy (subunit.RemotedTestCase)
2018-11-29 18:03:21,255 - oe-selftest - INFO -  ... ok
2018-11-29 18:03:21,255 - oe-selftest - INFO - 4: 1/24 107/338 (2549.55s) (runqemu.RunqemuTests.test_boot_deploy)
2018-11-29 18:03:34,710 - oe-selftest - INFO - sstatetests.SStateTests.test_autorev_sstate_works (subunit.RemotedTestCase)
2018-11-29 18:03:34,711 - oe-selftest - INFO -  ... ok
2018-11-29 18:03:34,711 - oe-selftest - INFO - 1: 27/76 108/338 (40.77s) (sstatetests.SStateTests.test_autorev_sstate_works)
2018-11-29 18:03:40,360 - oe-selftest - INFO - efibootpartition.GenericEFITest.test_boot_efi (subunit.RemotedTestCase)
2018-11-29 18:03:40,361 - oe-selftest - INFO -  ... ok
2018-11-29 18:03:40,361 - oe-selftest - INFO - 13: 5/10 109/338 (2568.64s) (efibootpartition.GenericEFITest.test_boot_efi)
2018-11-29 18:03:40,361 - oe-selftest - INFO - oelib.license.TestSingleLicense.test_invalid_licenses (subunit.RemotedTestCase)
2018-11-29 18:03:40,361 - oe-selftest - INFO -  ... ok
2018-11-29 18:03:40,361 - oe-selftest - INFO - 13: 6/10 110/338 (0.00s) (oelib.license.TestSingleLicense.test_invalid_licenses)
2018-11-29 18:03:40,362 - oe-selftest - INFO - oelib.license.TestSingleLicense.test_single_licenses (subunit.RemotedTestCase)
2018-11-29 18:03:40,362 - oe-selftest - INFO -  ... ok
2018-11-29 18:03:40,362 - oe-selftest - INFO - 13: 7/10 111/338 (0.00s) (oelib.license.TestSingleLicense.test_single_licenses)
2018-11-29 18:04:00,795 - oe-selftest - INFO - sstatetests.SStateTests.test_cleansstate_task_distro_nonspecific (subunit.RemotedTestCase)
2018-11-29 18:04:00,796 - oe-selftest - INFO -  ... ok
2018-11-29 18:04:00,796 - oe-selftest - INFO - 1: 28/76 112/338 (26.09s) (sstatetests.SStateTests.test_cleansstate_task_distro_nonspecific)
2018-11-29 18:04:06,364 - oe-selftest - INFO - gdbtest /usr/bin/hello1
2018-11-29 18:04:07,060 - oe-selftest - INFO - gdbtest /usr/bin/hello2
2018-11-29 18:04:07,364 - oe-selftest - INFO - gdbtest /usr/libexec/hello3
2018-11-29 18:04:07,658 - oe-selftest - INFO - gdbtest /usr/libexec/hello4
2018-11-29 18:04:08,991 - oe-selftest - INFO - package.PackageTests.test_gdb_hardlink_debug (subunit.RemotedTestCase)
2018-11-29 18:04:08,991 - oe-selftest - INFO -  ... ok
2018-11-29 18:04:08,991 - oe-selftest - INFO - 11: 1/8 113/338 (2597.31s) (package.PackageTests.test_gdb_hardlink_debug)
2018-11-29 18:04:24,885 - oe-selftest - INFO - wic.Wic.test_bootloader_config (subunit.RemotedTestCase)
2018-11-29 18:04:24,886 - oe-selftest - INFO -  ... ok
2018-11-29 18:04:24,886 - oe-selftest - INFO - 12: 2/69 114/338 (2613.16s) (wic.Wic.test_bootloader_config)
2018-11-29 18:04:29,759 - oe-selftest - INFO - runqemu.RunqemuTests.test_boot_deploy_hddimg (subunit.RemotedTestCase)
2018-11-29 18:04:29,759 - oe-selftest - INFO -  ... ok
2018-11-29 18:04:29,759 - oe-selftest - INFO - 4: 2/24 115/338 (68.50s) (runqemu.RunqemuTests.test_boot_deploy_hddimg)
2018-11-29 18:04:29,790 - oe-selftest - INFO - sstatetests.SStateTests.test_cleansstate_task_distro_specific (subunit.RemotedTestCase)
2018-11-29 18:04:29,790 - oe-selftest - INFO -  ... ok
2018-11-29 18:04:29,790 - oe-selftest - INFO - 1: 29/76 116/338 (29.00s) (sstatetests.SStateTests.test_cleansstate_task_distro_specific)
2018-11-29 18:04:44,284 - oe-selftest - INFO - package.PackageTests.test_preserve_sparse_hardlinks (subunit.RemotedTestCase)
2018-11-29 18:04:44,285 - oe-selftest - INFO -  ... ok
2018-11-29 18:04:44,285 - oe-selftest - INFO - 11: 2/8 117/338 (35.30s) (package.PackageTests.test_preserve_sparse_hardlinks)
2018-11-29 18:04:48,535 - oe-selftest - INFO - wic.Wic.test_build_artifacts (subunit.RemotedTestCase)
2018-11-29 18:04:48,535 - oe-selftest - INFO -  ... ok
2018-11-29 18:04:48,536 - oe-selftest - INFO - 12: 3/69 118/338 (23.65s) (wic.Wic.test_build_artifacts)
2018-11-29 18:04:54,257 - oe-selftest - INFO - meta_ide.MetaIDE.test_meta_ide_can_build_cpio_project (subunit.RemotedTestCase)
2018-11-29 18:04:54,257 - oe-selftest - INFO -  ... ok
2018-11-29 18:04:54,258 - oe-selftest - INFO - 13: 8/10 119/338 (53.67s) (meta_ide.MetaIDE.test_meta_ide_can_build_cpio_project)
2018-11-29 18:04:54,475 - oe-selftest - INFO - meta_ide.MetaIDE.test_meta_ide_can_compile_c_program (subunit.RemotedTestCase)
2018-11-29 18:04:54,475 - oe-selftest - INFO -  ... ok
2018-11-29 18:04:54,475 - oe-selftest - INFO - 13: 9/10 120/338 (0.22s) (meta_ide.MetaIDE.test_meta_ide_can_compile_c_program)
2018-11-29 18:04:54,476 - oe-selftest - INFO - meta_ide.MetaIDE.test_meta_ide_had_installed_meta_ide_support (subunit.RemotedTestCase)
2018-11-29 18:04:54,476 - oe-selftest - INFO -  ... ok
2018-11-29 18:04:54,476 - oe-selftest - INFO - 13: 10/10 121/338 (0.01s) (meta_ide.MetaIDE.test_meta_ide_had_installed_meta_ide_support)
2018-11-29 18:04:56,515 - oe-selftest - INFO - sstatetests.SStateTests.test_cleansstate_task_distro_specific_nonspecific (subunit.RemotedTestCase)
2018-11-29 18:04:56,515 - oe-selftest - INFO -  ... ok
2018-11-29 18:04:56,515 - oe-selftest - INFO - 1: 30/76 122/338 (26.73s) (sstatetests.SStateTests.test_cleansstate_task_distro_specific_nonspecific)
2018-11-29 18:05:04,554 - oe-selftest - INFO - imagefeatures.ImageFeatures.test_all_users_can_connect_via_ssh_without_password (subunit.RemotedTestCase)
2018-11-29 18:05:04,554 - oe-selftest - INFO -  ... ok
2018-11-29 18:05:04,554 - oe-selftest - INFO - 9: 2/25 123/338 (2652.78s) (imagefeatures.ImageFeatures.test_all_users_can_connect_via_ssh_without_password)
2018-11-29 18:05:05,406 - oe-selftest - INFO - runqemu.RunqemuTests.test_boot_machine (subunit.RemotedTestCase)
2018-11-29 18:05:05,407 - oe-selftest - INFO -  ... ok
2018-11-29 18:05:05,407 - oe-selftest - INFO - 4: 3/24 124/338 (35.65s) (runqemu.RunqemuTests.test_boot_machine)
2018-11-29 18:05:06,711 - oe-selftest - INFO - wic.Wic.test_build_image_name (subunit.RemotedTestCase)
2018-11-29 18:05:06,711 - oe-selftest - INFO -  ... ok
2018-11-29 18:05:06,711 - oe-selftest - INFO - 12: 4/69 125/338 (18.18s) (wic.Wic.test_build_image_name)
2018-11-29 18:05:26,268 - oe-selftest - INFO - sstatetests.SStateTests.test_rebuild_distro_specific_sstate_cross_native_targets (subunit.RemotedTestCase)
2018-11-29 18:05:26,268 - oe-selftest - INFO -  ... ok
2018-11-29 18:05:26,268 - oe-selftest - INFO - 1: 31/76 126/338 (29.76s) (sstatetests.SStateTests.test_rebuild_distro_specific_sstate_cross_native_targets)
2018-11-29 18:05:38,299 - oe-selftest - INFO - runqemu.RunqemuTests.test_boot_machine_ext4 (subunit.RemotedTestCase)
2018-11-29 18:05:38,300 - oe-selftest - INFO -  ... ok
2018-11-29 18:05:38,300 - oe-selftest - INFO - 4: 4/24 127/338 (32.89s) (runqemu.RunqemuTests.test_boot_machine_ext4)
2018-11-29 18:05:39,882 - oe-selftest - INFO - devtool.DevtoolModifyTests.test_devtool_modify (subunit.RemotedTestCase)
2018-11-29 18:05:39,882 - oe-selftest - INFO -  ... ok
2018-11-29 18:05:39,882 - oe-selftest - INFO - 14: 8/24 128/338 (1817.84s) (devtool.DevtoolModifyTests.test_devtool_modify)
2018-11-29 18:05:48,345 - oe-selftest - INFO - sstatetests.SStateTests.test_rebuild_distro_specific_sstate_cross_target (subunit.RemotedTestCase)
2018-11-29 18:05:48,345 - oe-selftest - INFO -  ... ok
2018-11-29 18:05:48,345 - oe-selftest - INFO - 1: 32/76 129/338 (22.08s) (sstatetests.SStateTests.test_rebuild_distro_specific_sstate_cross_target)
2018-11-29 18:05:52,642 - oe-selftest - INFO - imagefeatures.ImageFeatures.test_bmap (subunit.RemotedTestCase)
2018-11-29 18:05:52,642 - oe-selftest - INFO -  ... ok
2018-11-29 18:05:52,642 - oe-selftest - INFO - 9: 3/25 130/338 (48.09s) (imagefeatures.ImageFeatures.test_bmap)
2018-11-29 18:06:02,658 - oe-selftest - INFO - buildoptions.ImageOptionsTests.test_ccache_tool (subunit.RemotedTestCase)
2018-11-29 18:06:02,658 - oe-selftest - INFO -  ... ok
2018-11-29 18:06:02,658 - oe-selftest - INFO - 11: 3/8 131/338 (78.37s) (buildoptions.ImageOptionsTests.test_ccache_tool)
2018-11-29 18:06:09,084 - oe-selftest - INFO - runtime_test.Postinst.test_failing_postinst (subunit.RemotedTestCase)
2018-11-29 18:06:09,084 - oe-selftest - INFO -  ... ok
2018-11-29 18:06:09,084 - oe-selftest - INFO - 5: 1/14 132/338 (2717.36s) (runtime_test.Postinst.test_failing_postinst)
2018-11-29 18:06:12,642 - oe-selftest - INFO - sstatetests.SStateTests.test_rebuild_distro_specific_sstate_native_target (subunit.RemotedTestCase)
2018-11-29 18:06:12,642 - oe-selftest - INFO -  ... ok
2018-11-29 18:06:12,642 - oe-selftest - INFO - 1: 33/76 133/338 (24.30s) (sstatetests.SStateTests.test_rebuild_distro_specific_sstate_native_target)
2018-11-29 18:06:17,953 - oe-selftest - INFO - wic.Wic.test_build_rootfs_long (subunit.RemotedTestCase)
2018-11-29 18:06:17,953 - oe-selftest - INFO -  ... ok
2018-11-29 18:06:17,953 - oe-selftest - INFO - 12: 5/69 134/338 (71.25s) (wic.Wic.test_build_rootfs_long)
2018-11-29 18:06:37,778 - oe-selftest - INFO - devtool.DevtoolModifyTests.test_devtool_modify_git (subunit.RemotedTestCase)
2018-11-29 18:06:37,778 - oe-selftest - INFO -  ... ok
2018-11-29 18:06:37,778 - oe-selftest - INFO - 14: 9/24 135/338 (57.90s) (devtool.DevtoolModifyTests.test_devtool_modify_git)
2018-11-29 18:06:42,233 - oe-selftest - INFO - systemd_boot.Systemdboot.test_efi_systemdboot_images_can_be_built (subunit.RemotedTestCase)
2018-11-29 18:06:42,233 - oe-selftest - INFO -  ... ok
2018-11-29 18:06:42,234 - oe-selftest - INFO - 2: 2/9 136/338 (2750.49s) (systemd_boot.Systemdboot.test_efi_systemdboot_images_can_be_built)
2018-11-29 18:06:50,639 - oe-selftest - INFO - runqemu.RunqemuTests.test_boot_machine_iso (subunit.RemotedTestCase)
2018-11-29 18:06:50,639 - oe-selftest - INFO -  ... ok
2018-11-29 18:06:50,639 - oe-selftest - INFO - 4: 5/24 137/338 (72.34s) (runqemu.RunqemuTests.test_boot_machine_iso)
2018-11-29 18:06:51,179 - oe-selftest - INFO - wic.Wic.test_build_rootfs_short (subunit.RemotedTestCase)
2018-11-29 18:06:51,179 - oe-selftest - INFO -  ... ok
2018-11-29 18:06:51,179 - oe-selftest - INFO - 12: 6/69 138/338 (33.23s) (wic.Wic.test_build_rootfs_short)
2018-11-29 18:07:16,078 - oe-selftest - INFO - sstatetests.SStateTests.test_sstate_32_64_same_hash (subunit.RemotedTestCase)
2018-11-29 18:07:16,078 - oe-selftest - INFO -  ... ok
2018-11-29 18:07:16,078 - oe-selftest - INFO - 1: 34/76 139/338 (63.44s) (sstatetests.SStateTests.test_sstate_32_64_same_hash)
2018-11-29 18:07:24,277 - oe-selftest - INFO - wic.Wic.test_compress_bzip2 (subunit.RemotedTestCase)
2018-11-29 18:07:24,277 - oe-selftest - INFO -  ... ok
2018-11-29 18:07:24,277 - oe-selftest - INFO - 12: 7/69 140/338 (33.10s) (wic.Wic.test_compress_bzip2)
2018-11-29 18:07:39,568 - oe-selftest - INFO - runqemu.RunqemuTests.test_boot_machine_slirp (subunit.RemotedTestCase)
2018-11-29 18:07:39,569 - oe-selftest - INFO -  ... ok
2018-11-29 18:07:39,569 - oe-selftest - INFO - 4: 6/24 141/338 (48.94s) (runqemu.RunqemuTests.test_boot_machine_slirp)
2018-11-29 18:08:13,571 - oe-selftest - INFO - buildoptions.SourceMirroring.test_yocto_source_mirror (subunit.RemotedTestCase)
2018-11-29 18:08:13,571 - oe-selftest - INFO -  ... ok
2018-11-29 18:08:13,571 - oe-selftest - INFO - 2: 3/9 142/338 (91.34s) (buildoptions.SourceMirroring.test_yocto_source_mirror)
2018-11-29 18:08:25,155 - oe-selftest - INFO - sstatetests.SStateTests.test_sstate_allarch_samesigs (subunit.RemotedTestCase)
2018-11-29 18:08:25,155 - oe-selftest - INFO -  ... ok
2018-11-29 18:08:25,156 - oe-selftest - INFO - 1: 35/76 143/338 (69.08s) (sstatetests.SStateTests.test_sstate_allarch_samesigs)
2018-11-29 18:08:35,981 - oe-selftest - INFO - devtool.DevtoolModifyTests.test_devtool_modify_invalid (subunit.RemotedTestCase)
2018-11-29 18:08:35,982 - oe-selftest - INFO -  ... ok
2018-11-29 18:08:35,982 - oe-selftest - INFO - 14: 10/24 144/338 (118.20s) (devtool.DevtoolModifyTests.test_devtool_modify_invalid)
2018-11-29 18:08:41,480 - oe-selftest - INFO - fetch.Fetch.test_git_mirrors (subunit.RemotedTestCase)
2018-11-29 18:08:41,480 - oe-selftest - INFO -  ... ok
2018-11-29 18:08:41,480 - oe-selftest - INFO - 2: 4/9 145/338 (27.91s) (fetch.Fetch.test_git_mirrors)
2018-11-29 18:08:45,173 - oe-selftest - INFO - wic.Wic.test_compress_gzip (subunit.RemotedTestCase)
2018-11-29 18:08:45,173 - oe-selftest - INFO -  ... ok
2018-11-29 18:08:45,173 - oe-selftest - INFO - 12: 8/69 146/338 (80.90s) (wic.Wic.test_compress_gzip)
2018-11-29 18:08:46,862 - oe-selftest - INFO - runqemu.RunqemuTests.test_boot_machine_slirp_qcow2 (subunit.RemotedTestCase)
2018-11-29 18:08:46,863 - oe-selftest - INFO -  ... ok
2018-11-29 18:08:46,863 - oe-selftest - INFO - 4: 7/24 147/338 (67.30s) (runqemu.RunqemuTests.test_boot_machine_slirp_qcow2)
2018-11-29 18:09:18,505 - oe-selftest - INFO - buildoptions.ImageOptionsTests.test_incremental_image_generation (subunit.RemotedTestCase)
2018-11-29 18:09:18,506 - oe-selftest - INFO -  ... ok
2018-11-29 18:09:18,506 - oe-selftest - INFO - 11: 4/8 148/338 (195.85s) (buildoptions.ImageOptionsTests.test_incremental_image_generation)
2018-11-29 18:09:19,122 - oe-selftest - INFO - wic.Wic.test_compress_xz (subunit.RemotedTestCase)
2018-11-29 18:09:19,122 - oe-selftest - INFO -  ... ok
2018-11-29 18:09:19,122 - oe-selftest - INFO - 12: 9/69 149/338 (33.95s) (wic.Wic.test_compress_xz)
2018-11-29 18:09:19,687 - oe-selftest - INFO - wic.Wic.test_createhelp (subunit.RemotedTestCase)
2018-11-29 18:09:19,687 - oe-selftest - INFO -  ... ok
2018-11-29 18:09:19,688 - oe-selftest - INFO - 12: 10/69 150/338 (0.57s) (wic.Wic.test_createhelp)
2018-11-29 18:09:27,601 - oe-selftest - INFO - sstatetests.SStateTests.test_sstate_cache_management_script_using_machine (subunit.RemotedTestCase)
2018-11-29 18:09:27,602 - oe-selftest - INFO -  ... ok
2018-11-29 18:09:27,602 - oe-selftest - INFO - 1: 36/76 151/338 (62.45s) (sstatetests.SStateTests.test_sstate_cache_management_script_using_machine)
2018-11-29 18:09:34,511 - oe-selftest - INFO - runqemu.RunqemuTests.test_boot_qemu_boot (subunit.RemotedTestCase)
2018-11-29 18:09:34,511 - oe-selftest - INFO -  ... ok
2018-11-29 18:09:34,512 - oe-selftest - INFO - 4: 8/24 152/338 (47.65s) (runqemu.RunqemuTests.test_boot_qemu_boot)
2018-11-29 18:09:41,664 - oe-selftest - INFO - wic.Wic.test_debug_long (subunit.RemotedTestCase)
2018-11-29 18:09:41,664 - oe-selftest - INFO -  ... ok
2018-11-29 18:09:41,665 - oe-selftest - INFO - 12: 11/69 153/338 (21.98s) (wic.Wic.test_debug_long)
2018-11-29 18:10:12,773 - oe-selftest - INFO - wic.Wic.test_debug_short (subunit.RemotedTestCase)
2018-11-29 18:10:12,774 - oe-selftest - INFO -  ... ok
2018-11-29 18:10:12,774 - oe-selftest - INFO - 12: 12/69 154/338 (31.12s) (wic.Wic.test_debug_short)
2018-11-29 18:10:13,891 - oe-selftest - INFO - runqemu.RunqemuTests.test_boot_recipe_image (subunit.RemotedTestCase)
2018-11-29 18:10:13,891 - oe-selftest - INFO -  ... ok
2018-11-29 18:10:13,891 - oe-selftest - INFO - 4: 9/24 155/338 (39.39s) (runqemu.RunqemuTests.test_boot_recipe_image)
2018-11-29 18:11:04,242 - oe-selftest - INFO - devtool.DevtoolModifyTests.test_devtool_modify_localfiles (subunit.RemotedTestCase)
2018-11-29 18:11:04,242 - oe-selftest - INFO -  ... ok
2018-11-29 18:11:04,242 - oe-selftest - INFO - 14: 11/24 156/338 (148.26s) (devtool.DevtoolModifyTests.test_devtool_modify_localfiles)
2018-11-29 18:11:06,267 - oe-selftest - INFO - runqemu.RunqemuTests.test_boot_recipe_image_vdi (subunit.RemotedTestCase)
2018-11-29 18:11:06,268 - oe-selftest - INFO -  ... ok
2018-11-29 18:11:06,268 - oe-selftest - INFO - 4: 10/24 157/338 (52.39s) (runqemu.RunqemuTests.test_boot_recipe_image_vdi)
2018-11-29 18:11:33,020 - oe-selftest - INFO - sstatetests.SStateTests.test_sstate_cache_management_script_using_pr_1 (subunit.RemotedTestCase)
2018-11-29 18:11:33,020 - oe-selftest - INFO -  ... ok
2018-11-29 18:11:33,020 - oe-selftest - INFO - 1: 37/76 158/338 (125.42s) (sstatetests.SStateTests.test_sstate_cache_management_script_using_pr_1)
2018-11-29 18:11:46,938 - oe-selftest - INFO - runqemu.RunqemuTests.test_boot_recipe_image_vmdk (subunit.RemotedTestCase)
2018-11-29 18:11:46,939 - oe-selftest - INFO -  ... ok
2018-11-29 18:11:46,939 - oe-selftest - INFO - 4: 11/24 159/338 (40.68s) (runqemu.RunqemuTests.test_boot_recipe_image_vmdk)
2018-11-29 18:12:00,779 - oe-selftest - INFO - wic.Wic.test_default_output_dir (subunit.RemotedTestCase)
2018-11-29 18:12:00,779 - oe-selftest - INFO -  ... ok
2018-11-29 18:12:00,779 - oe-selftest - INFO - 12: 13/69 160/338 (108.01s) (wic.Wic.test_default_output_dir)
2018-11-29 18:12:18,857 - oe-selftest - INFO - runqemu.RunqemuTests.test_boot_rootfs (subunit.RemotedTestCase)
2018-11-29 18:12:18,857 - oe-selftest - INFO -  ... ok
2018-11-29 18:12:18,858 - oe-selftest - INFO - 4: 12/24 161/338 (31.92s) (runqemu.RunqemuTests.test_boot_rootfs)
2018-11-29 18:12:19,237 - oe-selftest - INFO - devtool.DevtoolExtractTests.test_devtool_build_image (subunit.RemotedTestCase)
2018-11-29 18:12:19,237 - oe-selftest - INFO -  ... ok
2018-11-29 18:12:19,237 - oe-selftest - INFO - 2: 5/9 162/338 (209.38s) (devtool.DevtoolExtractTests.test_devtool_build_image)
2018-11-29 18:12:39,294 - oe-selftest - INFO - wic.Wic.test_exclude_path (subunit.RemotedTestCase)
2018-11-29 18:12:39,294 - oe-selftest - INFO -  ... ok
2018-11-29 18:12:39,294 - oe-selftest - INFO - 12: 14/69 163/338 (38.52s) (wic.Wic.test_exclude_path)
2018-11-29 18:12:50,803 - oe-selftest - INFO - layerappend.LayerAppendTests.test_layer_appends (subunit.RemotedTestCase)
2018-11-29 18:12:50,803 - oe-selftest - INFO -  ... ok
2018-11-29 18:12:50,803 - oe-selftest - INFO - 4: 13/24 164/338 (31.95s) (layerappend.LayerAppendTests.test_layer_appends)
2018-11-29 18:12:52,238 - oe-selftest - INFO - runtime_test.TestImage.test_testimage_dnf (subunit.RemotedTestCase)
2018-11-29 18:12:52,239 - oe-selftest - INFO -  ... ok
2018-11-29 18:12:52,239 - oe-selftest - INFO - 0: 20/21 165/338 (2939.59s) (runtime_test.TestImage.test_testimage_dnf)
2018-11-29 18:13:18,584 - oe-selftest - INFO - wic.Wic.test_exclude_path_errors (subunit.RemotedTestCase)
2018-11-29 18:13:18,585 - oe-selftest - INFO -  ... ok
2018-11-29 18:13:18,585 - oe-selftest - INFO - 12: 15/69 166/338 (39.29s) (wic.Wic.test_exclude_path_errors)
2018-11-29 18:13:30,459 - oe-selftest - INFO - devtool.DevtoolUpgradeTests.test_devtool_finish_modify_origlayer (subunit.RemotedTestCase)
2018-11-29 18:13:30,459 - oe-selftest - INFO -  ... ok
2018-11-29 18:13:30,459 - oe-selftest - INFO - 4: 14/24 167/338 (36.16s) (devtool.DevtoolUpgradeTests.test_devtool_finish_modify_origlayer)
2018-11-29 18:13:39,583 - oe-selftest - INFO - wic.Wic.test_gpt_image (subunit.RemotedTestCase)
2018-11-29 18:13:39,583 - oe-selftest - INFO -  ... ok
2018-11-29 18:13:39,583 - oe-selftest - INFO - 12: 16/69 168/338 (21.00s) (wic.Wic.test_gpt_image)
2018-11-29 18:13:40,307 - oe-selftest - INFO - wic.Wic.test_help (subunit.RemotedTestCase)
2018-11-29 18:13:40,307 - oe-selftest - INFO -  ... ok
2018-11-29 18:13:40,307 - oe-selftest - INFO - 12: 17/69 169/338 (0.72s) (wic.Wic.test_help)
2018-11-29 18:13:40,677 - oe-selftest - INFO - wic.Wic.test_help_create (subunit.RemotedTestCase)
2018-11-29 18:13:40,677 - oe-selftest - INFO -  ... ok
2018-11-29 18:13:40,677 - oe-selftest - INFO - 12: 18/69 170/338 (0.37s) (wic.Wic.test_help_create)
2018-11-29 18:13:41,034 - oe-selftest - INFO - wic.Wic.test_help_kickstart (subunit.RemotedTestCase)
2018-11-29 18:13:41,034 - oe-selftest - INFO -  ... ok
2018-11-29 18:13:41,034 - oe-selftest - INFO - 12: 19/69 171/338 (0.36s) (wic.Wic.test_help_kickstart)
2018-11-29 18:13:41,378 - oe-selftest - INFO - wic.Wic.test_help_list (subunit.RemotedTestCase)
2018-11-29 18:13:41,379 - oe-selftest - INFO -  ... ok
2018-11-29 18:13:41,379 - oe-selftest - INFO - 12: 20/69 172/338 (0.34s) (wic.Wic.test_help_list)
2018-11-29 18:13:41,703 - oe-selftest - INFO - wic.Wic.test_help_overview (subunit.RemotedTestCase)
2018-11-29 18:13:41,703 - oe-selftest - INFO -  ... ok
2018-11-29 18:13:41,703 - oe-selftest - INFO - 12: 21/69 173/338 (0.32s) (wic.Wic.test_help_overview)
2018-11-29 18:13:42,030 - oe-selftest - INFO - wic.Wic.test_help_plugins (subunit.RemotedTestCase)
2018-11-29 18:13:42,030 - oe-selftest - INFO -  ... ok
2018-11-29 18:13:42,030 - oe-selftest - INFO - 12: 22/69 174/338 (0.33s) (wic.Wic.test_help_plugins)
2018-11-29 18:13:57,685 - oe-selftest - INFO - devtool.DevtoolUpgradeTests.test_devtool_finish_modify_otherlayer (subunit.RemotedTestCase)
2018-11-29 18:13:57,685 - oe-selftest - INFO -  ... ok
2018-11-29 18:13:57,686 - oe-selftest - INFO - 4: 15/24 175/338 (27.23s) (devtool.DevtoolUpgradeTests.test_devtool_finish_modify_otherlayer)
2018-11-29 18:14:21,314 - oe-selftest - INFO - devtool.DevtoolUpgradeTests.test_devtool_finish_upgrade_origlayer (subunit.RemotedTestCase)
2018-11-29 18:14:21,314 - oe-selftest - INFO -  ... ok
2018-11-29 18:14:21,315 - oe-selftest - INFO - 4: 16/24 176/338 (23.63s) (devtool.DevtoolUpgradeTests.test_devtool_finish_upgrade_origlayer)
2018-11-29 18:14:30,298 - oe-selftest - INFO - sstatetests.SStateTests.test_sstate_cache_management_script_using_pr_2 (subunit.RemotedTestCase)
2018-11-29 18:14:30,299 - oe-selftest - INFO -  ... ok
2018-11-29 18:14:30,299 - oe-selftest - INFO - 1: 38/76 177/338 (177.28s) (sstatetests.SStateTests.test_sstate_cache_management_script_using_pr_2)
2018-11-29 18:14:34,126 - oe-selftest - INFO - devtool.DevtoolModifyTests.test_devtool_modify_native (subunit.RemotedTestCase)
2018-11-29 18:14:34,127 - oe-selftest - INFO -  ... ok
2018-11-29 18:14:34,127 - oe-selftest - INFO - 14: 12/24 178/338 (209.89s) (devtool.DevtoolModifyTests.test_devtool_modify_native)
2018-11-29 18:14:43,841 - oe-selftest - INFO - devtool.DevtoolModifyTests.test_devtool_modify_virtual (subunit.RemotedTestCase)
2018-11-29 18:14:43,842 - oe-selftest - INFO -  ... ok
2018-11-29 18:14:43,842 - oe-selftest - INFO - 14: 13/24 179/338 (9.71s) (devtool.DevtoolModifyTests.test_devtool_modify_virtual)
2018-11-29 18:14:44,495 - oe-selftest - INFO - devtool.DevtoolUpgradeTests.test_devtool_finish_upgrade_otherlayer (subunit.RemotedTestCase)
2018-11-29 18:14:44,495 - oe-selftest - INFO -  ... ok
2018-11-29 18:14:44,495 - oe-selftest - INFO - 4: 17/24 180/338 (23.18s) (devtool.DevtoolUpgradeTests.test_devtool_finish_upgrade_otherlayer)
NOTE: Starting bitbake server...
2018-11-29 18:14:45,006 - oe-selftest - INFO - tinfoil.TinfoilTests.test_datastore_operations (subunit.RemotedTestCase)
2018-11-29 18:14:45,006 - oe-selftest - INFO -  ... ok
2018-11-29 18:14:45,006 - oe-selftest - INFO - 14: 14/24 181/338 (0.41s) (tinfoil.TinfoilTests.test_datastore_operations)
NOTE: Starting bitbake server...
2018-11-29 18:14:45,252 - oe-selftest - INFO - tinfoil.TinfoilTests.test_expand (subunit.RemotedTestCase)
2018-11-29 18:14:45,252 - oe-selftest - INFO -  ... ok
2018-11-29 18:14:45,252 - oe-selftest - INFO - 14: 15/24 182/338 (0.25s) (tinfoil.TinfoilTests.test_expand)
NOTE: Starting bitbake server...
2018-11-29 18:14:45,530 - oe-selftest - INFO - tinfoil.TinfoilTests.test_getvar (subunit.RemotedTestCase)
2018-11-29 18:14:45,530 - oe-selftest - INFO -  ... ok
2018-11-29 18:14:45,530 - oe-selftest - INFO - 14: 16/24 183/338 (0.28s) (tinfoil.TinfoilTests.test_getvar)
NOTE: Starting bitbake server...
2018-11-29 18:14:45,778 - oe-selftest - INFO - tinfoil.TinfoilTests.test_getvar_bb_origenv (subunit.RemotedTestCase)
2018-11-29 18:14:45,778 - oe-selftest - INFO -  ... ok
2018-11-29 18:14:45,778 - oe-selftest - INFO - 14: 17/24 184/338 (0.25s) (tinfoil.TinfoilTests.test_getvar_bb_origenv)
2018-11-29 18:14:45,872 - oe-selftest - INFO - devtool.DevtoolUpgradeTests.test_devtool_layer_plugins (subunit.RemotedTestCase)
2018-11-29 18:14:45,872 - oe-selftest - INFO -  ... ok
2018-11-29 18:14:45,872 - oe-selftest - INFO - 4: 18/24 185/338 (1.38s) (devtool.DevtoolUpgradeTests.test_devtool_layer_plugins)
2018-11-29 18:14:47,282 - oe-selftest - INFO - tinfoil.TinfoilTests.test_list_recipes (subunit.RemotedTestCase)
2018-11-29 18:14:47,282 - oe-selftest - INFO -  ... ok
2018-11-29 18:14:47,282 - oe-selftest - INFO - 14: 18/24 186/338 (1.50s) (tinfoil.TinfoilTests.test_list_recipes)
2018-11-29 18:14:48,823 - oe-selftest - INFO - tinfoil.TinfoilTests.test_parse_recipe (subunit.RemotedTestCase)
2018-11-29 18:14:48,823 - oe-selftest - INFO -  ... ok
2018-11-29 18:14:48,823 - oe-selftest - INFO - 14: 19/24 187/338 (1.54s) (tinfoil.TinfoilTests.test_parse_recipe)
2018-11-29 18:14:50,154 - oe-selftest - INFO - tinfoil.TinfoilTests.test_parse_recipe_copy_expand (subunit.RemotedTestCase)
2018-11-29 18:14:50,154 - oe-selftest - INFO -  ... ok
2018-11-29 18:14:50,154 - oe-selftest - INFO - 14: 20/24 188/338 (1.33s) (tinfoil.TinfoilTests.test_parse_recipe_copy_expand)
2018-11-29 18:14:51,583 - oe-selftest - INFO - tinfoil.TinfoilTests.test_parse_recipe_initial_datastore (subunit.RemotedTestCase)
2018-11-29 18:14:51,583 - oe-selftest - INFO -  ... ok
2018-11-29 18:14:51,583 - oe-selftest - INFO - 14: 21/24 189/338 (1.43s) (tinfoil.TinfoilTests.test_parse_recipe_initial_datastore)
NOTE: Reconnecting to bitbake server...
NOTE: Retrying server connection...
NOTE: Starting bitbake server...
NOTE: Reconnecting to bitbake server...
NOTE: Retrying server connection...
NOTE: Starting bitbake server...
NOTE: Reconnecting to bitbake server...
NOTE: Retrying server connection...
NOTE: Starting bitbake server...
2018-11-29 18:14:52,619 - oe-selftest - INFO - tinfoil.TinfoilTests.test_setvariable_clean (subunit.RemotedTestCase)
2018-11-29 18:14:52,619 - oe-selftest - INFO -  ... ok
2018-11-29 18:14:52,619 - oe-selftest - INFO - 14: 22/24 190/338 (1.04s) (tinfoil.TinfoilTests.test_setvariable_clean)
2018-11-29 18:14:54,057 - oe-selftest - INFO - tinfoil.TinfoilTests.test_variable_history (subunit.RemotedTestCase)
2018-11-29 18:14:54,057 - oe-selftest - INFO -  ... ok
2018-11-29 18:14:54,058 - oe-selftest - INFO - 14: 23/24 191/338 (1.44s) (tinfoil.TinfoilTests.test_variable_history)
NOTE: Starting bitbake server...
2018-11-29 18:14:54,386 - oe-selftest - INFO - devtool.DevtoolUpgradeTests.test_devtool_load_plugin (subunit.RemotedTestCase)
2018-11-29 18:14:54,386 - oe-selftest - INFO -  ... ok
2018-11-29 18:14:54,386 - oe-selftest - INFO - 4: 19/24 192/338 (8.51s) (devtool.DevtoolUpgradeTests.test_devtool_load_plugin)
2018-11-29 18:14:59,386 - oe-selftest - INFO - tinfoil.TinfoilTests.test_wait_event (subunit.RemotedTestCase)
2018-11-29 18:14:59,386 - oe-selftest - INFO -  ... ok
2018-11-29 18:14:59,386 - oe-selftest - INFO - 14: 24/24 193/338 (5.33s) (tinfoil.TinfoilTests.test_wait_event)
2018-11-29 18:15:07,506 - oe-selftest - INFO - runtime_test.TestImage.test_testimage_install (subunit.RemotedTestCase)
2018-11-29 18:15:07,506 - oe-selftest - INFO -  ... ok
2018-11-29 18:15:07,506 - oe-selftest - INFO - 0: 21/21 194/338 (135.27s) (runtime_test.TestImage.test_testimage_install)
2018-11-29 18:15:20,636 - oe-selftest - INFO - devtool.DevtoolExtractTests.test_devtool_deploy_target (subunit.RemotedTestCase)
2018-11-29 18:15:20,637 - oe-selftest - INFO -  ... ok
2018-11-29 18:15:20,637 - oe-selftest - INFO - 2: 6/9 195/338 (181.40s) (devtool.DevtoolExtractTests.test_devtool_deploy_target)
2018-11-29 18:15:23,638 - oe-selftest - INFO - devtool.DevtoolUpgradeTests.test_devtool_rename (subunit.RemotedTestCase)
2018-11-29 18:15:23,638 - oe-selftest - INFO -  ... ok
2018-11-29 18:15:23,638 - oe-selftest - INFO - 4: 20/24 196/338 (29.25s) (devtool.DevtoolUpgradeTests.test_devtool_rename)
2018-11-29 18:15:31,534 - oe-selftest - INFO - devtool.DevtoolExtractTests.test_devtool_extract (subunit.RemotedTestCase)
2018-11-29 18:15:31,534 - oe-selftest - INFO -  ... ok
2018-11-29 18:15:31,534 - oe-selftest - INFO - 2: 7/9 197/338 (10.90s) (devtool.DevtoolExtractTests.test_devtool_extract)
2018-11-29 18:15:38,777 - oe-selftest - INFO - imagefeatures.ImageFeatures.test_clutter_image_can_be_built (subunit.RemotedTestCase)
2018-11-29 18:15:38,777 - oe-selftest - INFO -  ... ok
2018-11-29 18:15:38,777 - oe-selftest - INFO - 9: 4/25 198/338 (586.14s) (imagefeatures.ImageFeatures.test_clutter_image_can_be_built)
2018-11-29 18:15:39,438 - oe-selftest - INFO - devtool.DevtoolExtractTests.test_devtool_extract_virtual (subunit.RemotedTestCase)
2018-11-29 18:15:39,438 - oe-selftest - INFO -  ... ok
2018-11-29 18:15:39,439 - oe-selftest - INFO - 2: 8/9 199/338 (7.90s) (devtool.DevtoolExtractTests.test_devtool_extract_virtual)
2018-11-29 18:15:45,352 - oe-selftest - INFO - devtool.DevtoolUpgradeTests.test_devtool_upgrade (subunit.RemotedTestCase)
2018-11-29 18:15:45,352 - oe-selftest - INFO -  ... ok
2018-11-29 18:15:45,353 - oe-selftest - INFO - 4: 21/24 200/338 (21.71s) (devtool.DevtoolUpgradeTests.test_devtool_upgrade)
2018-11-29 18:15:52,560 - oe-selftest - INFO - buildoptions.ImageOptionsTests.test_read_only_image (subunit.RemotedTestCase)
2018-11-29 18:15:52,560 - oe-selftest - INFO -  ... ok
2018-11-29 18:15:52,560 - oe-selftest - INFO - 11: 5/8 201/338 (394.06s) (buildoptions.ImageOptionsTests.test_read_only_image)
2018-11-29 18:16:04,851 - oe-selftest - INFO - devtool.DevtoolUpgradeTests.test_devtool_upgrade_git (subunit.RemotedTestCase)
2018-11-29 18:16:04,851 - oe-selftest - INFO -  ... ok
2018-11-29 18:16:04,851 - oe-selftest - INFO - 4: 22/24 202/338 (19.50s) (devtool.DevtoolUpgradeTests.test_devtool_upgrade_git)
2018-11-29 18:16:17,191 - oe-selftest - INFO - containerimage.ContainerImageTests.test_expected_files (subunit.RemotedTestCase)
2018-11-29 18:16:17,192 - oe-selftest - INFO -  ... ok
2018-11-29 18:16:17,192 - oe-selftest - INFO - 11: 6/8 203/338 (24.63s) (containerimage.ContainerImageTests.test_expected_files)
2018-11-29 18:16:35,843 - oe-selftest - INFO - buildoptions.BuildhistoryTests.test_buildhistory_basic (subunit.RemotedTestCase)
2018-11-29 18:16:35,844 - oe-selftest - INFO -  ... ok
2018-11-29 18:16:35,844 - oe-selftest - INFO - 11: 7/8 204/338 (18.65s) (buildoptions.BuildhistoryTests.test_buildhistory_basic)
2018-11-29 18:17:11,256 - oe-selftest - INFO - buildoptions.BuildhistoryTests.test_buildhistory_buildtime_pr_backwards (subunit.RemotedTestCase)
2018-11-29 18:17:11,256 - oe-selftest - INFO -  ... ok
2018-11-29 18:17:11,256 - oe-selftest - INFO - 11: 8/8 205/338 (35.41s) (buildoptions.BuildhistoryTests.test_buildhistory_buildtime_pr_backwards)
2018-11-29 18:17:17,260 - oe-selftest - INFO - imagefeatures.ImageFeatures.test_hypervisor_fmts (subunit.RemotedTestCase)
2018-11-29 18:17:17,260 - oe-selftest - INFO -  ... ok
2018-11-29 18:17:17,260 - oe-selftest - INFO - 9: 5/25 206/338 (98.48s) (imagefeatures.ImageFeatures.test_hypervisor_fmts)
2018-11-29 18:17:19,869 - oe-selftest - INFO - devtool.DevtoolExtractTests.test_devtool_reset_all (subunit.RemotedTestCase)
2018-11-29 18:17:19,870 - oe-selftest - INFO -  ... ok
2018-11-29 18:17:19,870 - oe-selftest - INFO - 2: 9/9 207/338 (100.43s) (devtool.DevtoolExtractTests.test_devtool_reset_all)
2018-11-29 18:17:55,638 - oe-selftest - INFO - sstatetests.SStateTests.test_sstate_cache_management_script_using_pr_3 (subunit.RemotedTestCase)
2018-11-29 18:17:55,638 - oe-selftest - INFO -  ... ok
2018-11-29 18:17:55,638 - oe-selftest - INFO - 1: 39/76 208/338 (205.34s) (sstatetests.SStateTests.test_sstate_cache_management_script_using_pr_3)
2018-11-29 18:18:10,114 - oe-selftest - INFO - sstatetests.SStateTests.test_sstate_creation_distro_nonspecific_fail (subunit.RemotedTestCase)
2018-11-29 18:18:10,114 - oe-selftest - INFO -  ... ok
2018-11-29 18:18:10,114 - oe-selftest - INFO - 1: 40/76 209/338 (14.48s) (sstatetests.SStateTests.test_sstate_creation_distro_nonspecific_fail)
2018-11-29 18:18:17,134 - oe-selftest - INFO - eSDK.oeSDKExtSelfTest.test_image_generation_binary_feeds (subunit.RemotedTestCase)
2018-11-29 18:18:17,134 - oe-selftest - INFO -  ... ok
2018-11-29 18:18:17,134 - oe-selftest - INFO - 6: 1/6 210/338 (60.21s) (eSDK.oeSDKExtSelfTest.test_image_generation_binary_feeds)
2018-11-29 18:18:23,818 - oe-selftest - INFO - sstatetests.SStateTests.test_sstate_creation_distro_nonspecific_pass (subunit.RemotedTestCase)
2018-11-29 18:18:23,818 - oe-selftest - INFO -  ... ok
2018-11-29 18:18:23,818 - oe-selftest - INFO - 1: 41/76 211/338 (13.70s) (sstatetests.SStateTests.test_sstate_creation_distro_nonspecific_pass)
2018-11-29 18:18:24,311 - oe-selftest - INFO - eSDK.oeSDKExtSelfTest.test_install_libraries_headers (subunit.RemotedTestCase)
2018-11-29 18:18:24,311 - oe-selftest - INFO -  ... ok
2018-11-29 18:18:24,312 - oe-selftest - INFO - 6: 2/6 212/338 (7.18s) (eSDK.oeSDKExtSelfTest.test_install_libraries_headers)
2018-11-29 18:18:35,313 - oe-selftest - INFO - imagefeatures.ImageFeatures.test_image_fstypes (subunit.RemotedTestCase)
2018-11-29 18:18:35,313 - oe-selftest - INFO -  ... ok
2018-11-29 18:18:35,313 - oe-selftest - INFO - 9: 6/25 213/338 (78.05s) (imagefeatures.ImageFeatures.test_image_fstypes)
2018-11-29 18:18:36,999 - oe-selftest - INFO - sstatetests.SStateTests.test_sstate_creation_distro_specific_fail (subunit.RemotedTestCase)
2018-11-29 18:18:36,999 - oe-selftest - INFO -  ... ok
2018-11-29 18:18:36,999 - oe-selftest - INFO - 1: 42/76 214/338 (13.18s) (sstatetests.SStateTests.test_sstate_creation_distro_specific_fail)
2018-11-29 18:18:52,472 - oe-selftest - INFO - lic_checksum.LicenseTests.test_nonmatching_checksum (subunit.RemotedTestCase)
2018-11-29 18:18:52,472 - oe-selftest - INFO -  ... ok
2018-11-29 18:18:52,473 - oe-selftest - INFO - 6: 3/6 215/338 (14.81s) (lic_checksum.LicenseTests.test_nonmatching_checksum)
2018-11-29 18:18:52,974 - oe-selftest - INFO - sstatetests.SStateTests.test_sstate_creation_distro_specific_pass (subunit.RemotedTestCase)
2018-11-29 18:18:52,974 - oe-selftest - INFO -  ... ok
2018-11-29 18:18:52,974 - oe-selftest - INFO - 1: 43/76 216/338 (15.98s) (sstatetests.SStateTests.test_sstate_creation_distro_specific_pass)
2018-11-29 18:19:02,017 - oe-selftest - INFO - buildoptions.SanityOptionsTest.test_layer_without_git_dir (subunit.RemotedTestCase)
2018-11-29 18:19:02,017 - oe-selftest - INFO -  ... ok
2018-11-29 18:19:02,017 - oe-selftest - INFO - 6: 4/6 217/338 (9.54s) (buildoptions.SanityOptionsTest.test_layer_without_git_dir)
2018-11-29 18:19:23,263 - oe-selftest - INFO - imagefeatures.ImageFeatures.test_long_chain_conversion (subunit.RemotedTestCase)
2018-11-29 18:19:23,264 - oe-selftest - INFO -  ... ok
2018-11-29 18:19:23,264 - oe-selftest - INFO - 9: 7/25 218/338 (47.95s) (imagefeatures.ImageFeatures.test_long_chain_conversion)
2018-11-29 18:19:34,808 - oe-selftest - INFO - sstatetests.SStateTests.test_sstate_nativelsbstring_same_hash (subunit.RemotedTestCase)
2018-11-29 18:19:34,808 - oe-selftest - INFO -  ... ok
2018-11-29 18:19:34,808 - oe-selftest - INFO - 1: 44/76 219/338 (41.83s) (sstatetests.SStateTests.test_sstate_nativelsbstring_same_hash)
2018-11-29 18:19:39,103 - oe-selftest - INFO - buildoptions.SanityOptionsTest.test_options_warnqa_errorqa_switch (subunit.RemotedTestCase)
2018-11-29 18:19:39,103 - oe-selftest - INFO -  ... ok
2018-11-29 18:19:39,103 - oe-selftest - INFO - 6: 5/6 220/338 (37.09s) (buildoptions.SanityOptionsTest.test_options_warnqa_errorqa_switch)
2018-11-29 18:19:50,882 - oe-selftest - INFO - image_typedep.ImageTypeDepTests.test_conversion_typedep_added (subunit.RemotedTestCase)
2018-11-29 18:19:50,882 - oe-selftest - INFO -  ... ok
2018-11-29 18:19:50,882 - oe-selftest - INFO - 6: 6/6 221/338 (11.79s) (image_typedep.ImageTypeDepTests.test_conversion_typedep_added)
2018-11-29 18:20:17,647 - oe-selftest - INFO - imagefeatures.ImageFeatures.test_non_root_user_can_connect_via_ssh_without_password (subunit.RemotedTestCase)
2018-11-29 18:20:17,647 - oe-selftest - INFO -  ... ok
2018-11-29 18:20:17,648 - oe-selftest - INFO - 9: 8/25 222/338 (54.38s) (imagefeatures.ImageFeatures.test_non_root_user_can_connect_via_ssh_without_password)
2018-11-29 18:21:14,308 - oe-selftest - INFO - sstatetests.SStateTests.test_sstate_nativesdk_samesigs_multilib (subunit.RemotedTestCase)
2018-11-29 18:21:14,309 - oe-selftest - INFO -  ... ok
2018-11-29 18:21:14,309 - oe-selftest - INFO - 1: 45/76 223/338 (99.50s) (sstatetests.SStateTests.test_sstate_nativesdk_samesigs_multilib)
2018-11-29 18:22:29,670 - oe-selftest - INFO - sstatetests.SStateTests.test_sstate_noop_samesigs (subunit.RemotedTestCase)
2018-11-29 18:22:29,670 - oe-selftest - INFO -  ... ok
2018-11-29 18:22:29,671 - oe-selftest - INFO - 1: 46/76 224/338 (75.36s) (sstatetests.SStateTests.test_sstate_noop_samesigs)
2018-11-29 18:22:54,765 - oe-selftest - INFO - signing.Signing.test_signing_packages (subunit.RemotedTestCase)
2018-11-29 18:22:54,765 - oe-selftest - INFO -  ... ok
2018-11-29 18:22:54,765 - oe-selftest - INFO - 3: 4/8 225/338 (3035.83s) (signing.Signing.test_signing_packages)
2018-11-29 18:24:00,739 - oe-selftest - INFO - signing.Signing.test_signing_sstate_archive (subunit.RemotedTestCase)
2018-11-29 18:24:00,739 - oe-selftest - INFO -  ... ok
2018-11-29 18:24:00,739 - oe-selftest - INFO - 3: 5/8 226/338 (65.97s) (signing.Signing.test_signing_sstate_archive)
2018-11-29 18:24:00,740 - oe-selftest - INFO - oelib.path.TestRealPath.test_loop (subunit.RemotedTestCase)
2018-11-29 18:24:00,740 - oe-selftest - INFO -  ... ok
2018-11-29 18:24:00,740 - oe-selftest - INFO - 3: 6/8 227/338 (0.01s) (oelib.path.TestRealPath.test_loop)
2018-11-29 18:24:00,743 - oe-selftest - INFO - oelib.path.TestRealPath.test_norm (subunit.RemotedTestCase)
2018-11-29 18:24:00,743 - oe-selftest - INFO -  ... ok
2018-11-29 18:24:00,743 - oe-selftest - INFO - 3: 7/8 228/338 (0.00s) (oelib.path.TestRealPath.test_norm)
2018-11-29 18:24:00,744 - oe-selftest - INFO - oelib.path.TestRealPath.test_phys (subunit.RemotedTestCase)
2018-11-29 18:24:00,744 - oe-selftest - INFO -  ... ok
2018-11-29 18:24:00,744 - oe-selftest - INFO - 3: 8/8 229/338 (0.00s) (oelib.path.TestRealPath.test_phys)
2018-11-29 18:24:50,790 - oe-selftest - INFO - sstatetests.SStateTests.test_sstate_sametune_samesigs (subunit.RemotedTestCase)
2018-11-29 18:24:50,790 - oe-selftest - INFO -  ... ok
2018-11-29 18:24:50,790 - oe-selftest - INFO - 1: 47/76 230/338 (141.13s) (sstatetests.SStateTests.test_sstate_sametune_samesigs)
2018-11-29 18:24:50,790 - oe-selftest - INFO - VerifyManifest: doing bitbake core-image-minimal as a prerequisite of the test
2018-11-29 18:27:03,863 - oe-selftest - INFO - imagefeatures.ImageFeatures.test_useradd_static (subunit.RemotedTestCase)
2018-11-29 18:27:03,863 - oe-selftest - INFO -  ... ok
2018-11-29 18:27:03,864 - oe-selftest - INFO - 9: 9/25 231/338 (406.22s) (imagefeatures.ImageFeatures.test_useradd_static)
2018-11-29 18:31:20,270 - oe-selftest - INFO - imagefeatures.ImageFeatures.test_wayland_support_in_image (subunit.RemotedTestCase)
2018-11-29 18:31:20,270 - oe-selftest - INFO -  ... ok
2018-11-29 18:31:20,271 - oe-selftest - INFO - 9: 10/25 232/338 (256.41s) (imagefeatures.ImageFeatures.test_wayland_support_in_image)
2018-11-29 18:31:22,435 - oe-selftest - INFO - manifest.VerifyManifest.test_SDK_manifest_entries (subunit.RemotedTestCase)
2018-11-29 18:31:22,436 - oe-selftest - INFO -  ... ok
2018-11-29 18:31:22,436 - oe-selftest - INFO - 1: 48/76 233/338 (381.78s) (manifest.VerifyManifest.test_SDK_manifest_entries)
2018-11-29 18:31:37,381 - oe-selftest - INFO - manifest.VerifyManifest.test_image_manifest_entries (subunit.RemotedTestCase)
2018-11-29 18:31:37,381 - oe-selftest - INFO -  ... ok
2018-11-29 18:31:37,381 - oe-selftest - INFO - 1: 49/76 234/338 (14.95s) (manifest.VerifyManifest.test_image_manifest_entries)
2018-11-29 18:31:38,932 - oe-selftest - INFO - oelib.buildhistory.TestBlobParsing.test_blob_to_dict (subunit.RemotedTestCase)
2018-11-29 18:31:38,932 - oe-selftest - INFO -  ... ok
2018-11-29 18:31:38,932 - oe-selftest - INFO - 1: 50/76 235/338 (1.55s) (oelib.buildhistory.TestBlobParsing.test_blob_to_dict)
2018-11-29 18:31:40,839 - oe-selftest - INFO - oelib.buildhistory.TestBlobParsing.test_compare_dict_blobs (subunit.RemotedTestCase)
2018-11-29 18:31:40,839 - oe-selftest - INFO -  ... ok
2018-11-29 18:31:40,839 - oe-selftest - INFO - 1: 51/76 236/338 (1.91s) (oelib.buildhistory.TestBlobParsing.test_compare_dict_blobs)
2018-11-29 18:31:42,912 - oe-selftest - INFO - oelib.buildhistory.TestBlobParsing.test_compare_dict_blobs_default (subunit.RemotedTestCase)
2018-11-29 18:31:42,912 - oe-selftest - INFO -  ... ok
2018-11-29 18:31:42,912 - oe-selftest - INFO - 1: 52/76 237/338 (2.07s) (oelib.buildhistory.TestBlobParsing.test_compare_dict_blobs_default)
2018-11-29 18:32:11,367 - oe-selftest - INFO - devtool.DevtoolAddTests.test_devtool_add (subunit.RemotedTestCase)
2018-11-29 18:32:11,367 - oe-selftest - INFO -  ... ok
2018-11-29 18:32:11,367 - oe-selftest - INFO - 9: 11/25 238/338 (49.26s) (devtool.DevtoolAddTests.test_devtool_add)
2018-11-29 18:32:30,335 - oe-selftest - INFO - wic.Wic2.test_bmap_long (subunit.RemotedTestCase)
2018-11-29 18:32:30,335 - oe-selftest - INFO -  ... ok
2018-11-29 18:32:30,335 - oe-selftest - INFO - 1: 53/76 239/338 (47.42s) (wic.Wic2.test_bmap_long)
2018-11-29 18:33:01,456 - oe-selftest - INFO - wic.Wic2.test_bmap_short (subunit.RemotedTestCase)
2018-11-29 18:33:01,456 - oe-selftest - INFO -  ... ok
2018-11-29 18:33:01,456 - oe-selftest - INFO - 1: 54/76 240/338 (31.12s) (wic.Wic2.test_bmap_short)
2018-11-29 18:34:00,755 - oe-selftest - INFO - devtool.DevtoolAddTests.test_devtool_add_fetch (subunit.RemotedTestCase)
2018-11-29 18:34:00,755 - oe-selftest - INFO -  ... ok
2018-11-29 18:34:00,755 - oe-selftest - INFO - 9: 12/25 241/338 (109.39s) (devtool.DevtoolAddTests.test_devtool_add_fetch)
2018-11-29 18:34:42,113 - oe-selftest - INFO - devtool.DevtoolAddTests.test_devtool_add_fetch_git (subunit.RemotedTestCase)
2018-11-29 18:34:42,113 - oe-selftest - INFO -  ... ok
2018-11-29 18:34:42,113 - oe-selftest - INFO - 9: 13/25 242/338 (41.37s) (devtool.DevtoolAddTests.test_devtool_add_fetch_git)
2018-11-29 18:34:56,626 - oe-selftest - INFO - devtool.DevtoolAddTests.test_devtool_add_fetch_simple (subunit.RemotedTestCase)
2018-11-29 18:34:56,626 - oe-selftest - INFO -  ... ok
2018-11-29 18:34:56,626 - oe-selftest - INFO - 9: 14/25 243/338 (14.51s) (devtool.DevtoolAddTests.test_devtool_add_fetch_simple)
2018-11-29 18:35:04,734 - oe-selftest - INFO - wic.Wic2.test_expand_mbr_image (subunit.RemotedTestCase)
2018-11-29 18:35:04,735 - oe-selftest - INFO -  ... ok
2018-11-29 18:35:04,735 - oe-selftest - INFO - 1: 55/76 244/338 (123.28s) (wic.Wic2.test_expand_mbr_image)
2018-11-29 18:35:19,968 - oe-selftest - INFO - devtool.DevtoolAddTests.test_devtool_add_git_local (subunit.RemotedTestCase)
2018-11-29 18:35:19,968 - oe-selftest - INFO -  ... ok
2018-11-29 18:35:19,968 - oe-selftest - INFO - 9: 15/25 245/338 (23.34s) (devtool.DevtoolAddTests.test_devtool_add_git_local)
2018-11-29 18:35:28,971 - oe-selftest - INFO - wic.Wic2.test_fixed_size (subunit.RemotedTestCase)
2018-11-29 18:35:28,971 - oe-selftest - INFO -  ... ok
2018-11-29 18:35:28,972 - oe-selftest - INFO - 1: 56/76 246/338 (24.24s) (wic.Wic2.test_fixed_size)
2018-11-29 18:35:43,339 - oe-selftest - INFO - wic.Wic2.test_fixed_size_error (subunit.RemotedTestCase)
2018-11-29 18:35:43,339 - oe-selftest - INFO -  ... ok
2018-11-29 18:35:43,339 - oe-selftest - INFO - 1: 57/76 247/338 (14.37s) (wic.Wic2.test_fixed_size_error)
2018-11-29 18:36:14,053 - oe-selftest - INFO - wic.Wic2.test_fs_types (subunit.RemotedTestCase)
2018-11-29 18:36:14,054 - oe-selftest - INFO -  ... ok
2018-11-29 18:36:14,054 - oe-selftest - INFO - 1: 58/76 248/338 (30.72s) (wic.Wic2.test_fs_types)
2018-11-29 18:36:34,765 - oe-selftest - INFO - devtool.DevtoolAddTests.test_devtool_add_library (subunit.RemotedTestCase)
2018-11-29 18:36:34,766 - oe-selftest - INFO -  ... ok
2018-11-29 18:36:34,766 - oe-selftest - INFO - 9: 16/25 249/338 (74.80s) (devtool.DevtoolAddTests.test_devtool_add_library)
2018-11-29 18:36:43,134 - oe-selftest - INFO - wic.Wic2.test_image_bootpart_globbed (subunit.RemotedTestCase)
2018-11-29 18:36:43,135 - oe-selftest - INFO -  ... ok
2018-11-29 18:36:43,135 - oe-selftest - INFO - 1: 59/76 250/338 (29.08s) (wic.Wic2.test_image_bootpart_globbed)
2018-11-29 18:36:58,624 - oe-selftest - INFO - devtool.DevtoolUpdateTests.test_devtool_update_recipe (subunit.RemotedTestCase)
2018-11-29 18:36:58,625 - oe-selftest - INFO -  ... ok
2018-11-29 18:36:58,625 - oe-selftest - INFO - 9: 17/25 251/338 (22.57s) (devtool.DevtoolUpdateTests.test_devtool_update_recipe)
2018-11-29 18:37:32,205 - oe-selftest - INFO - devtool.DevtoolUpdateTests.test_devtool_update_recipe_append (subunit.RemotedTestCase)
2018-11-29 18:37:32,205 - oe-selftest - INFO -  ... ok
2018-11-29 18:37:32,205 - oe-selftest - INFO - 9: 18/25 252/338 (33.58s) (devtool.DevtoolUpdateTests.test_devtool_update_recipe_append)
2018-11-29 18:37:39,527 - oe-selftest - INFO - wic.Wic2.test_image_env (subunit.RemotedTestCase)
2018-11-29 18:37:39,528 - oe-selftest - INFO -  ... ok
2018-11-29 18:37:39,528 - oe-selftest - INFO - 1: 60/76 253/338 (56.39s) (wic.Wic2.test_image_env)
2018-11-29 18:37:43,050 - oe-selftest - INFO - wic.Wic2.test_image_vars_dir_long (subunit.RemotedTestCase)
2018-11-29 18:37:43,051 - oe-selftest - INFO -  ... ok
2018-11-29 18:37:43,051 - oe-selftest - INFO - 1: 61/76 254/338 (3.52s) (wic.Wic2.test_image_vars_dir_long)
2018-11-29 18:37:47,151 - oe-selftest - INFO - wic.Wic2.test_image_vars_dir_short (subunit.RemotedTestCase)
2018-11-29 18:37:47,151 - oe-selftest - INFO -  ... ok
2018-11-29 18:37:47,151 - oe-selftest - INFO - 1: 62/76 255/338 (4.10s) (wic.Wic2.test_image_vars_dir_short)
2018-11-29 18:38:03,508 - oe-selftest - INFO - devtool.DevtoolUpdateTests.test_devtool_update_recipe_append_git (subunit.RemotedTestCase)
2018-11-29 18:38:03,508 - oe-selftest - INFO -  ... ok
2018-11-29 18:38:03,508 - oe-selftest - INFO - 9: 19/25 256/338 (31.30s) (devtool.DevtoolUpdateTests.test_devtool_update_recipe_append_git)
2018-11-29 18:38:11,042 - oe-selftest - INFO - wic.Wic2.test_kickstart_parser (subunit.RemotedTestCase)
2018-11-29 18:38:11,042 - oe-selftest - INFO -  ... ok
2018-11-29 18:38:11,042 - oe-selftest - INFO - 1: 63/76 257/338 (23.90s) (wic.Wic2.test_kickstart_parser)
2018-11-29 18:38:20,585 - oe-selftest - INFO - devtool.DevtoolUpdateTests.test_devtool_update_recipe_git (subunit.RemotedTestCase)
2018-11-29 18:38:20,586 - oe-selftest - INFO -  ... ok
2018-11-29 18:38:20,586 - oe-selftest - INFO - 9: 20/25 258/338 (17.08s) (devtool.DevtoolUpdateTests.test_devtool_update_recipe_git)
2018-11-29 18:38:28,325 - oe-selftest - INFO - wic.Wic2.test_mkfs_extraopts (subunit.RemotedTestCase)
2018-11-29 18:38:28,325 - oe-selftest - INFO -  ... ok
2018-11-29 18:38:28,325 - oe-selftest - INFO - 1: 64/76 259/338 (17.28s) (wic.Wic2.test_mkfs_extraopts)
2018-11-29 18:38:45,631 - oe-selftest - INFO - devtool.DevtoolUpdateTests.test_devtool_update_recipe_local_files (subunit.RemotedTestCase)
2018-11-29 18:38:45,631 - oe-selftest - INFO -  ... ok
2018-11-29 18:38:45,632 - oe-selftest - INFO - 9: 21/25 260/338 (25.05s) (devtool.DevtoolUpdateTests.test_devtool_update_recipe_local_files)
2018-11-29 18:39:02,440 - oe-selftest - INFO - devtool.DevtoolUpdateTests.test_devtool_update_recipe_local_files_2 (subunit.RemotedTestCase)
2018-11-29 18:39:02,441 - oe-selftest - INFO -  ... ok
2018-11-29 18:39:02,441 - oe-selftest - INFO - 9: 22/25 261/338 (16.81s) (devtool.DevtoolUpdateTests.test_devtool_update_recipe_local_files_2)
2018-11-29 18:39:18,746 - oe-selftest - INFO - devtool.DevtoolUpdateTests.test_devtool_update_recipe_local_files_3 (subunit.RemotedTestCase)
2018-11-29 18:39:18,746 - oe-selftest - INFO -  ... ok
2018-11-29 18:39:18,746 - oe-selftest - INFO - 9: 23/25 262/338 (16.31s) (devtool.DevtoolUpdateTests.test_devtool_update_recipe_local_files_3)
2018-11-29 18:39:38,362 - oe-selftest - INFO - devtool.DevtoolUpdateTests.test_devtool_update_recipe_local_files_subdir (subunit.RemotedTestCase)
2018-11-29 18:39:38,362 - oe-selftest - INFO -  ... ok
2018-11-29 18:39:38,362 - oe-selftest - INFO - 9: 24/25 263/338 (19.62s) (devtool.DevtoolUpdateTests.test_devtool_update_recipe_local_files_subdir)
2018-11-29 18:39:46,475 - oe-selftest - INFO - wic.Wic2.test_qemu (subunit.RemotedTestCase)
2018-11-29 18:39:46,475 - oe-selftest - INFO -  ... ok
2018-11-29 18:39:46,475 - oe-selftest - INFO - 1: 65/76 264/338 (78.15s) (wic.Wic2.test_qemu)
2018-11-29 18:40:09,801 - oe-selftest - INFO - devtool.DevtoolUpdateTests.test_devtool_update_recipe_local_patch_gz (subunit.RemotedTestCase)
2018-11-29 18:40:09,801 - oe-selftest - INFO -  ... ok
2018-11-29 18:40:09,801 - oe-selftest - INFO - 9: 25/25 265/338 (31.44s) (devtool.DevtoolUpdateTests.test_devtool_update_recipe_local_patch_gz)
2018-11-29 18:41:07,358 - oe-selftest - INFO - wic.Wic2.test_qemu_efi (subunit.RemotedTestCase)
2018-11-29 18:41:07,358 - oe-selftest - INFO -  ... ok
2018-11-29 18:41:07,358 - oe-selftest - INFO - 1: 66/76 266/338 (80.88s) (wic.Wic2.test_qemu_efi)
2018-11-29 18:41:24,903 - oe-selftest - INFO - wic.Wic2.test_rawcopy_plugin (subunit.RemotedTestCase)
2018-11-29 18:41:24,903 - oe-selftest - INFO -  ... ok
2018-11-29 18:41:24,903 - oe-selftest - INFO - 1: 67/76 267/338 (17.55s) (wic.Wic2.test_rawcopy_plugin)
2018-11-29 18:43:05,070 - oe-selftest - INFO - wic.Wic2.test_rawcopy_plugin_qemu (subunit.RemotedTestCase)
2018-11-29 18:43:05,070 - oe-selftest - INFO -  ... ok
2018-11-29 18:43:05,070 - oe-selftest - INFO - 1: 68/76 268/338 (100.17s) (wic.Wic2.test_rawcopy_plugin_qemu)
2018-11-29 18:43:06,378 - oe-selftest - INFO - wic.Wic2.test_sparse_copy (subunit.RemotedTestCase)
2018-11-29 18:43:06,378 - oe-selftest - INFO -  ... ok
2018-11-29 18:43:06,378 - oe-selftest - INFO - 1: 69/76 269/338 (1.31s) (wic.Wic2.test_sparse_copy)
2018-11-29 18:43:23,906 - oe-selftest - INFO - wic.Wic2.test_wic_cp (subunit.RemotedTestCase)
2018-11-29 18:43:23,906 - oe-selftest - INFO -  ... ok
2018-11-29 18:43:23,906 - oe-selftest - INFO - 1: 70/76 270/338 (17.53s) (wic.Wic2.test_wic_cp)
2018-11-29 18:43:40,764 - oe-selftest - INFO - wic.Wic2.test_wic_cp_ext (subunit.RemotedTestCase)
2018-11-29 18:43:40,764 - oe-selftest - INFO -  ... ok
2018-11-29 18:43:40,764 - oe-selftest - INFO - 1: 71/76 271/338 (16.86s) (wic.Wic2.test_wic_cp_ext)
2018-11-29 18:43:50,127 - oe-selftest - INFO - wic.Wic2.test_wic_image_type (subunit.RemotedTestCase)
2018-11-29 18:43:50,127 - oe-selftest - INFO -  ... ok
2018-11-29 18:43:50,127 - oe-selftest - INFO - 1: 72/76 272/338 (9.36s) (wic.Wic2.test_wic_image_type)
2018-11-29 18:43:52,907 - oe-selftest - INFO - runtime_test.Postinst.test_postinst_rootfs_and_boot (subunit.RemotedTestCase)
2018-11-29 18:43:52,907 - oe-selftest - INFO -  ... ok
2018-11-29 18:43:52,907 - oe-selftest - INFO - 5: 2/14 273/338 (2263.82s) (runtime_test.Postinst.test_postinst_rootfs_and_boot)
2018-11-29 18:43:52,908 - oe-selftest - INFO - oelib.utils.TestTrimVersion.test_num_exception (subunit.RemotedTestCase)
2018-11-29 18:43:52,908 - oe-selftest - INFO -  ... ok
2018-11-29 18:43:52,908 - oe-selftest - INFO - 5: 3/14 274/338 (0.00s) (oelib.utils.TestTrimVersion.test_num_exception)
2018-11-29 18:43:52,908 - oe-selftest - INFO - oelib.utils.TestTrimVersion.test_valid (subunit.RemotedTestCase)
2018-11-29 18:43:52,909 - oe-selftest - INFO -  ... ok
2018-11-29 18:43:52,909 - oe-selftest - INFO - 5: 4/14 275/338 (0.00s) (oelib.utils.TestTrimVersion.test_valid)
2018-11-29 18:43:52,909 - oe-selftest - INFO - oelib.utils.TestTrimVersion.test_version_exception (subunit.RemotedTestCase)
2018-11-29 18:43:52,909 - oe-selftest - INFO -  ... ok
2018-11-29 18:43:52,909 - oe-selftest - INFO - 5: 5/14 276/338 (0.00s) (oelib.utils.TestTrimVersion.test_version_exception)
2018-11-29 18:44:06,969 - oe-selftest - INFO - wic.Wic2.test_wic_ls (subunit.RemotedTestCase)
2018-11-29 18:44:06,969 - oe-selftest - INFO -  ... ok
2018-11-29 18:44:06,969 - oe-selftest - INFO - 1: 73/76 277/338 (16.84s) (wic.Wic2.test_wic_ls)
2018-11-29 18:44:22,821 - oe-selftest - INFO - wic.Wic2.test_wic_ls_ext (subunit.RemotedTestCase)
2018-11-29 18:44:22,821 - oe-selftest - INFO -  ... ok
2018-11-29 18:44:22,821 - oe-selftest - INFO - 1: 74/76 278/338 (15.85s) (wic.Wic2.test_wic_ls_ext)
2018-11-29 18:44:49,197 - oe-selftest - INFO - wic.Wic2.test_wic_rm (subunit.RemotedTestCase)
2018-11-29 18:44:49,198 - oe-selftest - INFO -  ... ok
2018-11-29 18:44:49,198 - oe-selftest - INFO - 1: 75/76 279/338 (26.38s) (wic.Wic2.test_wic_rm)
2018-11-29 18:45:07,984 - oe-selftest - INFO - wic.Wic2.test_wic_rm_ext (subunit.RemotedTestCase)
2018-11-29 18:45:07,984 - oe-selftest - INFO -  ... ok
2018-11-29 18:45:07,985 - oe-selftest - INFO - 1: 76/76 280/338 (18.79s) (wic.Wic2.test_wic_rm_ext)
2018-11-29 18:45:16,416 - oe-selftest - INFO - runqemu.QemuTest.test_qemu_can_shutdown (subunit.RemotedTestCase)
2018-11-29 18:45:16,416 - oe-selftest - INFO -  ... ok
2018-11-29 18:45:16,416 - oe-selftest - INFO - Running bitbake to generate pkgdata
2018-11-29 18:45:16,416 - oe-selftest - INFO - 5: 6/14 281/338 (33.02s) (runqemu.QemuTest.test_qemu_can_shutdown)
2018-11-29 18:45:26,205 - oe-selftest - INFO - pkgdata.OePkgdataUtilTests.test_find_path (subunit.RemotedTestCase)
2018-11-29 18:45:26,206 - oe-selftest - INFO -  ... ok
2018-11-29 18:45:26,206 - oe-selftest - INFO - 5: 7/14 282/338 (4.64s) (pkgdata.OePkgdataUtilTests.test_find_path)
2018-11-29 18:45:28,617 - oe-selftest - INFO - pkgdata.OePkgdataUtilTests.test_glob (subunit.RemotedTestCase)
2018-11-29 18:45:28,617 - oe-selftest - INFO -  ... ok
2018-11-29 18:45:28,617 - oe-selftest - INFO - 5: 8/14 283/338 (2.41s) (pkgdata.OePkgdataUtilTests.test_glob)
2018-11-29 18:45:35,239 - oe-selftest - INFO - pkgdata.OePkgdataUtilTests.test_list_pkg_files (subunit.RemotedTestCase)
2018-11-29 18:45:35,239 - oe-selftest - INFO -  ... ok
2018-11-29 18:45:35,239 - oe-selftest - INFO - 5: 9/14 284/338 (6.62s) (pkgdata.OePkgdataUtilTests.test_list_pkg_files)
2018-11-29 18:45:41,841 - oe-selftest - INFO - pkgdata.OePkgdataUtilTests.test_list_pkgs (subunit.RemotedTestCase)
2018-11-29 18:45:41,841 - oe-selftest - INFO -  ... ok
2018-11-29 18:45:41,841 - oe-selftest - INFO - 5: 10/14 285/338 (6.60s) (pkgdata.OePkgdataUtilTests.test_list_pkgs)
2018-11-29 18:45:46,725 - oe-selftest - INFO - pkgdata.OePkgdataUtilTests.test_lookup_pkg (subunit.RemotedTestCase)
2018-11-29 18:45:46,725 - oe-selftest - INFO -  ... ok
2018-11-29 18:45:46,725 - oe-selftest - INFO - 5: 11/14 286/338 (4.88s) (pkgdata.OePkgdataUtilTests.test_lookup_pkg)
2018-11-29 18:45:49,114 - oe-selftest - INFO - pkgdata.OePkgdataUtilTests.test_lookup_recipe (subunit.RemotedTestCase)
2018-11-29 18:45:49,114 - oe-selftest - INFO -  ... ok
2018-11-29 18:45:49,114 - oe-selftest - INFO - 5: 12/14 287/338 (2.39s) (pkgdata.OePkgdataUtilTests.test_lookup_recipe)
2018-11-29 18:45:51,486 - oe-selftest - INFO - pkgdata.OePkgdataUtilTests.test_read_value (subunit.RemotedTestCase)
2018-11-29 18:45:51,486 - oe-selftest - INFO -  ... ok
2018-11-29 18:45:51,486 - oe-selftest - INFO - 5: 13/14 288/338 (2.37s) (pkgdata.OePkgdataUtilTests.test_read_value)
2018-11-29 18:45:52,935 - oe-selftest - INFO - pkgdata.OePkgdataUtilTests.test_specify_pkgdatadir (subunit.RemotedTestCase)
2018-11-29 18:45:52,935 - oe-selftest - INFO -  ... ok
2018-11-29 18:45:52,935 - oe-selftest - INFO - 5: 14/14 289/338 (1.45s) (pkgdata.OePkgdataUtilTests.test_specify_pkgdatadir)
2018-11-29 19:14:55,044 - oe-selftest - INFO - wic.Wic.test_iso_image (subunit.RemotedTestCase)
2018-11-29 19:14:55,045 - oe-selftest - INFO -  ... ok
2018-11-29 19:14:55,045 - oe-selftest - INFO - 12: 23/69 290/338 (3673.01s) (wic.Wic.test_iso_image)
2018-11-29 19:14:57,010 - oe-selftest - INFO - wic.Wic.test_list_images (subunit.RemotedTestCase)
2018-11-29 19:14:57,010 - oe-selftest - INFO -  ... ok
2018-11-29 19:14:57,010 - oe-selftest - INFO - 12: 24/69 291/338 (1.97s) (wic.Wic.test_list_images)
2018-11-29 19:14:58,917 - oe-selftest - INFO - wic.Wic.test_list_source_plugins (subunit.RemotedTestCase)
2018-11-29 19:14:58,918 - oe-selftest - INFO -  ... ok
2018-11-29 19:14:58,918 - oe-selftest - INFO - 12: 25/69 292/338 (1.91s) (wic.Wic.test_list_source_plugins)
2018-11-29 19:15:26,724 - oe-selftest - INFO - wic.Wic.test_listed_images_help (subunit.RemotedTestCase)
2018-11-29 19:15:26,724 - oe-selftest - INFO -  ... ok
2018-11-29 19:15:26,724 - oe-selftest - INFO - 12: 26/69 293/338 (27.81s) (wic.Wic.test_listed_images_help)
2018-11-29 19:15:27,134 - oe-selftest - INFO - wic.Wic.test_listhelp (subunit.RemotedTestCase)
2018-11-29 19:15:27,135 - oe-selftest - INFO -  ... ok
2018-11-29 19:15:27,135 - oe-selftest - INFO - 12: 27/69 294/338 (0.41s) (wic.Wic.test_listhelp)
2018-11-29 19:15:41,817 - oe-selftest - INFO - wic.Wic.test_mkefidisk (subunit.RemotedTestCase)
2018-11-29 19:15:41,817 - oe-selftest - INFO -  ... ok
2018-11-29 19:15:41,817 - oe-selftest - INFO - 12: 28/69 295/338 (14.68s) (wic.Wic.test_mkefidisk)
2018-11-29 19:15:42,224 - oe-selftest - INFO - wic.Wic.test_no_command (subunit.RemotedTestCase)
2018-11-29 19:15:42,224 - oe-selftest - INFO -  ... ok
2018-11-29 19:15:42,224 - oe-selftest - INFO - 12: 29/69 296/338 (0.41s) (wic.Wic.test_no_command)
2018-11-29 19:16:09,153 - oe-selftest - INFO - wic.Wic.test_qemux86_directdisk (subunit.RemotedTestCase)
2018-11-29 19:16:09,153 - oe-selftest - INFO -  ... ok
2018-11-29 19:16:09,154 - oe-selftest - INFO - 12: 30/69 297/338 (26.93s) (wic.Wic.test_qemux86_directdisk)
2018-11-29 19:16:40,246 - oe-selftest - INFO - wic.Wic.test_rootfs_artifacts (subunit.RemotedTestCase)
2018-11-29 19:16:40,246 - oe-selftest - INFO -  ... ok
2018-11-29 19:16:40,247 - oe-selftest - INFO - 12: 31/69 298/338 (31.09s) (wic.Wic.test_rootfs_artifacts)
2018-11-29 19:17:00,185 - oe-selftest - INFO - wic.Wic.test_rootfs_indirect_recipes (subunit.RemotedTestCase)
2018-11-29 19:17:00,185 - oe-selftest - INFO -  ... ok
2018-11-29 19:17:00,185 - oe-selftest - INFO - 12: 32/69 299/338 (19.94s) (wic.Wic.test_rootfs_indirect_recipes)
2018-11-29 19:17:17,425 - oe-selftest - INFO - wic.Wic.test_sdimage_bootpart (subunit.RemotedTestCase)
2018-11-29 19:17:17,425 - oe-selftest - INFO -  ... ok
2018-11-29 19:17:17,425 - oe-selftest - INFO - 12: 33/69 300/338 (17.24s) (wic.Wic.test_sdimage_bootpart)
2018-11-29 19:17:29,442 - oe-selftest - INFO - wic.Wic.test_skip_build_check_long (subunit.RemotedTestCase)
2018-11-29 19:17:29,442 - oe-selftest - INFO -  ... ok
2018-11-29 19:17:29,442 - oe-selftest - INFO - 12: 34/69 301/338 (12.02s) (wic.Wic.test_skip_build_check_long)
2018-11-29 19:17:41,282 - oe-selftest - INFO - wic.Wic.test_skip_build_check_short (subunit.RemotedTestCase)
2018-11-29 19:17:41,282 - oe-selftest - INFO -  ... ok
2018-11-29 19:17:41,282 - oe-selftest - INFO - 12: 35/69 302/338 (11.84s) (wic.Wic.test_skip_build_check_short)
2018-11-29 19:18:31,384 - oe-selftest - INFO - wic.Wic.test_systemd_bootdisk (subunit.RemotedTestCase)
2018-11-29 19:18:31,384 - oe-selftest - INFO -  ... ok
2018-11-29 19:18:31,384 - oe-selftest - INFO - 12: 36/69 303/338 (50.10s) (wic.Wic.test_systemd_bootdisk)
2018-11-29 19:18:31,714 - oe-selftest - INFO - wic.Wic.test_unsupported_subcommand (subunit.RemotedTestCase)
2018-11-29 19:18:31,714 - oe-selftest - INFO -  ... ok
2018-11-29 19:18:31,714 - oe-selftest - INFO - 12: 37/69 304/338 (0.33s) (wic.Wic.test_unsupported_subcommand)
2018-11-29 19:18:32,052 - oe-selftest - INFO - wic.Wic.test_version (subunit.RemotedTestCase)
2018-11-29 19:18:32,052 - oe-selftest - INFO -  ... ok
2018-11-29 19:18:32,052 - oe-selftest - INFO - 12: 38/69 305/338 (0.34s) (wic.Wic.test_version)
2018-11-29 19:18:32,377 - oe-selftest - INFO - wic.Wic.test_wrong_compressor (subunit.RemotedTestCase)
2018-11-29 19:18:32,378 - oe-selftest - INFO -  ... ok
2018-11-29 19:18:32,378 - oe-selftest - INFO - 12: 39/69 306/338 (0.33s) (wic.Wic.test_wrong_compressor)
2018-11-29 19:18:34,406 - oe-selftest - INFO - Running bitbake to generate pkgdata
2018-11-29 19:19:03,167 - oe-selftest - INFO - recipetool.RecipetoolTests.test_recipetool_appendfile_add (subunit.RemotedTestCase)
2018-11-29 19:19:03,168 - oe-selftest - INFO -  ... ok
2018-11-29 19:19:03,168 - oe-selftest - INFO - 12: 40/69 307/338 (19.80s) (recipetool.RecipetoolTests.test_recipetool_appendfile_add)
2018-11-29 19:19:11,857 - oe-selftest - INFO - recipetool.RecipetoolTests.test_recipetool_appendfile_add_bindir (subunit.RemotedTestCase)
2018-11-29 19:19:11,857 - oe-selftest - INFO -  ... ok
2018-11-29 19:19:11,858 - oe-selftest - INFO - 12: 41/69 308/338 (8.69s) (recipetool.RecipetoolTests.test_recipetool_appendfile_add_bindir)
2018-11-29 19:19:19,789 - oe-selftest - INFO - recipetool.RecipetoolTests.test_recipetool_appendfile_add_machine (subunit.RemotedTestCase)
2018-11-29 19:19:19,790 - oe-selftest - INFO -  ... ok
2018-11-29 19:19:19,790 - oe-selftest - INFO - 12: 42/69 309/338 (7.93s) (recipetool.RecipetoolTests.test_recipetool_appendfile_add_machine)
2018-11-29 19:19:45,149 - oe-selftest - INFO - recipetool.RecipetoolTests.test_recipetool_appendfile_alternatives (subunit.RemotedTestCase)
2018-11-29 19:19:45,149 - oe-selftest - INFO -  ... ok
2018-11-29 19:19:45,149 - oe-selftest - INFO - 12: 43/69 310/338 (25.36s) (recipetool.RecipetoolTests.test_recipetool_appendfile_alternatives)
2018-11-29 19:19:54,011 - oe-selftest - INFO - recipetool.RecipetoolTests.test_recipetool_appendfile_basic (subunit.RemotedTestCase)
2018-11-29 19:19:54,011 - oe-selftest - INFO -  ... ok
2018-11-29 19:19:54,011 - oe-selftest - INFO - 12: 44/69 311/338 (8.86s) (recipetool.RecipetoolTests.test_recipetool_appendfile_basic)
2018-11-29 19:19:56,657 - oe-selftest - INFO - recipetool.RecipetoolTests.test_recipetool_appendfile_binary (subunit.RemotedTestCase)
2018-11-29 19:19:56,658 - oe-selftest - INFO -  ... ok
2018-11-29 19:19:56,658 - oe-selftest - INFO - 12: 45/69 312/338 (2.65s) (recipetool.RecipetoolTests.test_recipetool_appendfile_binary)
2018-11-29 19:19:59,481 - oe-selftest - INFO - recipetool.RecipetoolTests.test_recipetool_appendfile_extlayer (subunit.RemotedTestCase)
2018-11-29 19:19:59,481 - oe-selftest - INFO -  ... ok
2018-11-29 19:19:59,481 - oe-selftest - INFO - 12: 46/69 313/338 (2.82s) (recipetool.RecipetoolTests.test_recipetool_appendfile_extlayer)
2018-11-29 19:20:08,415 - oe-selftest - INFO - recipetool.RecipetoolTests.test_recipetool_appendfile_inst_func (subunit.RemotedTestCase)
2018-11-29 19:20:08,416 - oe-selftest - INFO -  ... ok
2018-11-29 19:20:08,416 - oe-selftest - INFO - 12: 47/69 314/338 (8.93s) (recipetool.RecipetoolTests.test_recipetool_appendfile_inst_func)
2018-11-29 19:20:17,155 - oe-selftest - INFO - recipetool.RecipetoolTests.test_recipetool_appendfile_inst_glob (subunit.RemotedTestCase)
2018-11-29 19:20:17,155 - oe-selftest - INFO -  ... ok
2018-11-29 19:20:17,155 - oe-selftest - INFO - 12: 48/69 315/338 (8.74s) (recipetool.RecipetoolTests.test_recipetool_appendfile_inst_glob)
2018-11-29 19:20:26,550 - oe-selftest - INFO - recipetool.RecipetoolTests.test_recipetool_appendfile_inst_todir_glob (subunit.RemotedTestCase)
2018-11-29 19:20:26,550 - oe-selftest - INFO -  ... ok
2018-11-29 19:20:26,550 - oe-selftest - INFO - 12: 49/69 316/338 (9.39s) (recipetool.RecipetoolTests.test_recipetool_appendfile_inst_todir_glob)
2018-11-29 19:20:33,452 - oe-selftest - INFO - recipetool.RecipetoolTests.test_recipetool_appendfile_invalid (subunit.RemotedTestCase)
2018-11-29 19:20:33,452 - oe-selftest - INFO -  ... ok
2018-11-29 19:20:33,452 - oe-selftest - INFO - 12: 50/69 317/338 (6.90s) (recipetool.RecipetoolTests.test_recipetool_appendfile_invalid)
2018-11-29 19:20:41,984 - oe-selftest - INFO - recipetool.RecipetoolTests.test_recipetool_appendfile_orig (subunit.RemotedTestCase)
2018-11-29 19:20:41,984 - oe-selftest - INFO -  ... ok
2018-11-29 19:20:41,984 - oe-selftest - INFO - 12: 51/69 318/338 (8.53s) (recipetool.RecipetoolTests.test_recipetool_appendfile_orig)
2018-11-29 19:20:50,789 - oe-selftest - INFO - recipetool.RecipetoolTests.test_recipetool_appendfile_patch (subunit.RemotedTestCase)
2018-11-29 19:20:50,789 - oe-selftest - INFO -  ... ok
2018-11-29 19:20:50,789 - oe-selftest - INFO - 12: 52/69 319/338 (8.81s) (recipetool.RecipetoolTests.test_recipetool_appendfile_patch)
2018-11-29 19:21:01,966 - oe-selftest - INFO - recipetool.RecipetoolTests.test_recipetool_appendfile_postinstall (subunit.RemotedTestCase)
2018-11-29 19:21:01,967 - oe-selftest - INFO -  ... ok
2018-11-29 19:21:01,967 - oe-selftest - INFO - 12: 53/69 320/338 (11.18s) (recipetool.RecipetoolTests.test_recipetool_appendfile_postinstall)
2018-11-29 19:21:10,739 - oe-selftest - INFO - recipetool.RecipetoolTests.test_recipetool_appendfile_renamed (subunit.RemotedTestCase)
2018-11-29 19:21:10,739 - oe-selftest - INFO -  ... ok
2018-11-29 19:21:10,739 - oe-selftest - INFO - 12: 54/69 321/338 (8.77s) (recipetool.RecipetoolTests.test_recipetool_appendfile_renamed)
2018-11-29 19:21:19,341 - oe-selftest - INFO - recipetool.RecipetoolTests.test_recipetool_appendfile_script (subunit.RemotedTestCase)
2018-11-29 19:21:19,342 - oe-selftest - INFO -  ... ok
2018-11-29 19:21:19,342 - oe-selftest - INFO - 12: 55/69 322/338 (8.60s) (recipetool.RecipetoolTests.test_recipetool_appendfile_script)
2018-11-29 19:21:28,017 - oe-selftest - INFO - recipetool.RecipetoolTests.test_recipetool_appendfile_src_glob (subunit.RemotedTestCase)
2018-11-29 19:21:28,017 - oe-selftest - INFO -  ... ok
2018-11-29 19:21:28,017 - oe-selftest - INFO - 12: 56/69 323/338 (8.68s) (recipetool.RecipetoolTests.test_recipetool_appendfile_src_glob)
2018-11-29 19:21:36,115 - oe-selftest - INFO - recipetool.RecipetoolTests.test_recipetool_appendfile_subdir (subunit.RemotedTestCase)
2018-11-29 19:21:36,115 - oe-selftest - INFO -  ... ok
2018-11-29 19:21:36,115 - oe-selftest - INFO - 12: 57/69 324/338 (8.10s) (recipetool.RecipetoolTests.test_recipetool_appendfile_subdir)
2018-11-29 19:21:44,169 - oe-selftest - INFO - recipetool.RecipetoolTests.test_recipetool_appendfile_todir (subunit.RemotedTestCase)
2018-11-29 19:21:44,169 - oe-selftest - INFO -  ... ok
2018-11-29 19:21:44,169 - oe-selftest - INFO - 12: 58/69 325/338 (8.05s) (recipetool.RecipetoolTests.test_recipetool_appendfile_todir)
2018-11-29 19:21:52,371 - oe-selftest - INFO - recipetool.RecipetoolTests.test_recipetool_appendfile_wildcard (subunit.RemotedTestCase)
2018-11-29 19:21:52,371 - oe-selftest - INFO -  ... ok
2018-11-29 19:21:52,371 - oe-selftest - INFO - 12: 59/69 326/338 (8.20s) (recipetool.RecipetoolTests.test_recipetool_appendfile_wildcard)
2018-11-29 19:21:58,483 - oe-selftest - INFO - recipetool.RecipetoolTests.test_recipetool_create (subunit.RemotedTestCase)
2018-11-29 19:21:58,483 - oe-selftest - INFO -  ... ok
2018-11-29 19:21:58,484 - oe-selftest - INFO - 12: 60/69 327/338 (6.11s) (recipetool.RecipetoolTests.test_recipetool_create)
2018-11-29 19:23:55,556 - oe-selftest - INFO - recipetool.RecipetoolTests.test_recipetool_create_cmake (subunit.RemotedTestCase)
2018-11-29 19:23:55,557 - oe-selftest - INFO -  ... ok
2018-11-29 19:23:55,557 - oe-selftest - INFO - 12: 61/69 328/338 (117.07s) (recipetool.RecipetoolTests.test_recipetool_create_cmake)
2018-11-29 19:24:07,835 - oe-selftest - INFO - recipetool.RecipetoolTests.test_recipetool_create_git (subunit.RemotedTestCase)
2018-11-29 19:24:07,835 - oe-selftest - INFO -  ... ok
2018-11-29 19:24:07,835 - oe-selftest - INFO - 12: 62/69 329/338 (12.28s) (recipetool.RecipetoolTests.test_recipetool_create_git)
2018-11-29 19:24:12,702 - oe-selftest - INFO - recipetool.RecipetoolTests.test_recipetool_create_git_http (subunit.RemotedTestCase)
2018-11-29 19:24:12,702 - oe-selftest - INFO -  ... ok
2018-11-29 19:24:12,702 - oe-selftest - INFO - 12: 63/69 330/338 (4.87s) (recipetool.RecipetoolTests.test_recipetool_create_git_http)
2018-11-29 19:24:20,921 - oe-selftest - INFO - recipetool.RecipetoolTests.test_recipetool_create_github (subunit.RemotedTestCase)
2018-11-29 19:24:20,921 - oe-selftest - INFO -  ... ok
2018-11-29 19:24:20,921 - oe-selftest - INFO - 12: 64/69 331/338 (8.22s) (recipetool.RecipetoolTests.test_recipetool_create_github)
2018-11-29 19:24:27,441 - oe-selftest - INFO - recipetool.RecipetoolTests.test_recipetool_create_github_tarball (subunit.RemotedTestCase)
2018-11-29 19:24:27,441 - oe-selftest - INFO -  ... ok
2018-11-29 19:24:27,441 - oe-selftest - INFO - 12: 65/69 332/338 (6.52s) (recipetool.RecipetoolTests.test_recipetool_create_github_tarball)
2018-11-29 19:24:32,538 - oe-selftest - INFO - recipetool.RecipetoolTests.test_recipetool_create_simple (subunit.RemotedTestCase)
2018-11-29 19:24:32,538 - oe-selftest - INFO -  ... ok
2018-11-29 19:24:32,538 - oe-selftest - INFO - 12: 66/69 333/338 (5.10s) (recipetool.RecipetoolTests.test_recipetool_create_simple)
2018-11-29 19:24:42,790 - oe-selftest - INFO - devtool.DevtoolUpgradeTests.test_devtool_virtual_kernel_modify (subunit.RemotedTestCase)
2018-11-29 19:24:42,790 - oe-selftest - INFO -  ... ok
2018-11-29 19:24:42,791 - oe-selftest - INFO - 4: 23/24 334/338 (4117.94s) (devtool.DevtoolUpgradeTests.test_devtool_virtual_kernel_modify)
2018-11-29 19:24:43,595 - oe-selftest - INFO - recipetool.RecipetoolTests.test_recipetool_load_plugin (subunit.RemotedTestCase)
2018-11-29 19:24:43,596 - oe-selftest - INFO -  ... ok
2018-11-29 19:24:43,596 - oe-selftest - INFO - 12: 67/69 335/338 (11.06s) (recipetool.RecipetoolTests.test_recipetool_load_plugin)
2018-11-29 19:25:47,149 - oe-selftest - INFO - runtime_test.TestExport.test_testexport_basic (subunit.RemotedTestCase)
2018-11-29 19:25:47,149 - oe-selftest - INFO -  ... ok
2018-11-29 19:25:47,149 - oe-selftest - INFO - 12: 68/69 336/338 (62.17s) (runtime_test.TestExport.test_testexport_basic)
2018-11-29 19:26:54,622 - oe-selftest - INFO - runtime_test.TestExport.test_testexport_sdk (subunit.RemotedTestCase)
2018-11-29 19:26:54,623 - oe-selftest - INFO -  ... ok
2018-11-29 19:26:54,623 - oe-selftest - INFO - 12: 69/69 337/338 (67.47s) (runtime_test.TestExport.test_testexport_sdk)
2018-11-29 19:27:52,612 - oe-selftest - INFO - gotoolchain.oeGoToolchainSelfTest.test_go_dep_build (subunit.RemotedTestCase)
2018-11-29 19:27:52,613 - oe-selftest - INFO -  ... ok
2018-11-29 19:27:52,613 - oe-selftest - INFO - 4: 24/24 338/338 (9.83s) (gotoolchain.oeGoToolchainSelfTest.test_go_dep_build)
2018-11-29 19:31:40,387 - oe-selftest - INFO - ======================================================================
2018-11-29 19:31:40,388 - oe-selftest - INFO - FAIL: runcmd.RunCmdTests.test_stdin (subunit.RemotedTestCase)
2018-11-29 19:31:40,388 - oe-selftest - INFO - ----------------------------------------------------------------------
2018-11-29 19:31:40,388 - oe-selftest - INFO - testtools.testresult.real._StringException: Traceback (most recent call last):
  File "/home/pokybuild/yocto-worker/oe-selftest-ubuntu/build/meta/lib/oeqa/core/decorator/__init__.py", line 32, in wrapped_f
    return func(*args, **kwargs)
  File "/home/pokybuild/yocto-worker/oe-selftest-ubuntu/build/meta/lib/oeqa/selftest/cases/runcmd.py", line 110, in test_stdin
    self.assertEqual(numthreads, threading.active_count())
  File "/usr/lib/python3.5/unittest/case.py", line 820, in assertEqual
    assertion_func(first, second, msg=msg)
  File "/usr/lib/python3.5/unittest/case.py", line 813, in _baseAssertEqual
    raise self.failureException(msg)
AssertionError: 1 != 2


2018-11-29 19:31:40,388 - oe-selftest - INFO - ----------------------------------------------------------------------
2018-11-29 19:31:40,388 - oe-selftest - INFO - Ran 338 tests in 7848.849s
2018-11-29 19:31:40,389 - oe-selftest - INFO - FAILED
2018-11-29 19:31:40,389 - oe-selftest - INFO -  (failures=1, skipped=1)
2018-11-29 19:31:45,429 - oe-selftest - INFO - RESULTS:
2018-11-29 19:31:45,707 - oe-selftest - INFO - RESULTS - archiver.Archiver.test_archiver_allows_to_filter_on_recipe_name - Testcase 1345: PASSED (41.85s)
2018-11-29 19:31:45,707 - oe-selftest - INFO - RESULTS - archiver.Archiver.test_archiver_filters_by_type - Testcase 1900: PASSED (36.51s)
2018-11-29 19:31:45,707 - oe-selftest - INFO - RESULTS - archiver.Archiver.test_archiver_filters_by_type_and_name - Testcase 1901: PASSED (38.39s)
2018-11-29 19:31:45,707 - oe-selftest - INFO - RESULTS - archiver.Archiver.test_archiver_srpm_mode - Testcase -1: PASSED (339.11s)
2018-11-29 19:31:45,708 - oe-selftest - INFO - RESULTS - bblayers.BitbakeLayers.test_bitbakelayers_add_remove - Testcase 1195: PASSED (91.49s)
2018-11-29 19:31:45,708 - oe-selftest - INFO - RESULTS - bblayers.BitbakeLayers.test_bitbakelayers_createlayer - Testcase -1: PASSED (13.50s)
2018-11-29 19:31:45,708 - oe-selftest - INFO - RESULTS - bblayers.BitbakeLayers.test_bitbakelayers_flatten - Testcase 95: PASSED (30.40s)
2018-11-29 19:31:45,708 - oe-selftest - INFO - RESULTS - bblayers.BitbakeLayers.test_bitbakelayers_showappends - Testcase 93: PASSED (24.51s)
2018-11-29 19:31:45,708 - oe-selftest - INFO - RESULTS - bblayers.BitbakeLayers.test_bitbakelayers_showcrossdepends - Testcase 756: PASSED (20.88s)
2018-11-29 19:31:45,708 - oe-selftest - INFO - RESULTS - bblayers.BitbakeLayers.test_bitbakelayers_showlayers - Testcase 83: PASSED (5.00s)
2018-11-29 19:31:45,708 - oe-selftest - INFO - RESULTS - bblayers.BitbakeLayers.test_bitbakelayers_showoverlayed - Testcase 90: PASSED (12.22s)
2018-11-29 19:31:45,708 - oe-selftest - INFO - RESULTS - bblayers.BitbakeLayers.test_bitbakelayers_showrecipes - Testcase 1384: PASSED (33.51s)
2018-11-29 19:31:45,708 - oe-selftest - INFO - RESULTS - bbtests.BitbakeTests.test_bbappend_order - Testcase 1425: PASSED (90.38s)
2018-11-29 19:31:45,708 - oe-selftest - INFO - RESULTS - bbtests.BitbakeTests.test_bitbake_g - Testcase 167: PASSED (9.22s)
2018-11-29 19:31:45,708 - oe-selftest - INFO - RESULTS - bbtests.BitbakeTests.test_bitbake_invalid_recipe - Testcase 105: PASSED (2.31s)
2018-11-29 19:31:45,708 - oe-selftest - INFO - RESULTS - bbtests.BitbakeTests.test_bitbake_invalid_target - Testcase 107: PASSED (6.66s)
2018-11-29 19:31:45,708 - oe-selftest - INFO - RESULTS - bbtests.BitbakeTests.test_checkuri - Testcase 1034: PASSED (24.85s)
2018-11-29 19:31:45,708 - oe-selftest - INFO - RESULTS - bbtests.BitbakeTests.test_continue - Testcase 1035: PASSED (906.03s)
2018-11-29 19:31:45,708 - oe-selftest - INFO - RESULTS - bbtests.BitbakeTests.test_dry_run - Testcase 1029: PASSED (8.10s)
2018-11-29 19:31:45,709 - oe-selftest - INFO - RESULTS - bbtests.BitbakeTests.test_environment - Testcase 1028: PASSED (4.14s)
2018-11-29 19:31:45,709 - oe-selftest - INFO - RESULTS - bbtests.BitbakeTests.test_event_handler - Testcase 806: PASSED (15.08s)
2018-11-29 19:31:45,709 - oe-selftest - INFO - RESULTS - bbtests.BitbakeTests.test_force_task_1 - Testcase 1354: PASSED (129.13s)
2018-11-29 19:31:45,709 - oe-selftest - INFO - RESULTS - bbtests.BitbakeTests.test_force_task_2 - Testcase 163: PASSED (83.78s)
2018-11-29 19:31:45,709 - oe-selftest - INFO - RESULTS - bbtests.BitbakeTests.test_image_manifest - Testcase 899: PASSED (1140.24s)
2018-11-29 19:31:45,709 - oe-selftest - INFO - RESULTS - bbtests.BitbakeTests.test_invalid_patch - Testcase 108: PASSED (15.61s)
2018-11-29 19:31:45,709 - oe-selftest - INFO - RESULTS - bbtests.BitbakeTests.test_invalid_recipe_src_uri - Testcase 168: PASSED (16.23s)
2018-11-29 19:31:45,709 - oe-selftest - INFO - RESULTS - bbtests.BitbakeTests.test_just_parse - Testcase 1030: PASSED (1.94s)
2018-11-29 19:31:45,709 - oe-selftest - INFO - RESULTS - bbtests.BitbakeTests.test_local_sstate - Testcase 103: PASSED (14.06s)
2018-11-29 19:31:45,709 - oe-selftest - INFO - RESULTS - bbtests.BitbakeTests.test_non_gplv3 - Testcase 1119: PASSED (22.00s)
2018-11-29 19:31:45,709 - oe-selftest - INFO - RESULTS - bbtests.BitbakeTests.test_postfile - Testcase 1033: PASSED (1.30s)
2018-11-29 19:31:45,709 - oe-selftest - INFO - RESULTS - bbtests.BitbakeTests.test_prefile - Testcase 1032: PASSED (2.47s)
2018-11-29 19:31:45,709 - oe-selftest - INFO - RESULTS - bbtests.BitbakeTests.test_rename_downloaded_file - Testcase 171: PASSED (7.66s)
2018-11-29 19:31:45,709 - oe-selftest - INFO - RESULTS - bbtests.BitbakeTests.test_run_bitbake_from_dir_1 - Testcase 789: PASSED (1.07s)
2018-11-29 19:31:45,709 - oe-selftest - INFO - RESULTS - bbtests.BitbakeTests.test_run_bitbake_from_dir_2 - Testcase 790: PASSED (1.11s)
2018-11-29 19:31:45,709 - oe-selftest - INFO - RESULTS - bbtests.BitbakeTests.test_run_bitbake_from_dir_3 - Testcase -1: PASSED (1.32s)
2018-11-29 19:31:45,710 - oe-selftest - INFO - RESULTS - bbtests.BitbakeTests.test_setscene_only - Testcase 1422: PASSED (13.45s)
2018-11-29 19:31:45,710 - oe-selftest - INFO - RESULTS - bbtests.BitbakeTests.test_version - Testcase 1031: PASSED (2.47s)
2018-11-29 19:31:45,710 - oe-selftest - INFO - RESULTS - bbtests.BitbakeTests.test_warnings_errors - Testcase 106: PASSED (1.72s)
2018-11-29 19:31:45,710 - oe-selftest - INFO - RESULTS - buildoptions.ArchiverTest.test_arch_work_dir_and_export_source - Testcase 926: PASSED (127.92s)
2018-11-29 19:31:45,710 - oe-selftest - INFO - RESULTS - buildoptions.BuildhistoryTests.test_buildhistory_basic - Testcase 293: PASSED (18.65s)
2018-11-29 19:31:45,710 - oe-selftest - INFO - RESULTS - buildoptions.BuildhistoryTests.test_buildhistory_buildtime_pr_backwards - Testcase 294: PASSED (35.41s)
2018-11-29 19:31:45,710 - oe-selftest - INFO - RESULTS - buildoptions.DiskMonTest.test_stoptask_behavior - Testcase 277: PASSED (71.41s)
2018-11-29 19:31:45,710 - oe-selftest - INFO - RESULTS - buildoptions.ImageOptionsTests.test_ccache_tool - Testcase 286: PASSED (78.37s)
2018-11-29 19:31:45,710 - oe-selftest - INFO - RESULTS - buildoptions.ImageOptionsTests.test_incremental_image_generation - Testcase 761: PASSED (195.85s)
2018-11-29 19:31:45,710 - oe-selftest - INFO - RESULTS - buildoptions.ImageOptionsTests.test_read_only_image - Testcase 1435: PASSED (394.06s)
2018-11-29 19:31:45,710 - oe-selftest - INFO - RESULTS - buildoptions.SanityOptionsTest.test_layer_without_git_dir - Testcase 1421: PASSED (9.54s)
2018-11-29 19:31:45,710 - oe-selftest - INFO - RESULTS - buildoptions.SanityOptionsTest.test_options_warnqa_errorqa_switch - Testcase 927: PASSED (37.09s)
2018-11-29 19:31:45,710 - oe-selftest - INFO - RESULTS - buildoptions.SourceMirroring.test_yocto_source_mirror - Testcase -1: PASSED (91.34s)
2018-11-29 19:31:45,710 - oe-selftest - INFO - RESULTS - buildoptions.ToolchainOptions.test_toolchain_fortran - Testcase -1: PASSED (36.58s)
2018-11-29 19:31:45,710 - oe-selftest - INFO - RESULTS - containerimage.ContainerImageTests.test_expected_files - Testcase 1619: PASSED (24.63s)
2018-11-29 19:31:45,710 - oe-selftest - INFO - RESULTS - devtool.DevtoolAddTests.test_devtool_add - Testcase 1159: PASSED (49.26s)
2018-11-29 19:31:45,711 - oe-selftest - INFO - RESULTS - devtool.DevtoolAddTests.test_devtool_add_fetch - Testcase 1160: PASSED (109.39s)
2018-11-29 19:31:45,711 - oe-selftest - INFO - RESULTS - devtool.DevtoolAddTests.test_devtool_add_fetch_git - Testcase 1161: PASSED (41.37s)
2018-11-29 19:31:45,711 - oe-selftest - INFO - RESULTS - devtool.DevtoolAddTests.test_devtool_add_fetch_simple - Testcase 1391: PASSED (14.51s)
2018-11-29 19:31:45,711 - oe-selftest - INFO - RESULTS - devtool.DevtoolAddTests.test_devtool_add_git_local - Testcase 1423: PASSED (23.34s)
2018-11-29 19:31:45,711 - oe-selftest - INFO - RESULTS - devtool.DevtoolAddTests.test_devtool_add_library - Testcase 1162: PASSED (74.80s)
2018-11-29 19:31:45,711 - oe-selftest - INFO - RESULTS - devtool.DevtoolExtractTests.test_devtool_build_image - Testcase 1366: PASSED (209.38s)
2018-11-29 19:31:45,711 - oe-selftest - INFO - RESULTS - devtool.DevtoolExtractTests.test_devtool_deploy_target - Testcase 1272: PASSED (181.40s)
2018-11-29 19:31:45,711 - oe-selftest - INFO - RESULTS - devtool.DevtoolExtractTests.test_devtool_extract - Testcase 1163: PASSED (10.90s)
2018-11-29 19:31:45,711 - oe-selftest - INFO - RESULTS - devtool.DevtoolExtractTests.test_devtool_extract_virtual - Testcase 1379: PASSED (7.90s)
2018-11-29 19:31:45,711 - oe-selftest - INFO - RESULTS - devtool.DevtoolExtractTests.test_devtool_reset_all - Testcase 1168: PASSED (100.43s)
2018-11-29 19:31:45,711 - oe-selftest - INFO - RESULTS - devtool.DevtoolModifyTests.test_devtool_buildclean - Testcase 1620: PASSED (691.35s)
2018-11-29 19:31:45,711 - oe-selftest - INFO - RESULTS - devtool.DevtoolModifyTests.test_devtool_modify - Testcase 1164: PASSED (1817.84s)
2018-11-29 19:31:45,711 - oe-selftest - INFO - RESULTS - devtool.DevtoolModifyTests.test_devtool_modify_git - Testcase 1165: PASSED (57.90s)
2018-11-29 19:31:45,711 - oe-selftest - INFO - RESULTS - devtool.DevtoolModifyTests.test_devtool_modify_invalid - Testcase 1166: PASSED (118.20s)
2018-11-29 19:31:45,711 - oe-selftest - INFO - RESULTS - devtool.DevtoolModifyTests.test_devtool_modify_localfiles - Testcase 1167: PASSED (148.26s)
2018-11-29 19:31:45,711 - oe-selftest - INFO - RESULTS - devtool.DevtoolModifyTests.test_devtool_modify_native - Testcase 1365: PASSED (209.89s)
2018-11-29 19:31:45,712 - oe-selftest - INFO - RESULTS - devtool.DevtoolModifyTests.test_devtool_modify_virtual - Testcase 1378: PASSED (9.72s)
2018-11-29 19:31:45,712 - oe-selftest - INFO - RESULTS - devtool.DevtoolTests.test_create_workspace - Testcase 1158: PASSED (20.13s)
2018-11-29 19:31:45,712 - oe-selftest - INFO - RESULTS - devtool.DevtoolUpdateTests.test_devtool_update_recipe - Testcase 1169: PASSED (22.57s)
2018-11-29 19:31:45,712 - oe-selftest - INFO - RESULTS - devtool.DevtoolUpdateTests.test_devtool_update_recipe_append - Testcase 1170: PASSED (33.58s)
2018-11-29 19:31:45,712 - oe-selftest - INFO - RESULTS - devtool.DevtoolUpdateTests.test_devtool_update_recipe_append_git - Testcase 1171: PASSED (31.30s)
2018-11-29 19:31:45,712 - oe-selftest - INFO - RESULTS - devtool.DevtoolUpdateTests.test_devtool_update_recipe_git - Testcase 1172: PASSED (17.08s)
2018-11-29 19:31:45,712 - oe-selftest - INFO - RESULTS - devtool.DevtoolUpdateTests.test_devtool_update_recipe_local_files - Testcase 1370: PASSED (25.05s)
2018-11-29 19:31:45,712 - oe-selftest - INFO - RESULTS - devtool.DevtoolUpdateTests.test_devtool_update_recipe_local_files_2 - Testcase 1371: PASSED (16.81s)
2018-11-29 19:31:45,712 - oe-selftest - INFO - RESULTS - devtool.DevtoolUpdateTests.test_devtool_update_recipe_local_files_3 - Testcase 1627: PASSED (16.31s)
2018-11-29 19:31:45,712 - oe-selftest - INFO - RESULTS - devtool.DevtoolUpdateTests.test_devtool_update_recipe_local_files_subdir - Testcase 1628: PASSED (19.62s)
2018-11-29 19:31:45,712 - oe-selftest - INFO - RESULTS - devtool.DevtoolUpdateTests.test_devtool_update_recipe_local_patch_gz - Testcase 1629: PASSED (31.44s)
2018-11-29 19:31:45,712 - oe-selftest - INFO - RESULTS - devtool.DevtoolUpgradeTests.test_devtool_finish_modify_origlayer - Testcase 1621: PASSED (36.16s)
2018-11-29 19:31:45,712 - oe-selftest - INFO - RESULTS - devtool.DevtoolUpgradeTests.test_devtool_finish_modify_otherlayer - Testcase 1622: PASSED (27.23s)
2018-11-29 19:31:45,712 - oe-selftest - INFO - RESULTS - devtool.DevtoolUpgradeTests.test_devtool_finish_upgrade_origlayer - Testcase 1623: PASSED (23.63s)
2018-11-29 19:31:45,712 - oe-selftest - INFO - RESULTS - devtool.DevtoolUpgradeTests.test_devtool_finish_upgrade_otherlayer - Testcase 1624: PASSED (23.18s)
2018-11-29 19:31:45,712 - oe-selftest - INFO - RESULTS - devtool.DevtoolUpgradeTests.test_devtool_layer_plugins - Testcase 1352: PASSED (1.38s)
2018-11-29 19:31:45,713 - oe-selftest - INFO - RESULTS - devtool.DevtoolUpgradeTests.test_devtool_load_plugin - Testcase 1625: PASSED (8.51s)
2018-11-29 19:31:45,713 - oe-selftest - INFO - RESULTS - devtool.DevtoolUpgradeTests.test_devtool_rename - Testcase 1626: PASSED (29.25s)
2018-11-29 19:31:45,713 - oe-selftest - INFO - RESULTS - devtool.DevtoolUpgradeTests.test_devtool_upgrade - Testcase 1367: PASSED (21.72s)
2018-11-29 19:31:45,713 - oe-selftest - INFO - RESULTS - devtool.DevtoolUpgradeTests.test_devtool_upgrade_git - Testcase 1433: PASSED (19.50s)
2018-11-29 19:31:45,713 - oe-selftest - INFO - RESULTS - devtool.DevtoolUpgradeTests.test_devtool_virtual_kernel_modify - Testcase 1577: PASSED (4117.94s)
2018-11-29 19:31:45,713 - oe-selftest - INFO - RESULTS - distrodata.Distrodata.test_maintainers - Testcase -1: PASSED (22.30s)
2018-11-29 19:31:45,713 - oe-selftest - INFO - RESULTS - eSDK.oeSDKExtSelfTest.test_image_generation_binary_feeds - Testcase 1603: PASSED (60.21s)
2018-11-29 19:31:45,713 - oe-selftest - INFO - RESULTS - eSDK.oeSDKExtSelfTest.test_install_libraries_headers - Testcase 1602: PASSED (7.18s)
2018-11-29 19:31:45,713 - oe-selftest - INFO - RESULTS - efibootpartition.GenericEFITest.test_boot_efi - Testcase -1: PASSED (2568.64s)
2018-11-29 19:31:45,713 - oe-selftest - INFO - RESULTS - fetch.Fetch.test_git_mirrors - Testcase 1058: PASSED (27.91s)
2018-11-29 19:31:45,713 - oe-selftest - INFO - RESULTS - gotoolchain.oeGoToolchainSelfTest.test_go_dep_build - Testcase -1: PASSED (9.83s)
2018-11-29 19:31:45,713 - oe-selftest - INFO - RESULTS - image_typedep.ImageTypeDepTests.test_conversion_typedep_added - Testcase 1633: PASSED (11.79s)
2018-11-29 19:31:45,713 - oe-selftest - INFO - RESULTS - imagefeatures.ImageFeatures.test_all_users_can_connect_via_ssh_without_password - Testcase 1115: PASSED (2652.78s)
2018-11-29 19:31:45,713 - oe-selftest - INFO - RESULTS - imagefeatures.ImageFeatures.test_bmap - Testcase 1497: PASSED (48.09s)
2018-11-29 19:31:45,713 - oe-selftest - INFO - RESULTS - imagefeatures.ImageFeatures.test_clutter_image_can_be_built - Testcase 1116: PASSED (586.14s)
2018-11-29 19:31:45,713 - oe-selftest - INFO - RESULTS - imagefeatures.ImageFeatures.test_hypervisor_fmts - Testcase 1903: PASSED (98.48s)
2018-11-29 19:31:45,714 - oe-selftest - INFO - RESULTS - imagefeatures.ImageFeatures.test_image_fstypes - Testcase 1904: PASSED (78.05s)
2018-11-29 19:31:45,714 - oe-selftest - INFO - RESULTS - imagefeatures.ImageFeatures.test_long_chain_conversion - Testcase 1905: PASSED (47.95s)
2018-11-29 19:31:45,714 - oe-selftest - INFO - RESULTS - imagefeatures.ImageFeatures.test_non_root_user_can_connect_via_ssh_without_password - Testcase 1107: PASSED (54.38s)
2018-11-29 19:31:45,714 - oe-selftest - INFO - RESULTS - imagefeatures.ImageFeatures.test_useradd_static - Testcase -1: PASSED (406.22s)
2018-11-29 19:31:45,714 - oe-selftest - INFO - RESULTS - imagefeatures.ImageFeatures.test_wayland_support_in_image - Testcase 1117: PASSED (256.42s)
2018-11-29 19:31:45,714 - oe-selftest - INFO - RESULTS - layerappend.LayerAppendTests.test_layer_appends - Testcase 1196: PASSED (31.95s)
2018-11-29 19:31:45,714 - oe-selftest - INFO - RESULTS - liboe.LibOE.test_copy_hardlink_tree_count - Testcase 1634: PASSED (0.33s)
2018-11-29 19:31:45,714 - oe-selftest - INFO - RESULTS - liboe.LibOE.test_copy_tree_special - Testcase 1635: PASSED (0.14s)
2018-11-29 19:31:45,714 - oe-selftest - INFO - RESULTS - liboe.LibOE.test_copy_tree_xattr - Testcase 1636: PASSED (109.60s)
2018-11-29 19:31:45,714 - oe-selftest - INFO - RESULTS - lic_checksum.LicenseTests.test_nonmatching_checksum - Testcase 1197: PASSED (14.81s)
2018-11-29 19:31:45,714 - oe-selftest - INFO - RESULTS - manifest.VerifyManifest.test_SDK_manifest_entries - Testcase 1380: PASSED (381.79s)
2018-11-29 19:31:45,714 - oe-selftest - INFO - RESULTS - manifest.VerifyManifest.test_image_manifest_entries - Testcase 1381: PASSED (14.95s)
2018-11-29 19:31:45,714 - oe-selftest - INFO - RESULTS - meta_ide.MetaIDE.test_meta_ide_can_build_cpio_project - Testcase 1984: PASSED (53.67s)
2018-11-29 19:31:45,714 - oe-selftest - INFO - RESULTS - meta_ide.MetaIDE.test_meta_ide_can_compile_c_program - Testcase 1983: PASSED (0.22s)
2018-11-29 19:31:45,714 - oe-selftest - INFO - RESULTS - meta_ide.MetaIDE.test_meta_ide_had_installed_meta_ide_support - Testcase 1982: PASSED (0.01s)
2018-11-29 19:31:45,714 - oe-selftest - INFO - RESULTS - oelib.buildhistory.TestBlobParsing.test_blob_to_dict - Testcase 1859: PASSED (1.55s)
2018-11-29 19:31:45,714 - oe-selftest - INFO - RESULTS - oelib.buildhistory.TestBlobParsing.test_compare_dict_blobs - Testcase 1860: PASSED (1.91s)
2018-11-29 19:31:45,715 - oe-selftest - INFO - RESULTS - oelib.buildhistory.TestBlobParsing.test_compare_dict_blobs_default - Testcase 1861: PASSED (2.07s)
2018-11-29 19:31:45,715 - oe-selftest - INFO - RESULTS - oelib.elf.TestElf.test_machine_name - Testcase -1: PASSED (0.01s)
2018-11-29 19:31:45,715 - oe-selftest - INFO - RESULTS - oelib.license.TestComplexCombinations.test_tests - Testcase -1: PASSED (0.01s)
2018-11-29 19:31:45,715 - oe-selftest - INFO - RESULTS - oelib.license.TestIsIncluded.test_tests - Testcase -1: PASSED (0.01s)
2018-11-29 19:31:45,715 - oe-selftest - INFO - RESULTS - oelib.license.TestSimpleCombinations.test_tests - Testcase -1: PASSED (0.01s)
2018-11-29 19:31:45,715 - oe-selftest - INFO - RESULTS - oelib.license.TestSingleLicense.test_invalid_licenses - Testcase -1: PASSED (0.00s)
2018-11-29 19:31:45,715 - oe-selftest - INFO - RESULTS - oelib.license.TestSingleLicense.test_single_licenses - Testcase -1: PASSED (0.00s)
2018-11-29 19:31:45,715 - oe-selftest - INFO - RESULTS - oelib.path.TestRealPath.test_loop - Testcase -1: PASSED (0.01s)
2018-11-29 19:31:45,715 - oe-selftest - INFO - RESULTS - oelib.path.TestRealPath.test_norm - Testcase -1: PASSED (0.01s)
2018-11-29 19:31:45,715 - oe-selftest - INFO - RESULTS - oelib.path.TestRealPath.test_phys - Testcase -1: PASSED (0.00s)
2018-11-29 19:31:45,715 - oe-selftest - INFO - RESULTS - oelib.types.TestBooleanType.test_bool_equality - Testcase -1: PASSED (0.00s)
2018-11-29 19:31:45,715 - oe-selftest - INFO - RESULTS - oelib.types.TestBooleanType.test_false - Testcase -1: PASSED (0.00s)
2018-11-29 19:31:45,715 - oe-selftest - INFO - RESULTS - oelib.types.TestBooleanType.test_invalid - Testcase -1: PASSED (0.00s)
2018-11-29 19:31:45,715 - oe-selftest - INFO - RESULTS - oelib.types.TestBooleanType.test_true - Testcase -1: PASSED (0.00s)
2018-11-29 19:31:45,715 - oe-selftest - INFO - RESULTS - oelib.types.TestList.test_list_nosep - Testcase -1: PASSED (1.37s)
2018-11-29 19:31:45,715 - oe-selftest - INFO - RESULTS - oelib.types.TestList.test_list_usersep - Testcase -1: PASSED (1.37s)
2018-11-29 19:31:45,715 - oe-selftest - INFO - RESULTS - oelib.utils.TestMultiprocessLaunch.test_multiprocesslaunch - Testcase -1: PASSED (0.05s)
2018-11-29 19:31:45,716 - oe-selftest - INFO - RESULTS - oelib.utils.TestPackagesFilterOutSystem.test_filter - Testcase -1: PASSED (0.01s)
2018-11-29 19:31:45,716 - oe-selftest - INFO - RESULTS - oelib.utils.TestTrimVersion.test_num_exception - Testcase -1: PASSED (0.00s)
2018-11-29 19:31:45,716 - oe-selftest - INFO - RESULTS - oelib.utils.TestTrimVersion.test_valid - Testcase -1: PASSED (0.00s)
2018-11-29 19:31:45,716 - oe-selftest - INFO - RESULTS - oelib.utils.TestTrimVersion.test_version_exception - Testcase -1: PASSED (0.00s)
2018-11-29 19:31:45,716 - oe-selftest - INFO - RESULTS - oescripts.BuildhistoryDiffTests.test_buildhistory_diff - Testcase 295: PASSED (97.97s)
2018-11-29 19:31:45,716 - oe-selftest - INFO - RESULTS - package.PackageTests.test_gdb_hardlink_debug - Testcase -1: PASSED (2597.31s)
2018-11-29 19:31:45,716 - oe-selftest - INFO - RESULTS - package.PackageTests.test_preserve_sparse_hardlinks - Testcase -1: PASSED (35.30s)
2018-11-29 19:31:45,716 - oe-selftest - INFO - RESULTS - package.VersionOrdering.test_dpkg - Testcase 1880: PASSED (0.40s)
2018-11-29 19:31:45,716 - oe-selftest - INFO - RESULTS - package.VersionOrdering.test_opkg - Testcase 1881: PASSED (0.34s)
2018-11-29 19:31:45,716 - oe-selftest - INFO - RESULTS - package.VersionOrdering.test_rpm - Testcase 1882: PASSED (0.68s)
2018-11-29 19:31:45,716 - oe-selftest - INFO - RESULTS - pkgdata.OePkgdataUtilTests.test_find_path - Testcase 1198: PASSED (4.64s)
2018-11-29 19:31:45,716 - oe-selftest - INFO - RESULTS - pkgdata.OePkgdataUtilTests.test_glob - Testcase 1200: PASSED (2.41s)
2018-11-29 19:31:45,716 - oe-selftest - INFO - RESULTS - pkgdata.OePkgdataUtilTests.test_list_pkg_files - Testcase 1201: PASSED (6.62s)
2018-11-29 19:31:45,716 - oe-selftest - INFO - RESULTS - pkgdata.OePkgdataUtilTests.test_list_pkgs - Testcase 1202: PASSED (6.60s)
2018-11-29 19:31:45,716 - oe-selftest - INFO - RESULTS - pkgdata.OePkgdataUtilTests.test_lookup_pkg - Testcase 1203: PASSED (4.88s)
2018-11-29 19:31:45,716 - oe-selftest - INFO - RESULTS - pkgdata.OePkgdataUtilTests.test_lookup_recipe - Testcase 1204: PASSED (2.39s)
2018-11-29 19:31:45,717 - oe-selftest - INFO - RESULTS - pkgdata.OePkgdataUtilTests.test_read_value - Testcase 1205: PASSED (2.37s)
2018-11-29 19:31:45,717 - oe-selftest - INFO - RESULTS - pkgdata.OePkgdataUtilTests.test_specify_pkgdatadir - Testcase 1206: PASSED (1.45s)
2018-11-29 19:31:45,717 - oe-selftest - INFO - RESULTS - prservice.BitbakePrTests.test_import_export_override_db - Testcase 931: PASSED (551.74s)
2018-11-29 19:31:45,717 - oe-selftest - INFO - RESULTS - prservice.BitbakePrTests.test_import_export_replace_db - Testcase 930: PASSED (101.37s)
2018-11-29 19:31:45,717 - oe-selftest - INFO - RESULTS - prservice.BitbakePrTests.test_pr_service_deb_arch_dep - Testcase 934: PASSED (98.28s)
2018-11-29 19:31:45,717 - oe-selftest - INFO - RESULTS - prservice.BitbakePrTests.test_pr_service_deb_arch_indep - Testcase 937: PASSED (115.39s)
2018-11-29 19:31:45,717 - oe-selftest - INFO - RESULTS - prservice.BitbakePrTests.test_pr_service_ipk_arch_dep - Testcase 933: PASSED (83.63s)
2018-11-29 19:31:45,717 - oe-selftest - INFO - RESULTS - prservice.BitbakePrTests.test_pr_service_ipk_arch_indep - Testcase 936: PASSED (49.24s)
2018-11-29 19:31:45,717 - oe-selftest - INFO - RESULTS - prservice.BitbakePrTests.test_pr_service_rpm_arch_dep - Testcase 932: PASSED (81.60s)
2018-11-29 19:31:45,717 - oe-selftest - INFO - RESULTS - prservice.BitbakePrTests.test_pr_service_rpm_arch_indep - Testcase 935: PASSED (67.32s)
2018-11-29 19:31:45,717 - oe-selftest - INFO - RESULTS - prservice.BitbakePrTests.test_stopping_prservice_message - Testcase 1419: PASSED (2.96s)
2018-11-29 19:31:45,717 - oe-selftest - INFO - RESULTS - recipetool.RecipetoolAppendsrcTests.test_recipetool_appendsrcfile_basic - Testcase 1273: PASSED (78.12s)
2018-11-29 19:31:45,717 - oe-selftest - INFO - RESULTS - recipetool.RecipetoolAppendsrcTests.test_recipetool_appendsrcfile_basic_wildcard - Testcase 1274: PASSED (53.43s)
2018-11-29 19:31:45,717 - oe-selftest - INFO - RESULTS - recipetool.RecipetoolAppendsrcTests.test_recipetool_appendsrcfile_existing_in_src_uri - Testcase 1275: PASSED (31.79s)
2018-11-29 19:31:45,717 - oe-selftest - INFO - RESULTS - recipetool.RecipetoolAppendsrcTests.test_recipetool_appendsrcfile_existing_in_src_uri_diff_params - Testcase 1276: PASSED (42.34s)
2018-11-29 19:31:45,717 - oe-selftest - INFO - RESULTS - recipetool.RecipetoolAppendsrcTests.test_recipetool_appendsrcfile_replace_file_srcdir - Testcase 1277: PASSED (72.96s)
2018-11-29 19:31:45,717 - oe-selftest - INFO - RESULTS - recipetool.RecipetoolAppendsrcTests.test_recipetool_appendsrcfile_srcdir_basic - Testcase 1280: PASSED (37.41s)
2018-11-29 19:31:45,718 - oe-selftest - INFO - RESULTS - recipetool.RecipetoolAppendsrcTests.test_recipetool_appendsrcfile_subdir_basic - Testcase 1281: PASSED (31.06s)
2018-11-29 19:31:45,718 - oe-selftest - INFO - RESULTS - recipetool.RecipetoolAppendsrcTests.test_recipetool_appendsrcfile_subdir_basic_dirdest - Testcase 1282: PASSED (33.87s)
2018-11-29 19:31:45,718 - oe-selftest - INFO - RESULTS - recipetool.RecipetoolAppendsrcTests.test_recipetool_appendsrcfiles_basic - Testcase 1278: PASSED (55.69s)
2018-11-29 19:31:45,718 - oe-selftest - INFO - RESULTS - recipetool.RecipetoolAppendsrcTests.test_recipetool_appendsrcfiles_basic_subdir - Testcase 1279: PASSED (51.27s)
2018-11-29 19:31:45,718 - oe-selftest - INFO - RESULTS - recipetool.RecipetoolTests.test_recipetool_appendfile_add - Testcase 1173: PASSED (19.80s)
2018-11-29 19:31:45,718 - oe-selftest - INFO - RESULTS - recipetool.RecipetoolTests.test_recipetool_appendfile_add_bindir - Testcase 1174: PASSED (8.69s)
2018-11-29 19:31:45,718 - oe-selftest - INFO - RESULTS - recipetool.RecipetoolTests.test_recipetool_appendfile_add_machine - Testcase 1175: PASSED (7.93s)
2018-11-29 19:31:45,718 - oe-selftest - INFO - RESULTS - recipetool.RecipetoolTests.test_recipetool_appendfile_alternatives - Testcase 1176: PASSED (25.36s)
2018-11-29 19:31:45,718 - oe-selftest - INFO - RESULTS - recipetool.RecipetoolTests.test_recipetool_appendfile_basic - Testcase 1177: PASSED (8.86s)
2018-11-29 19:31:45,718 - oe-selftest - INFO - RESULTS - recipetool.RecipetoolTests.test_recipetool_appendfile_binary - Testcase 1178: PASSED (2.65s)
2018-11-29 19:31:45,718 - oe-selftest - INFO - RESULTS - recipetool.RecipetoolTests.test_recipetool_appendfile_extlayer - Testcase 1179: PASSED (2.82s)
2018-11-29 19:31:45,718 - oe-selftest - INFO - RESULTS - recipetool.RecipetoolTests.test_recipetool_appendfile_inst_func - Testcase 1180: PASSED (8.94s)
2018-11-29 19:31:45,718 - oe-selftest - INFO - RESULTS - recipetool.RecipetoolTests.test_recipetool_appendfile_inst_glob - Testcase 1181: PASSED (8.74s)
2018-11-29 19:31:45,718 - oe-selftest - INFO - RESULTS - recipetool.RecipetoolTests.test_recipetool_appendfile_inst_todir_glob - Testcase 1182: PASSED (9.40s)
2018-11-29 19:31:45,718 - oe-selftest - INFO - RESULTS - recipetool.RecipetoolTests.test_recipetool_appendfile_invalid - Testcase 1183: PASSED (6.90s)
2018-11-29 19:31:45,718 - oe-selftest - INFO - RESULTS - recipetool.RecipetoolTests.test_recipetool_appendfile_orig - Testcase 1184: PASSED (8.53s)
2018-11-29 19:31:45,718 - oe-selftest - INFO - RESULTS - recipetool.RecipetoolTests.test_recipetool_appendfile_patch - Testcase 1185: PASSED (8.81s)
2018-11-29 19:31:45,719 - oe-selftest - INFO - RESULTS - recipetool.RecipetoolTests.test_recipetool_appendfile_postinstall - Testcase 1186: PASSED (11.18s)
2018-11-29 19:31:45,719 - oe-selftest - INFO - RESULTS - recipetool.RecipetoolTests.test_recipetool_appendfile_renamed - Testcase 1187: PASSED (8.77s)
2018-11-29 19:31:45,719 - oe-selftest - INFO - RESULTS - recipetool.RecipetoolTests.test_recipetool_appendfile_script - Testcase 1188: PASSED (8.60s)
2018-11-29 19:31:45,719 - oe-selftest - INFO - RESULTS - recipetool.RecipetoolTests.test_recipetool_appendfile_src_glob - Testcase 1189: PASSED (8.68s)
2018-11-29 19:31:45,719 - oe-selftest - INFO - RESULTS - recipetool.RecipetoolTests.test_recipetool_appendfile_subdir - Testcase 1190: PASSED (8.10s)
2018-11-29 19:31:45,719 - oe-selftest - INFO - RESULTS - recipetool.RecipetoolTests.test_recipetool_appendfile_todir - Testcase 1191: PASSED (8.05s)
2018-11-29 19:31:45,719 - oe-selftest - INFO - RESULTS - recipetool.RecipetoolTests.test_recipetool_appendfile_wildcard - Testcase 1192: PASSED (8.20s)
2018-11-29 19:31:45,719 - oe-selftest - INFO - RESULTS - recipetool.RecipetoolTests.test_recipetool_create - Testcase 1193: PASSED (6.11s)
2018-11-29 19:31:45,719 - oe-selftest - INFO - RESULTS - recipetool.RecipetoolTests.test_recipetool_create_cmake - Testcase 1418: PASSED (117.07s)
2018-11-29 19:31:45,720 - oe-selftest - INFO - RESULTS - recipetool.RecipetoolTests.test_recipetool_create_git - Testcase 1194: PASSED (12.28s)
2018-11-29 19:31:45,720 - oe-selftest - INFO - RESULTS - recipetool.RecipetoolTests.test_recipetool_create_git_http - Testcase 1637: PASSED (4.87s)
2018-11-29 19:31:45,720 - oe-selftest - INFO - RESULTS - recipetool.RecipetoolTests.test_recipetool_create_github - Testcase 1638: PASSED (8.22s)
2018-11-29 19:31:45,720 - oe-selftest - INFO - RESULTS - recipetool.RecipetoolTests.test_recipetool_create_github_tarball - Testcase 1639: PASSED (6.52s)
2018-11-29 19:31:45,720 - oe-selftest - INFO - RESULTS - recipetool.RecipetoolTests.test_recipetool_create_simple - Testcase 1392: PASSED (5.10s)
2018-11-29 19:31:45,720 - oe-selftest - INFO - RESULTS - recipetool.RecipetoolTests.test_recipetool_load_plugin - Testcase 1640: PASSED (11.06s)
2018-11-29 19:31:45,720 - oe-selftest - INFO - RESULTS - recipeutils.RecipeUtilsTests.test_patch_recipe_appends - Testcase -1: PASSED (0.48s)
2018-11-29 19:31:45,720 - oe-selftest - INFO - RESULTS - recipeutils.RecipeUtilsTests.test_patch_recipe_singleappend - Testcase -1: PASSED (0.36s)
2018-11-29 19:31:45,720 - oe-selftest - INFO - RESULTS - recipeutils.RecipeUtilsTests.test_patch_recipe_varflag - Testcase -1: PASSED (0.45s)
2018-11-29 19:31:45,721 - oe-selftest - INFO - RESULTS - recipeutils.RecipeUtilsTests.test_split_var_value - Testcase -1: PASSED (0.01s)
2018-11-29 19:31:45,721 - oe-selftest - INFO - RESULTS - recipeutils.RecipeUtilsTests.test_validate_pn - Testcase -1: PASSED (0.01s)
2018-11-29 19:31:45,721 - oe-selftest - INFO - RESULTS - runcmd.RunCmdTests.test_list_not_found - Testcase 1906: PASSED (0.03s)
2018-11-29 19:31:45,721 - oe-selftest - INFO - RESULTS - runcmd.RunCmdTests.test_list_okay - Testcase 1907: PASSED (0.38s)
2018-11-29 19:31:45,721 - oe-selftest - INFO - RESULTS - runcmd.RunCmdTests.test_log - Testcase 1908: PASSED (0.01s)
2018-11-29 19:31:45,721 - oe-selftest - INFO - RESULTS - runcmd.RunCmdTests.test_log_split - Testcase 1909: PASSED (0.02s)
2018-11-29 19:31:45,721 - oe-selftest - INFO - RESULTS - runcmd.RunCmdTests.test_no_shell - Testcase 1910: PASSED (0.01s)
2018-11-29 19:31:45,721 - oe-selftest - INFO - RESULTS - runcmd.RunCmdTests.test_output - Testcase 1911: PASSED (0.01s)
2018-11-29 19:31:45,721 - oe-selftest - INFO - RESULTS - runcmd.RunCmdTests.test_output_split - Testcase 1912: PASSED (0.02s)
2018-11-29 19:31:45,721 - oe-selftest - INFO - RESULTS - runcmd.RunCmdTests.test_result_assertion - Testcase 1913: PASSED (0.05s)
2018-11-29 19:31:45,721 - oe-selftest - INFO - RESULTS - runcmd.RunCmdTests.test_result_exception - Testcase 1914: PASSED (0.03s)
2018-11-29 19:31:45,721 - oe-selftest - INFO - RESULTS - runcmd.RunCmdTests.test_result_false - Testcase 1915: PASSED (0.04s)
2018-11-29 19:31:45,721 - oe-selftest - INFO - RESULTS - runcmd.RunCmdTests.test_result_okay - Testcase 1916: PASSED (0.04s)
2018-11-29 19:31:45,721 - oe-selftest - INFO - RESULTS - runcmd.RunCmdTests.test_shell - Testcase 1917: PASSED (0.05s)
2018-11-29 19:31:45,721 - oe-selftest - INFO - RESULTS - runcmd.RunCmdTests.test_stdin_timeout - Testcase 1919: PASSED (5.06s)
2018-11-29 19:31:45,721 - oe-selftest - INFO - RESULTS - runcmd.RunCmdTests.test_timeout - Testcase 1920: PASSED (5.74s)
2018-11-29 19:31:45,721 - oe-selftest - INFO - RESULTS - runcmd.RunCmdTests.test_timeout_split - Testcase 1921: PASSED (5.03s)
2018-11-29 19:31:45,722 - oe-selftest - INFO - RESULTS - runqemu.QemuTest.test_qemu_can_shutdown - Testcase -1: PASSED (33.02s)
2018-11-29 19:31:45,722 - oe-selftest - INFO - RESULTS - runqemu.RunqemuTests.test_boot_deploy - Testcase 2007: PASSED (2549.55s)
2018-11-29 19:31:45,722 - oe-selftest - INFO - RESULTS - runqemu.RunqemuTests.test_boot_deploy_hddimg - Testcase 2008: PASSED (68.51s)
2018-11-29 19:31:45,722 - oe-selftest - INFO - RESULTS - runqemu.RunqemuTests.test_boot_machine - Testcase 2001: PASSED (35.65s)
2018-11-29 19:31:45,722 - oe-selftest - INFO - RESULTS - runqemu.RunqemuTests.test_boot_machine_ext4 - Testcase 2002: PASSED (32.89s)
2018-11-29 19:31:45,722 - oe-selftest - INFO - RESULTS - runqemu.RunqemuTests.test_boot_machine_iso - Testcase 2003: PASSED (72.34s)
2018-11-29 19:31:45,722 - oe-selftest - INFO - RESULTS - runqemu.RunqemuTests.test_boot_machine_slirp - Testcase 2009: PASSED (48.94s)
2018-11-29 19:31:45,722 - oe-selftest - INFO - RESULTS - runqemu.RunqemuTests.test_boot_machine_slirp_qcow2 - Testcase 2009: PASSED (67.31s)
2018-11-29 19:31:45,722 - oe-selftest - INFO - RESULTS - runqemu.RunqemuTests.test_boot_qemu_boot - Testcase 2010: PASSED (47.65s)
2018-11-29 19:31:45,722 - oe-selftest - INFO - RESULTS - runqemu.RunqemuTests.test_boot_recipe_image - Testcase 2004: PASSED (39.39s)
2018-11-29 19:31:45,722 - oe-selftest - INFO - RESULTS - runqemu.RunqemuTests.test_boot_recipe_image_vdi - Testcase 2006: PASSED (52.39s)
2018-11-29 19:31:45,722 - oe-selftest - INFO - RESULTS - runqemu.RunqemuTests.test_boot_recipe_image_vmdk - Testcase 2005: PASSED (40.68s)
2018-11-29 19:31:45,722 - oe-selftest - INFO - RESULTS - runqemu.RunqemuTests.test_boot_rootfs - Testcase 2011: PASSED (31.92s)
2018-11-29 19:31:45,722 - oe-selftest - INFO - RESULTS - runtime_test.Postinst.test_failing_postinst - Testcase -1: PASSED (2717.36s)
2018-11-29 19:31:45,722 - oe-selftest - INFO - RESULTS - runtime_test.Postinst.test_postinst_rootfs_and_boot - Testcase 1540: PASSED (2263.82s)
2018-11-29 19:31:45,722 - oe-selftest - INFO - RESULTS - runtime_test.TestExport.test_testexport_basic - Testcase 1499: PASSED (62.17s)
2018-11-29 19:31:45,723 - oe-selftest - INFO - RESULTS - runtime_test.TestExport.test_testexport_sdk - Testcase 1641: PASSED (67.47s)
2018-11-29 19:31:45,723 - oe-selftest - INFO - RESULTS - runtime_test.TestImage.test_testimage_dnf - Testcase 1883: PASSED (2939.59s)
2018-11-29 19:31:45,723 - oe-selftest - INFO - RESULTS - runtime_test.TestImage.test_testimage_install - Testcase 1644: PASSED (135.27s)
2018-11-29 19:31:45,723 - oe-selftest - INFO - RESULTS - selftest.ExternalLayer.test_list_imported - Testcase 1885: PASSED (0.01s)
2018-11-29 19:31:45,723 - oe-selftest - INFO - RESULTS - signing.LockedSignatures.test_locked_signatures - Testcase 1420: PASSED (176.07s)
2018-11-29 19:31:45,723 - oe-selftest - INFO - RESULTS - signing.Signing.test_signing_packages - Testcase 1362: PASSED (3035.83s)
2018-11-29 19:31:45,723 - oe-selftest - INFO - RESULTS - signing.Signing.test_signing_sstate_archive - Testcase 1382: PASSED (65.97s)
2018-11-29 19:31:45,723 - oe-selftest - INFO - RESULTS - sstatetests.SStateTests.test_autorev_sstate_works - Testcase -1: PASSED (40.77s)
2018-11-29 19:31:45,723 - oe-selftest - INFO - RESULTS - sstatetests.SStateTests.test_cleansstate_task_distro_nonspecific - Testcase 1376: PASSED (26.09s)
2018-11-29 19:31:45,723 - oe-selftest - INFO - RESULTS - sstatetests.SStateTests.test_cleansstate_task_distro_specific - Testcase 1377: PASSED (29.00s)
2018-11-29 19:31:45,723 - oe-selftest - INFO - RESULTS - sstatetests.SStateTests.test_cleansstate_task_distro_specific_nonspecific - Testcase 977: PASSED (26.73s)
2018-11-29 19:31:45,723 - oe-selftest - INFO - RESULTS - sstatetests.SStateTests.test_rebuild_distro_specific_sstate_cross_native_targets - Testcase 175: PASSED (29.76s)
2018-11-29 19:31:45,723 - oe-selftest - INFO - RESULTS - sstatetests.SStateTests.test_rebuild_distro_specific_sstate_cross_target - Testcase 1372: PASSED (22.08s)
2018-11-29 19:31:45,723 - oe-selftest - INFO - RESULTS - sstatetests.SStateTests.test_rebuild_distro_specific_sstate_native_target - Testcase 1373: PASSED (24.30s)
2018-11-29 19:31:45,723 - oe-selftest - INFO - RESULTS - sstatetests.SStateTests.test_sstate_32_64_same_hash - Testcase 1270: PASSED (63.44s)
2018-11-29 19:31:45,723 - oe-selftest - INFO - RESULTS - sstatetests.SStateTests.test_sstate_allarch_samesigs - Testcase 1368: PASSED (69.08s)
2018-11-29 19:31:45,723 - oe-selftest - INFO - RESULTS - sstatetests.SStateTests.test_sstate_cache_management_script_using_machine - Testcase 974: PASSED (62.45s)
2018-11-29 19:31:45,724 - oe-selftest - INFO - RESULTS - sstatetests.SStateTests.test_sstate_cache_management_script_using_pr_1 - Testcase 973: PASSED (125.42s)
2018-11-29 19:31:45,724 - oe-selftest - INFO - RESULTS - sstatetests.SStateTests.test_sstate_cache_management_script_using_pr_2 - Testcase 978: PASSED (177.28s)
2018-11-29 19:31:45,724 - oe-selftest - INFO - RESULTS - sstatetests.SStateTests.test_sstate_cache_management_script_using_pr_3 - Testcase 979: PASSED (205.34s)
2018-11-29 19:31:45,724 - oe-selftest - INFO - RESULTS - sstatetests.SStateTests.test_sstate_creation_distro_nonspecific_fail - Testcase 1375: PASSED (14.48s)
2018-11-29 19:31:45,724 - oe-selftest - INFO - RESULTS - sstatetests.SStateTests.test_sstate_creation_distro_nonspecific_pass - Testcase 976: PASSED (13.71s)
2018-11-29 19:31:45,724 - oe-selftest - INFO - RESULTS - sstatetests.SStateTests.test_sstate_creation_distro_specific_fail - Testcase 1374: PASSED (13.18s)
2018-11-29 19:31:45,724 - oe-selftest - INFO - RESULTS - sstatetests.SStateTests.test_sstate_creation_distro_specific_pass - Testcase 975: PASSED (15.98s)
2018-11-29 19:31:45,724 - oe-selftest - INFO - RESULTS - sstatetests.SStateTests.test_sstate_nativelsbstring_same_hash - Testcase 1271: PASSED (41.83s)
2018-11-29 19:31:45,724 - oe-selftest - INFO - RESULTS - sstatetests.SStateTests.test_sstate_nativesdk_samesigs_multilib - Testcase 1645: PASSED (99.50s)
2018-11-29 19:31:45,724 - oe-selftest - INFO - RESULTS - sstatetests.SStateTests.test_sstate_noop_samesigs - Testcase 1498: PASSED (75.36s)
2018-11-29 19:31:45,724 - oe-selftest - INFO - RESULTS - sstatetests.SStateTests.test_sstate_sametune_samesigs - Testcase 1369: PASSED (141.13s)
2018-11-29 19:31:45,724 - oe-selftest - INFO - RESULTS - tinfoil.TinfoilTests.test_datastore_operations - Testcase 1884: PASSED (0.41s)
2018-11-29 19:31:45,724 - oe-selftest - INFO - RESULTS - tinfoil.TinfoilTests.test_expand - Testcase 1569: PASSED (0.25s)
2018-11-29 19:31:45,724 - oe-selftest - INFO - RESULTS - tinfoil.TinfoilTests.test_getvar - Testcase 1568: PASSED (0.28s)
2018-11-29 19:31:45,724 - oe-selftest - INFO - RESULTS - tinfoil.TinfoilTests.test_getvar_bb_origenv - Testcase 1570: PASSED (0.25s)
2018-11-29 19:31:45,724 - oe-selftest - INFO - RESULTS - tinfoil.TinfoilTests.test_list_recipes - Testcase 1574: PASSED (1.50s)
2018-11-29 19:31:45,724 - oe-selftest - INFO - RESULTS - tinfoil.TinfoilTests.test_parse_recipe - Testcase 1571: PASSED (1.54s)
2018-11-29 19:31:45,725 - oe-selftest - INFO - RESULTS - tinfoil.TinfoilTests.test_parse_recipe_copy_expand - Testcase 1572: PASSED (1.33s)
2018-11-29 19:31:45,725 - oe-selftest - INFO - RESULTS - tinfoil.TinfoilTests.test_parse_recipe_initial_datastore - Testcase 1573: PASSED (1.43s)
2018-11-29 19:31:45,725 - oe-selftest - INFO - RESULTS - tinfoil.TinfoilTests.test_setvariable_clean - Testcase 1576: PASSED (1.04s)
2018-11-29 19:31:45,725 - oe-selftest - INFO - RESULTS - tinfoil.TinfoilTests.test_variable_history - Testcase -1: PASSED (1.44s)
2018-11-29 19:31:45,725 - oe-selftest - INFO - RESULTS - tinfoil.TinfoilTests.test_wait_event - Testcase 1575: PASSED (5.33s)
2018-11-29 19:31:45,725 - oe-selftest - INFO - RESULTS - wic.Wic.test_bootloader_config - Testcase 1385: PASSED (2613.17s)
2018-11-29 19:31:45,725 - oe-selftest - INFO - RESULTS - wic.Wic.test_build_artifacts - Testcase 1212: PASSED (23.65s)
2018-11-29 19:31:45,725 - oe-selftest - INFO - RESULTS - wic.Wic.test_build_image_name - Testcase 1211: PASSED (18.18s)
2018-11-29 19:31:45,725 - oe-selftest - INFO - RESULTS - wic.Wic.test_build_rootfs_long - Testcase 1656: PASSED (71.25s)
2018-11-29 19:31:45,725 - oe-selftest - INFO - RESULTS - wic.Wic.test_build_rootfs_short - Testcase 1564: PASSED (33.23s)
2018-11-29 19:31:45,725 - oe-selftest - INFO - RESULTS - wic.Wic.test_compress_bzip2 - Testcase 1265: PASSED (33.11s)
2018-11-29 19:31:45,725 - oe-selftest - INFO - RESULTS - wic.Wic.test_compress_gzip - Testcase 1264: PASSED (80.90s)
2018-11-29 19:31:45,725 - oe-selftest - INFO - RESULTS - wic.Wic.test_compress_xz - Testcase 1266: PASSED (33.95s)
2018-11-29 19:31:45,725 - oe-selftest - INFO - RESULTS - wic.Wic.test_createhelp - Testcase 1209: PASSED (0.57s)
2018-11-29 19:31:45,725 - oe-selftest - INFO - RESULTS - wic.Wic.test_debug_long - Testcase 1658: PASSED (21.98s)
2018-11-29 19:31:45,725 - oe-selftest - INFO - RESULTS - wic.Wic.test_debug_short - Testcase 1558: PASSED (31.12s)
2018-11-29 19:31:45,725 - oe-selftest - INFO - RESULTS - wic.Wic.test_default_output_dir - Testcase 1562: PASSED (108.01s)
2018-11-29 19:31:45,726 - oe-selftest - INFO - RESULTS - wic.Wic.test_exclude_path - Testcase 1661: PASSED (38.52s)
2018-11-29 19:31:45,726 - oe-selftest - INFO - RESULTS - wic.Wic.test_exclude_path_errors - Testcase 1662: PASSED (39.29s)
2018-11-29 19:31:45,726 - oe-selftest - INFO - RESULTS - wic.Wic.test_gpt_image - Testcase 1157: PASSED (21.00s)
2018-11-29 19:31:45,726 - oe-selftest - INFO - RESULTS - wic.Wic.test_help - Testcase 1208: PASSED (0.72s)
2018-11-29 19:31:45,726 - oe-selftest - INFO - RESULTS - wic.Wic.test_help_create - Testcase 1553: PASSED (0.37s)
2018-11-29 19:31:45,726 - oe-selftest - INFO - RESULTS - wic.Wic.test_help_kickstart - Testcase 1217: PASSED (0.36s)
2018-11-29 19:31:45,726 - oe-selftest - INFO - RESULTS - wic.Wic.test_help_list - Testcase 1554: PASSED (0.35s)
2018-11-29 19:31:45,726 - oe-selftest - INFO - RESULTS - wic.Wic.test_help_overview - Testcase 1215: PASSED (0.32s)
2018-11-29 19:31:45,726 - oe-selftest - INFO - RESULTS - wic.Wic.test_help_plugins - Testcase 1216: PASSED (0.33s)
2018-11-29 19:31:45,726 - oe-selftest - INFO - RESULTS - wic.Wic.test_iso_image - Testcase 1346: PASSED (3673.02s)
2018-11-29 19:31:45,726 - oe-selftest - INFO - RESULTS - wic.Wic.test_list_images - Testcase 1555: PASSED (1.97s)
2018-11-29 19:31:45,726 - oe-selftest - INFO - RESULTS - wic.Wic.test_list_source_plugins - Testcase 1556: PASSED (1.91s)
2018-11-29 19:31:45,726 - oe-selftest - INFO - RESULTS - wic.Wic.test_listed_images_help - Testcase 1557: PASSED (27.81s)
2018-11-29 19:31:45,726 - oe-selftest - INFO - RESULTS - wic.Wic.test_listhelp - Testcase 1210: PASSED (0.41s)
2018-11-29 19:31:45,726 - oe-selftest - INFO - RESULTS - wic.Wic.test_mkefidisk - Testcase 1350: PASSED (14.68s)
2018-11-29 19:31:45,726 - oe-selftest - INFO - RESULTS - wic.Wic.test_no_command - Testcase 1214: PASSED (0.41s)
2018-11-29 19:31:45,726 - oe-selftest - INFO - RESULTS - wic.Wic.test_qemux86_directdisk - Testcase 1348: PASSED (26.93s)
2018-11-29 19:31:45,727 - oe-selftest - INFO - RESULTS - wic.Wic.test_rootfs_artifacts - Testcase 1269: PASSED (31.09s)
2018-11-29 19:31:45,727 - oe-selftest - INFO - RESULTS - wic.Wic.test_rootfs_indirect_recipes - Testcase 1268: PASSED (19.94s)
2018-11-29 19:31:45,727 - oe-selftest - INFO - RESULTS - wic.Wic.test_sdimage_bootpart - Testcase 1561: PASSED (17.24s)
2018-11-29 19:31:45,727 - oe-selftest - INFO - RESULTS - wic.Wic.test_skip_build_check_long - Testcase 1671: PASSED (12.02s)
2018-11-29 19:31:45,727 - oe-selftest - INFO - RESULTS - wic.Wic.test_skip_build_check_short - Testcase 1563: PASSED (11.84s)
2018-11-29 19:31:45,727 - oe-selftest - INFO - RESULTS - wic.Wic.test_systemd_bootdisk - Testcase 1560: PASSED (50.10s)
2018-11-29 19:31:45,727 - oe-selftest - INFO - RESULTS - wic.Wic.test_unsupported_subcommand - Testcase 1213: PASSED (0.33s)
2018-11-29 19:31:45,727 - oe-selftest - INFO - RESULTS - wic.Wic.test_version - Testcase 1552: PASSED (0.34s)
2018-11-29 19:31:45,727 - oe-selftest - INFO - RESULTS - wic.Wic.test_wrong_compressor - Testcase 1267: PASSED (0.33s)
2018-11-29 19:31:45,727 - oe-selftest - INFO - RESULTS - wic.Wic2.test_bmap_long - Testcase 1655: PASSED (47.42s)
2018-11-29 19:31:45,727 - oe-selftest - INFO - RESULTS - wic.Wic2.test_bmap_short - Testcase 1496: PASSED (31.12s)
2018-11-29 19:31:45,727 - oe-selftest - INFO - RESULTS - wic.Wic2.test_expand_mbr_image - Testcase -1: PASSED (123.28s)
2018-11-29 19:31:45,727 - oe-selftest - INFO - RESULTS - wic.Wic2.test_fixed_size - Testcase 1847: PASSED (24.24s)
2018-11-29 19:31:45,727 - oe-selftest - INFO - RESULTS - wic.Wic2.test_fixed_size_error - Testcase 1848: PASSED (14.37s)
2018-11-29 19:31:45,727 - oe-selftest - INFO - RESULTS - wic.Wic2.test_fs_types - Testcase 1849: PASSED (30.72s)
2018-11-29 19:31:45,727 - oe-selftest - INFO - RESULTS - wic.Wic2.test_image_bootpart_globbed - Testcase 1850: PASSED (29.08s)
2018-11-29 19:31:45,727 - oe-selftest - INFO - RESULTS - wic.Wic2.test_image_env - Testcase 1347: PASSED (56.39s)
2018-11-29 19:31:45,728 - oe-selftest - INFO - RESULTS - wic.Wic2.test_image_vars_dir_long - Testcase 1665: PASSED (3.52s)
2018-11-29 19:31:45,728 - oe-selftest - INFO - RESULTS - wic.Wic2.test_image_vars_dir_short - Testcase 1559: PASSED (4.10s)
2018-11-29 19:31:45,728 - oe-selftest - INFO - RESULTS - wic.Wic2.test_kickstart_parser - Testcase 1851: PASSED (23.90s)
2018-11-29 19:31:45,728 - oe-selftest - INFO - RESULTS - wic.Wic2.test_mkfs_extraopts - Testcase 1922: PASSED (17.28s)
2018-11-29 19:31:45,728 - oe-selftest - INFO - RESULTS - wic.Wic2.test_qemu - Testcase 1424: PASSED (78.15s)
2018-11-29 19:31:45,728 - oe-selftest - INFO - RESULTS - wic.Wic2.test_qemu_efi - Testcase 1852: PASSED (80.88s)
2018-11-29 19:31:45,728 - oe-selftest - INFO - RESULTS - wic.Wic2.test_rawcopy_plugin - Testcase 1853: PASSED (17.55s)
2018-11-29 19:31:45,728 - oe-selftest - INFO - RESULTS - wic.Wic2.test_rawcopy_plugin_qemu - Testcase 1854: PASSED (100.17s)
2018-11-29 19:31:45,728 - oe-selftest - INFO - RESULTS - wic.Wic2.test_sparse_copy - Testcase 1855: PASSED (1.31s)
2018-11-29 19:31:45,728 - oe-selftest - INFO - RESULTS - wic.Wic2.test_wic_cp - Testcase 1856: PASSED (17.53s)
2018-11-29 19:31:45,728 - oe-selftest - INFO - RESULTS - wic.Wic2.test_wic_cp_ext - Testcase -1: PASSED (16.86s)
2018-11-29 19:31:45,728 - oe-selftest - INFO - RESULTS - wic.Wic2.test_wic_image_type - Testcase 1351: PASSED (9.36s)
2018-11-29 19:31:45,728 - oe-selftest - INFO - RESULTS - wic.Wic2.test_wic_ls - Testcase 1857: PASSED (16.84s)
2018-11-29 19:31:45,728 - oe-selftest - INFO - RESULTS - wic.Wic2.test_wic_ls_ext - Testcase -1: PASSED (15.85s)
2018-11-29 19:31:45,728 - oe-selftest - INFO - RESULTS - wic.Wic2.test_wic_rm - Testcase 1858: PASSED (26.38s)
2018-11-29 19:31:45,728 - oe-selftest - INFO - RESULTS - wic.Wic2.test_wic_rm_ext - Testcase -1: PASSED (18.79s)
2018-11-29 19:31:45,728 - oe-selftest - INFO - RESULTS - systemd_boot.Systemdboot.test_efi_systemdboot_images_can_be_built - Testcase 1445: PASSED (2750.49s)
2018-11-29 19:31:45,729 - oe-selftest - INFO - RESULTS - distrodata.Distrodata.test_checkpkg - Testcase 1902: SKIPPED (0.01s)
2018-11-29 19:31:45,729 - oe-selftest - INFO - RESULTS - runcmd.RunCmdTests.test_stdin - Testcase 1918: FAILED (0.04s)
2018-11-29 19:31:45,741 - oe-selftest - INFO - SUMMARY:
2018-11-29 19:31:45,741 - oe-selftest - INFO - oe-selftest () - Ran 338 tests in 7849.017s
2018-11-29 19:31:45,741 - oe-selftest - INFO - oe-selftest - FAIL - Required tests failed (successes=336, skipped=1, failures=1, errors=0)

Error details

Submitted on:
29/11/18 13:31
Error type:
OE selftest
Command:
oe-selftest --skip-tests distrodata.Distrodata.test_checkpkg -j 15
Machine:
qemux86-64
Distro:
poky
Build system:
unknown
Target system:
unknown
Host distro:
unknown
Branch:
master-next
Commit:
unknown
Build:
#72551
Submitter:
yp-ab-ubuntu1604-ty-1.yocto.io
Link back:
https://autobuilder.yoctoproject.org/typhoon/#builders/87/builds/31
Similar errors:
0
Open a bug