DEBUG: Executing python function do_testimage
NOTE: rootfs file: /home/pokybuild/yocto-autobuilder/yocto-worker/nightly-multilib/build/build/tmp/work/qemux86_64-poky-linux/core-image-sato/1.0-r0/testimage/core-image-sato-qemux86-64-testimage.ext4
NOTE: Qemu log file: /home/pokybuild/yocto-autobuilder/yocto-worker/nightly-multilib/build/build/tmp/work/qemux86_64-poky-linux/core-image-sato/1.0-r0/testimage/qemu_boot_log.20151022023621
NOTE: SSH log file: /home/pokybuild/yocto-autobuilder/yocto-worker/nightly-multilib/build/build/tmp/work/qemux86_64-poky-linux/core-image-sato/1.0-r0/testimage/ssh_target_log.20151022023621
NOTE: Created listening socket for qemu serial console on: 127.0.0.1:56686
NOTE: Created listening socket for qemu serial console on: 127.0.0.1:57977
NOTE: runqemu started, pid is 26813
NOTE: waiting at most 60 seconds for qemu pid
NOTE: qemu started - qemu procces pid is 26894
NOTE: qemu cmdline used:
/home/pokybuild/yocto-autobuilder/yocto-worker/nightly-multilib/build/build/tmp/sysroots/x86_64-linux/usr/bin/qemu-system-x86_64-kernel/home/pokybuild/yocto-autobuilder/yocto-worker/nightly-multilib/build/build/tmp/deploy/images/qemux86-64/bzImage-qemux86-64.bin-netnic,vlan=0-nettap,vlan=0,ifname=tap1,script=no,downscript=no-cpucore2duo-drivefile=/home/pokybuild/yocto-autobuilder/yocto-worker/nightly-multilib/build/build/tmp/work/qemux86_64-poky-linux/core-image-sato/1.0-r0/testimage/core-image-sato-qemux86-64-testimage.ext4,if=ide,format=raw-show-cursor-usb-usbdevicewacom-tablet-vgavmware-no-reboot-serialtcp:127.0.0.1:56686-m256-serialtcp:127.0.0.1:57977--appendvga=0 uvesafb.mode_option=640x480-32 root=/dev/hda rw mem=256M ip=192.168.7.4::192.168.7.3:255.255.255.0 oprofile.timer=1 rootfstype=ext4 console=tty1 console=ttyS0,115200n8
NOTE: Target IP: 192.168.7.4
NOTE: Server IP: 192.168.7.3
NOTE: Starting logging thread
NOTE: Starting thread event loop
NOTE: Connection request received
NOTE: Setting connection established event
NOTE: Waiting at most 1500 seconds for login banner
NOTE: Connection from 127.0.0.1:60738
NOTE: Reached login banner
NOTE: Logged as root in serial console
NOTE: Test modules ['oeqa.runtime.ping', 'oeqa.runtime.ssh', 'oeqa.runtime.df', 'oeqa.runtime.connman', 'oeqa.runtime.syslog', 'oeqa.runtime.xorg', 'oeqa.runtime.scp', 'oeqa.runtime.vnc', 'oeqa.runtime.date', 'oeqa.runtime.dmesg', 'oeqa.runtime.parselogs', 'oeqa.runtime.smart', 'oeqa.runtime.rpm', 'oeqa.runtime.python', 'oeqa.runtime.multilib']
NOTE: Found 47 tests
test_ping (oeqa.runtime.ping.PingTest) ... FAIL
test_ping dump data stored in /tmp/oe-saved-tests/201510220239_test_ping
test_ssh (oeqa.runtime.ssh.SshTest) ... skipped 'Testcase dependency not met: test_ping'
test_df (oeqa.runtime.df.DfTest) ... skipped 'Testcase dependency not met: test_ssh'
test_connmand_help (oeqa.runtime.connman.ConnmanTest) ... skipped 'Testcase dependency not met: test_ssh'
test_connmand_running (oeqa.runtime.connman.ConnmanTest) ... skipped 'Testcase dependency not met: test_connmand_help'
test_syslog_running (oeqa.runtime.syslog.SyslogTest) ... FAIL
test_syslog_running dump data stored in /tmp/oe-saved-tests/201510220239_test_syslog_running
test_syslog_logger (oeqa.runtime.syslog.SyslogTestConfig) ... skipped 'Testcase dependency not met: test_syslog_running'
test_syslog_restart (oeqa.runtime.syslog.SyslogTestConfig) ... skipped 'Testcase dependency not met: test_syslog_running'
test_syslog_startup_config (oeqa.runtime.syslog.SyslogTestConfig) ... skipped 'Testcase dependency not met: test_syslog_restart'
test_xorg_running (oeqa.runtime.xorg.XorgTest) ... skipped 'Testcase dependency not met: test_ssh'
test_scp_file (oeqa.runtime.scp.ScpTest) ... skipped 'Testcase dependency not met: test_ssh'
test_vnc (oeqa.runtime.vnc.VNCTest) ... skipped 'Testcase dependency not met: test_ssh'
test_date (oeqa.runtime.date.DateTest) ... skipped 'Testcase dependency not met: test_ssh'
test_dmesg (oeqa.runtime.dmesg.DmesgTest) ... skipped 'Testcase dependency not met: test_ssh'
test_parselogs (oeqa.runtime.parselogs.ParseLogsTest) ... skipped 'Testcase dependency not met: test_ssh'
test_smart_help (oeqa.runtime.smart.SmartBasicTest) ... skipped 'Testcase dependency not met: test_ssh'
test_smart_info (oeqa.runtime.smart.SmartBasicTest) ... skipped 'Testcase dependency not met: test_smart_help'
test_smart_query (oeqa.runtime.smart.SmartBasicTest) ... skipped 'Testcase dependency not met: test_smart_help'
test_smart_search (oeqa.runtime.smart.SmartBasicTest) ... skipped 'Testcase dependency not met: test_smart_help'
test_smart_stats (oeqa.runtime.smart.SmartBasicTest) ... skipped 'Testcase dependency not met: test_smart_help'
test_smart_version (oeqa.runtime.smart.SmartBasicTest) ... skipped 'Testcase dependency not met: test_smart_help'
test_smart_add_rpmdir (oeqa.runtime.smart.SmartRepoTest) ... skipped 'Testcase dependency not met: test_smart_help'
test_smart_channel (oeqa.runtime.smart.SmartRepoTest) ... skipped 'Testcase dependency not met: test_smart_help'
test_smart_channel_add (oeqa.runtime.smart.SmartRepoTest) ... skipped 'Testcase dependency not met: test_smart_help'
test_smart_channel_help (oeqa.runtime.smart.SmartRepoTest) ... skipped 'Testcase dependency not met: test_smart_help'
test_smart_channel_list (oeqa.runtime.smart.SmartRepoTest) ... skipped 'Testcase dependency not met: test_smart_help'
test_smart_channel_rpmsys (oeqa.runtime.smart.SmartRepoTest) ... skipped 'Testcase dependency not met: test_smart_help'
test_smart_channel_show (oeqa.runtime.smart.SmartRepoTest) ... skipped 'Testcase dependency not met: test_smart_help'
test_smart_install (oeqa.runtime.smart.SmartRepoTest) ... skipped 'Testcase dependency not met: test_smart_channel_add'
test_smart_install_dependency (oeqa.runtime.smart.SmartRepoTest) ... skipped 'Testcase dependency not met: test_smart_install'
test_smart_install_from_disk (oeqa.runtime.smart.SmartRepoTest) ... skipped 'Testcase dependency not met: test_smart_channel_add'
test_smart_install_from_http (oeqa.runtime.smart.SmartRepoTest) ... skipped 'Testcase dependency not met: test_smart_channel_add'
test_smart_local_dir (oeqa.runtime.smart.SmartRepoTest) ... skipped 'Testcase dependency not met: test_smart_help'
test_smart_reinstall (oeqa.runtime.smart.SmartRepoTest) ... skipped 'Testcase dependency not met: test_smart_install'
test_smart_remote_repo (oeqa.runtime.smart.SmartRepoTest) ... skipped 'Testcase dependency not met: test_smart_channel_add'
test_smart_remove_package (oeqa.runtime.smart.SmartRepoTest) ... skipped 'Testcase dependency not met: test_smart_channel_add'
test_rpm_help (oeqa.runtime.rpm.RpmBasicTest) ... skipped 'Testcase dependency not met: test_ssh'
test_rpm_query (oeqa.runtime.rpm.RpmBasicTest) ... skipped 'Testcase dependency not met: test_rpm_help'
ERROR
ERROR
test_check_multilib_libc (oeqa.runtime.multilib.MultilibTest) ... skipped 'Testcase dependency not met: test_ssh'
test_file_connman (oeqa.runtime.multilib.MultilibTest) ... skipped 'Testcase dependency not met: test_check_multilib_libc'
======================================================================
ERROR: setUpClass (oeqa.runtime.rpm.RpmInstallRemoveTest)
----------------------------------------------------------------------
Traceback (most recent call last):
File "/home/pokybuild/yocto-autobuilder/yocto-worker/nightly-multilib/build/meta/lib/oeqa/runtime/rpm.py", line 37, in setUpClass
oeRuntimeTest.tc.target.copy_to(os.path.join(rpmdir,testrpmfile), "/tmp/rpm-doc.rpm")
File "/home/pokybuild/yocto-autobuilder/yocto-worker/nightly-multilib/build/meta/lib/oeqa/targetcontrol.py", line 107, in copy_to
return self.connection.copy_to(localpath, remotepath)
File "/home/pokybuild/yocto-autobuilder/yocto-worker/nightly-multilib/build/meta/lib/oeqa/utils/sshcontrol.py", line 150, in copy_to
return self._internal_run(command, ignore_status=False)
File "/home/pokybuild/yocto-autobuilder/yocto-worker/nightly-multilib/build/meta/lib/oeqa/utils/sshcontrol.py", line 127, in _internal_run
raise AssertionError("Command '%s' returned non-zero exit status %d:\n%s" % (command, status, output))
AssertionError: Command '['scp', '-o', 'UserKnownHostsFile=/dev/null', '-o', 'StrictHostKeyChecking=no', '-o', 'LogLevel=ERROR', '/home/pokybuild/yocto-autobuilder/yocto-worker/nightly-multilib/build/build/tmp/deploy/rpm/core2_64/rpm-doc-5.4.14-r0.core2_64.rpm', 'root@192.168.7.4:/tmp/rpm-doc.rpm']' returned non-zero exit status 1:
ssh: connect to host 192.168.7.4 port 22: No route to host
lost connection
======================================================================
ERROR: setUpClass (oeqa.runtime.python.PythonTest)
----------------------------------------------------------------------
Traceback (most recent call last):
File "/home/pokybuild/yocto-autobuilder/yocto-worker/nightly-multilib/build/meta/lib/oeqa/runtime/python.py", line 15, in setUpClass
oeRuntimeTest.tc.target.copy_to(os.path.join(oeRuntimeTest.tc.filesdir, "test.py"), "/tmp/test.py")
File "/home/pokybuild/yocto-autobuilder/yocto-worker/nightly-multilib/build/meta/lib/oeqa/targetcontrol.py", line 107, in copy_to
return self.connection.copy_to(localpath, remotepath)
File "/home/pokybuild/yocto-autobuilder/yocto-worker/nightly-multilib/build/meta/lib/oeqa/utils/sshcontrol.py", line 150, in copy_to
return self._internal_run(command, ignore_status=False)
File "/home/pokybuild/yocto-autobuilder/yocto-worker/nightly-multilib/build/meta/lib/oeqa/utils/sshcontrol.py", line 127, in _internal_run
raise AssertionError("Command '%s' returned non-zero exit status %d:\n%s" % (command, status, output))
AssertionError: Command '['scp', '-o', 'UserKnownHostsFile=/dev/null', '-o', 'StrictHostKeyChecking=no', '-o', 'LogLevel=ERROR', '/home/pokybuild/yocto-autobuilder/yocto-worker/nightly-multilib/build/meta/lib/oeqa/runtime/files/test.py', 'root@192.168.7.4:/tmp/test.py']' returned non-zero exit status 1:
ssh: connect to host 192.168.7.4 port 22: No route to host
lost connection
======================================================================
FAIL: test_ping (oeqa.runtime.ping.PingTest)
----------------------------------------------------------------------
Traceback (most recent call last):
File "/home/pokybuild/yocto-autobuilder/yocto-worker/nightly-multilib/build/meta/lib/oeqa/utils/decorators.py", line 106, in wrapped_f
return func(*args)
File "/home/pokybuild/yocto-autobuilder/yocto-worker/nightly-multilib/build/meta/lib/oeqa/runtime/ping.py", line 22, in test_ping
self.assertEqual(count, 5, msg = "Expected 5 consecutive replies, got %d.\nping output is:\n%s" % (count,output))
AssertionError: 0 != 5 : Expected 5 consecutive replies, got 0.
ping output is:
PING 192.168.7.4 (192.168.7.4) 56(84) bytes of data.
From 192.168.7.3 icmp_seq=1 Destination Host Unreachable
--- 192.168.7.4 ping statistics ---
1 packets transmitted, 0 received, +1 errors, 100% packet loss, time 0ms
PING 192.168.7.4 (192.168.7.4) 56(84) bytes of data.
From 192.168.7.3 icmp_seq=1 Destination Host Unreachable
--- 192.168.7.4 ping statistics ---
1 packets transmitted, 0 received, +1 errors, 100% packet loss, time 0ms
PING 192.168.7.4 (192.168.7.4) 56(84) bytes of data.
From 192.168.7.3 icmp_seq=1 Destination Host Unreachable
--- 192.168.7.4 ping statistics ---
1 packets transmitted, 0 received, +1 errors, 100% packet loss, time 0ms
PING 192.168.7.4 (192.168.7.4) 56(84) bytes of data.
From 192.168.7.3 icmp_seq=1 Destination Host Unreachable
--- 192.168.7.4 ping statistics ---
1 packets transmitted, 0 received, +1 errors, 100% packet loss, time 0ms
PING 192.168.7.4 (192.168.7.4) 56(84) bytes of data.
From 192.168.7.3 icmp_seq=1 Destination Host Unreachable
--- 192.168.7.4 ping statistics ---
1 packets transmitted, 0 received, +1 errors, 100% packet loss, time 0ms
PING 192.168.7.4 (192.168.7.4) 56(84) bytes of data.
From 192.168.7.3 icmp_seq=1 Destination Host Unreachable
--- 192.168.7.4 ping statistics ---
1 packets transmitted, 0 received, +1 errors, 100% packet loss, time 0ms
PING 192.168.7.4 (192.168.7.4) 56(84) bytes of data.
From 192.168.7.3 icmp_seq=1 Destination Host Unreachable
--- 192.168.7.4 ping statistics ---
1 packets transmitted, 0 received, +1 errors, 100% packet loss, time 0ms
PING 192.168.7.4 (192.168.7.4) 56(84) bytes of data.
From 192.168.7.3 icmp_seq=1 Destination Host Unreachable
--- 192.168.7.4 ping statistics ---
1 packets transmitted, 0 received, +1 errors, 100% packet loss, time 0ms
PING 192.168.7.4 (192.168.7.4) 56(84) bytes of data.
From 192.168.7.3 icmp_seq=1 Destination Host Unreachable
--- 192.168.7.4 ping statistics ---
1 packets transmitted, 0 received, +1 errors, 100% packet loss, time 0ms
PING 192.168.7.4 (192.168.7.4) 56(84) bytes of data.
From 192.168.7.3 icmp_seq=1 Destination Host Unreachable
--- 192.168.7.4 ping statistics ---
1 packets transmitted, 0 received, +1 errors, 100% packet loss, time 0ms
PING 192.168.7.4 (192.168.7.4) 56(84) bytes of data.
From 192.168.7.3 icmp_seq=1 Destination Host Unreachable
--- 192.168.7.4 ping statistics ---
1 packets transmitted, 0 received, +1 errors, 100% packet loss, time 0ms
PING 192.168.7.4 (192.168.7.4) 56(84) bytes of data.
From 192.168.7.3 icmp_seq=1 Destination Host Unreachable
--- 192.168.7.4 ping statistics ---
1 packets transmitted, 0 received, +1 errors, 100% packet loss, time 0ms
PING 192.168.7.4 (192.168.7.4) 56(84) bytes of data.
From 192.168.7.3 icmp_seq=1 Destination Host Unreachable
--- 192.168.7.4 ping statistics ---
1 packets transmitted, 0 received, +1 errors, 100% packet loss, time 0ms
PING 192.168.7.4 (192.168.7.4) 56(84) bytes of data.
From 192.168.7.3 icmp_seq=1 Destination Host Unreachable
--- 192.168.7.4 ping statistics ---
1 packets transmitted, 0 received, +1 errors, 100% packet loss, time 0ms
PING 192.168.7.4 (192.168.7.4) 56(84) bytes of data.
From 192.168.7.3 icmp_seq=1 Destination Host Unreachable
--- 192.168.7.4 ping statistics ---
1 packets transmitted, 0 received, +1 errors, 100% packet loss, time 0ms
PING 192.168.7.4 (192.168.7.4) 56(84) bytes of data.
From 192.168.7.3 icmp_seq=1 Destination Host Unreachable
--- 192.168.7.4 ping statistics ---
1 packets transmitted, 0 received, +1 errors, 100% packet loss, time 0ms
PING 192.168.7.4 (192.168.7.4) 56(84) bytes of data.
From 192.168.7.3 icmp_seq=1 Destination Host Unreachable
--- 192.168.7.4 ping statistics ---
1 packets transmitted, 0 received, +1 errors, 100% packet loss, time 0ms
PING 192.168.7.4 (192.168.7.4) 56(84) bytes of data.
From 192.168.7.3 icmp_seq=1 Destination Host Unreachable
--- 192.168.7.4 ping statistics ---
1 packets transmitted, 0 received, +1 errors, 100% packet loss, time 0ms
PING 192.168.7.4 (192.168.7.4) 56(84) bytes of data.
From 192.168.7.3 icmp_seq=1 Destination Host Unreachable
--- 192.168.7.4 ping statistics ---
1 packets transmitted, 0 received, +1 errors, 100% packet loss, time 0ms
PING 192.168.7.4 (192.168.7.4) 56(84) bytes of data.
From 192.168.7.3 icmp_seq=1 Destination Host Unreachable
--- 192.168.7.4 ping statistics ---
1 packets transmitted, 0 received, +1 errors, 100% packet loss, time 0ms
======================================================================
FAIL: test_syslog_running (oeqa.runtime.syslog.SyslogTest)
----------------------------------------------------------------------
Traceback (most recent call last):
File "/home/pokybuild/yocto-autobuilder/yocto-worker/nightly-multilib/build/meta/lib/oeqa/utils/decorators.py", line 106, in wrapped_f
return func(*args)
File "/home/pokybuild/yocto-autobuilder/yocto-worker/nightly-multilib/build/meta/lib/oeqa/utils/decorators.py", line 94, in wrapped_f
return f(*args)
File "/home/pokybuild/yocto-autobuilder/yocto-worker/nightly-multilib/build/meta/lib/oeqa/runtime/syslog.py", line 15, in test_syslog_running
self.assertEqual(status, 0, msg="no syslogd process, ps output: %s" % self.target.run(oeRuntimeTest.pscmd)[1])
AssertionError: 255 != 0 : no syslogd process, ps output: ssh: connect to host 192.168.7.4 port 22: No route to host
----------------------------------------------------------------------
Ran 40 tests in 132.128s
FAILED (failures=2, errors=2, skipped=38)
NOTE: Stopping logging thread
NOTE: Stop event received
NOTE: Tearing down logging thread
NOTE: Sending SIGTERM to runqemu
DEBUG: Python function do_testimage finished
ERROR: Function failed: core-image-sato - FAILED - check the task log and the ssh log