DEBUG: Executing python function do_testimage
NOTE: rootfs file: TOPDIR/tmp/work/qemuppc-poky-linux/core-image-lsb/1.0-r0/testimage/core-image-lsb-qemuppc-testimage.ext4
NOTE: Qemu log file: TOPDIR/tmp/work/qemuppc-poky-linux/core-image-lsb/1.0-r0/testimage/qemu_boot_log.20160905223728
NOTE: SSH log file: TOPDIR/tmp/work/qemuppc-poky-linux/core-image-lsb/1.0-r0/testimage/ssh_target_log.20160905223728
NOTE: Created listening socket for qemu serial console on: 127.0.0.1:44396
NOTE: Created listening socket for qemu serial console on: 127.0.0.1:53212
NOTE: Not using kvm for runqemu
NOTE: runqemu started, pid is 32403
NOTE: waiting at most 60 seconds for qemu pid
NOTE: qemu started - qemu procces pid is 32424
NOTE: qemu cmdline used:
TOPDIR/tmp/sysroots/x86_64-linux/usr/bin/qemu-system-ppc-netdevtap,id=net0,ifname=tap2,script=no,downscript=no-devicevirtio-net-pci,netdev=net0-serialtcp:127.0.0.1:44396-machinemac99-cpuG4-m256-serialtcp:127.0.0.1:53212-drivefile=TOPDIR/tmp/work/qemuppc-poky-linux/core-image-lsb/1.0-r0/testimage/core-image-lsb-qemuppc-testimage.ext4,if=virtio,format=raw-show-cursor-usb-usbdevicetablet-devicevirtio-rng-pci-kernelTOPDIR/tmp/deploy/images/qemuppc/vmlinux-appendroot=/dev/vda rw highres=off console=tty1 console=ttyS0,115200n8 printk.time=1 mem=256M ip=192.168.7.6::192.168.7.5:255.255.255.0 console=ttyS0 console=tty
NOTE: Target IP: 192.168.7.6
NOTE: Server IP: 192.168.7.5
NOTE: Starting logging thread
NOTE: Starting thread event loop
NOTE: Connection request received
NOTE: Setting connection established event
NOTE: Output from runqemu:
runqemu - WARNING - TOPDIR/tmp/work/qemuppc-poky-linux/core-image-lsb/1.0-r0/testimage/core-image-lsb-qemuppc-testimage.qemuboot.conf doesn't exist
runqemu - INFO - MACHINE: qemuppc
runqemu - INFO - DEPLOY_DIR_IMAGE: TOPDIR/tmp/deploy/images/qemuppc
runqemu - INFO - Running ls -t TOPDIR/tmp/deploy/images/qemuppc/*.qemuboot.conf...
runqemu - INFO - CONFFILE: TOPDIR/tmp/deploy/images/qemuppc/core-image-lsb-sdk-qemuppc-20160905214713.qemuboot.conf
runqemu - INFO - Continuing with the following parameters:
stty: standard input: Inappropriate ioctl for device
runqemu - INFO - Running /bin/ip link...
runqemu - INFO - Acquiring lockfile /tmp/qemu-tap-locks/tap0.lock...
runqemu - INFO - Acquiring lockfile /tmp/qemu-tap-locks/tap0.lock failed: [Errno 11] Resource temporarily unavailable
runqemu - INFO - Acquiring lockfile /tmp/qemu-tap-locks/tap1.lock...
runqemu - INFO - Acquiring lockfile /tmp/qemu-tap-locks/tap1.lock failed: [Errno 11] Resource temporarily unavailable
runqemu - INFO - Acquiring lockfile /tmp/qemu-tap-locks/tap2.lock...
runqemu - INFO - Using preconfigured tap device tap2
runqemu - INFO - If this is not intended, touch /tmp/qemu-tap-locks/tap2.skip to make runqemu skip tap2.
runqemu - INFO - Running ldd TOPDIR/tmp/sysroots/x86_64-linux/usr/bin/qemu-system-ppc...
runqemu - INFO - Running TOPDIR/tmp/sysroots/x86_64-linux/usr/bin/qemu-system-ppc -netdev tap,id=net0,ifname=tap2,script=no,downscript=no -device virtio-net-pci,netdev=net0 -serial tcp:127.0.0.1:44396 -machine mac99 -cpu G4 -m 256 -serial tcp:127.0.0.1:53212 -drive file=TOPDIR/tmp/work/qemuppc-poky-linux/core-image-lsb/1.0-r0/testimage/core-image-lsb-qemuppc-testimage.ext4,if=virtio,format=raw -show-cursor -usb -usbdevice tablet -device virtio-rng-pci -kernel TOPDIR/tmp/deploy/images/qemuppc/vmlinux -append 'root=/dev/vda rw highres=off console=tty1 console=ttyS0,115200n8 printk.time=1 mem=256M ip=192.168.7.6::192.168.7.5:255.255.255.0 console=ttyS0 console=tty'
NOTE: Waiting at most 1500 seconds for login banner
NOTE: Connection from 127.0.0.1:37683
NOTE: Reached login banner
NOTE: Logged as root in serial console
NOTE: Test modules ['oeqa.runtime.ping', 'oeqa.runtime.ssh', 'oeqa.runtime.df', 'oeqa.runtime.date', 'oeqa.runtime.scp', 'oeqa.runtime.syslog', 'oeqa.runtime.pam', 'oeqa.runtime.parselogs', 'oeqa.runtime.smart', 'oeqa.runtime.rpm']
NOTE: Found 38 tests
test_ping (oeqa.runtime.ping.PingTest) ... ok
test_syslog_running (oeqa.runtime.syslog.SyslogTest) ... FAIL
test_syslog_logger (oeqa.runtime.syslog.SyslogTestConfig) ... skipped 'Testcase dependency not met: test_syslog_running'
test_syslog_restart (oeqa.runtime.syslog.SyslogTestConfig) ... skipped 'Testcase dependency not met: test_syslog_running'
test_syslog_startup_config (oeqa.runtime.syslog.SyslogTestConfig) ... skipped 'Non-busybox syslog'
test_ssh (oeqa.runtime.ssh.SshTest) ... ok
test_df (oeqa.runtime.df.DfTest) ... ok
test_date (oeqa.runtime.date.DateTest) ... FAIL
test_scp_file (oeqa.runtime.scp.ScpTest) ... ok
test_pam (oeqa.runtime.pam.PamBasicTest) ... FAIL
test_parselogs (oeqa.runtime.parselogs.ParseLogsTest) ... FAIL
test_smart_help (oeqa.runtime.smart.SmartBasicTest) ... FAIL
test_smart_info (oeqa.runtime.smart.SmartBasicTest) ... skipped 'Testcase dependency not met: test_smart_help'
test_smart_query (oeqa.runtime.smart.SmartBasicTest) ... skipped 'Testcase dependency not met: test_smart_help'
test_smart_search (oeqa.runtime.smart.SmartBasicTest) ... skipped 'Testcase dependency not met: test_smart_help'
test_smart_stats (oeqa.runtime.smart.SmartBasicTest) ... skipped 'Testcase dependency not met: test_smart_help'
test_smart_version (oeqa.runtime.smart.SmartBasicTest) ... skipped 'Testcase dependency not met: test_smart_help'
NOTE: Executing 'TOPDIR/tmp/sysroots/x86_64-linux/usr/bin/createrepo --dbpath TOPDIR/tmp/work/qemuppc-poky-linux/core-image-lsb/1.0-r0/rpmdb/all --update -q TOPDIR/tmp/work/qemuppc-poky-linux/core-image-lsb/1.0-r0/rpm/all' ...
NOTE: Executing 'TOPDIR/tmp/sysroots/x86_64-linux/usr/bin/createrepo --dbpath TOPDIR/tmp/work/qemuppc-poky-linux/core-image-lsb/1.0-r0/rpmdb/qemuppc --update -q TOPDIR/tmp/work/qemuppc-poky-linux/core-image-lsb/1.0-r0/rpm/qemuppc' ...
NOTE: Executing 'TOPDIR/tmp/sysroots/x86_64-linux/usr/bin/createrepo --dbpath TOPDIR/tmp/work/qemuppc-poky-linux/core-image-lsb/1.0-r0/rpmdb/ppc7400 --update -q TOPDIR/tmp/work/qemuppc-poky-linux/core-image-lsb/1.0-r0/rpm/ppc7400' ...
NOTE: Previous repo file missing: TOPDIR/tmp/work/qemuppc-poky-linux/core-image-lsb/1.0-r0/rpm/all/repodata/primary.xml.gz
NOTE: Previous repo file missing: TOPDIR/tmp/work/qemuppc-poky-linux/core-image-lsb/1.0-r0/rpm/qemuppc/repodata/primary.xml.gz
NOTE: Previous repo file missing: TOPDIR/tmp/work/qemuppc-poky-linux/core-image-lsb/1.0-r0/rpm/ppc7400/repodata/primary.xml.gz
test_smart_add_rpmdir (oeqa.runtime.smart.SmartRepoTest) ... skipped 'Testcase dependency not met: test_smart_help'
test_smart_channel (oeqa.runtime.smart.SmartRepoTest) ... skipped 'Testcase dependency not met: test_smart_help'
test_smart_channel_add (oeqa.runtime.smart.SmartRepoTest) ... skipped 'Testcase dependency not met: test_smart_help'
test_smart_channel_help (oeqa.runtime.smart.SmartRepoTest) ... skipped 'Testcase dependency not met: test_smart_help'
test_smart_channel_list (oeqa.runtime.smart.SmartRepoTest) ... skipped 'Testcase dependency not met: test_smart_help'
test_smart_channel_rpmsys (oeqa.runtime.smart.SmartRepoTest) ... skipped 'Testcase dependency not met: test_smart_help'
test_smart_channel_show (oeqa.runtime.smart.SmartRepoTest) ... skipped 'Testcase dependency not met: test_smart_help'
test_smart_install (oeqa.runtime.smart.SmartRepoTest) ... skipped 'Testcase dependency not met: test_smart_channel_add'
test_smart_install_dependency (oeqa.runtime.smart.SmartRepoTest) ... skipped 'Testcase dependency not met: test_smart_install'
test_smart_install_from_disk (oeqa.runtime.smart.SmartRepoTest) ... skipped 'Testcase dependency not met: test_smart_channel_add'
test_smart_install_from_http (oeqa.runtime.smart.SmartRepoTest) ... skipped 'Testcase dependency not met: test_smart_channel_add'
test_smart_local_dir (oeqa.runtime.smart.SmartRepoTest) ... skipped 'Testcase dependency not met: test_smart_help'
test_smart_reinstall (oeqa.runtime.smart.SmartRepoTest) ... skipped 'Testcase dependency not met: test_smart_install'
test_smart_remote_repo (oeqa.runtime.smart.SmartRepoTest) ... skipped 'Testcase dependency not met: test_smart_channel_add'
test_smart_remove_package (oeqa.runtime.smart.SmartRepoTest) ... skipped 'Testcase dependency not met: test_smart_channel_add'
test_rpm_help (oeqa.runtime.rpm.RpmBasicTest) ... ok
test_rpm_query (oeqa.runtime.rpm.RpmBasicTest) ... ok
test_check_rpm_install_removal_log_file_size (oeqa.runtime.rpm.RpmInstallRemoveTest) ... FAIL
test_rpm_install (oeqa.runtime.rpm.RpmInstallRemoveTest) ... ok
test_rpm_query_nonroot (oeqa.runtime.rpm.RpmInstallRemoveTest) ... FAIL
test_rpm_remove (oeqa.runtime.rpm.RpmInstallRemoveTest) ... ok
======================================================================
FAIL: test_syslog_running (oeqa.runtime.syslog.SyslogTest)
----------------------------------------------------------------------
Traceback (most recent call last):
File "/home/pokybuild/yocto-autobuilder/yocto-worker/nightly-ppc-lsb/build/meta/lib/oeqa/utils/decorators.py", line 109, in wrapped_f
return func(*args, **kwargs)
File "/home/pokybuild/yocto-autobuilder/yocto-worker/nightly-ppc-lsb/build/meta/lib/oeqa/runtime/syslog.py", line 14, in test_syslog_running
self.assertEqual(status, 0, msg="no syslogd process, ps output: %s" % self.target.run(oeRuntimeTest.pscmd)[1])
AssertionError: 255 != 0 : no syslogd process, ps output: UID PID PPID C STIME TTY TIME CMD
root 1 0 4 22:38 ? 00:00:02 init [5]
root 2 0 0 22:38 ? 00:00:00 [kthreadd]
root 3 2 0 22:38 ? 00:00:00 [ksoftirqd/0]
root 4 2 0 22:38 ? 00:00:00 [kworker/0:0]
root 5 2 0 22:38 ? 00:00:00 [kworker/0:0H]
root 6 2 0 22:38 ? 00:00:00 [kworker/u2:0]
root 7 2 3 22:38 ? 00:00:02 [rcu_preempt]
root 8 2 0 22:38 ? 00:00:00 [rcu_sched]
root 9 2 0 22:38 ? 00:00:00 [rcu_bh]
root 10 2 0 22:38 ? 00:00:00 [khelper]
root 11 2 0 22:38 ? 00:00:00 [kdevtmpfs]
root 12 2 0 22:38 ? 00:00:00 [netns]
root 13 2 0 22:38 ? 00:00:00 [perf]
root 14 2 0 22:38 ? 00:00:00 [writeback]
root 15 2 0 22:38 ? 00:00:00 [crypto]
root 16 2 0 22:38 ? 00:00:00 [bioset]
root 17 2 0 22:38 ? 00:00:00 [kblockd]
root 18 2 0 22:38 ? 00:00:00 [md]
root 19 2 0 22:38 ? 00:00:00 [kworker/0:1]
root 20 2 0 22:38 ? 00:00:00 [rpciod]
root 21 2 0 22:38 ? 00:00:00 [kswapd0]
root 22 2 0 22:38 ? 00:00:00 [fsnotify_mark]
root 23 2 0 22:38 ? 00:00:00 [nfsiod]
root 31 2 0 22:38 ? 00:00:00 [hwrng]
root 33 2 0 22:38 ? 00:00:00 [kpsmoused]
root 34 2 0 22:38 ? 00:00:00 [dm_bufio_cache]
root 35 2 0 22:38 ? 00:00:00 [ipv6_addrconf]
root 36 2 0 22:38 ? 00:00:00 [kworker/0:2]
root 37 2 0 22:38 ? 00:00:00 [bioset]
root 38 2 0 22:38 ? 00:00:00 [deferwq]
root 39 2 0 22:38 ? 00:00:00 [kworker/u2:1]
root 40 2 0 22:38 ? 00:00:00 [jbd2/vda-8]
root 41 2 0 22:38 ? 00:00:00 [ext4-rsv-conver]
root 68 1 1 22:38 ? 00:00:00 /sbin/udevd -d
root 117 2 0 22:38 ? 00:00:00 [kworker/0:1H]
root 570 2 0 22:38 ? 00:00:00 [kworker/u2:2]
message+ 620 1 0 22:38 ? 00:00:00 /usr/bin/dbus-daemon --system
root 636 1 0 22:38 ? 00:00:00 /usr/sbin/sshd
rpc 645 1 0 22:38 ? 00:00:00 /usr/sbin/rpcbind
root 658 1 0 22:38 ? 00:00:00 /usr/sbin/watchdog
rpcuser 667 1 0 22:38 ? 00:00:00 /usr/sbin/rpc.statd
root 677 1 0 22:38 ? 00:00:00 /usr/sbin/atd -f
distcc 695 1 0 22:38 ? 00:00:00 /usr/bin/distccd --pid-file=/var/run/distcc.pid --daemon --allow 192.168.7.0/24
distcc 696 695 0 22:38 ? 00:00:00 /usr/bin/distccd --pid-file=/var/run/distcc.pid --daemon --allow 192.168.7.0/24
distcc 716 695 0 22:38 ? 00:00:00 /usr/bin/distccd --pid-file=/var/run/distcc.pid --daemon --allow 192.168.7.0/24
root 717 2 0 22:38 ? 00:00:00 [nfsd4]
root 718 2 0 22:38 ? 00:00:00 [nfsd4_callbacks]
root 719 2 0 22:38 ? 00:00:00 [lockd]
root 722 2 0 22:38 ? 00:00:00 [nfsd]
root 723 2 0 22:38 ? 00:00:00 [nfsd]
root 724 2 0 22:38 ? 00:00:00 [nfsd]
root 725 2 0 22:38 ? 00:00:00 [nfsd]
root 726 2 0 22:38 ? 00:00:00 [nfsd]
root 727 2 0 22:38 ? 00:00:00 [nfsd]
root 728 2 0 22:38 ? 00:00:00 [nfsd]
root 729 2 0 22:38 ? 00:00:00 [nfsd]
root 731 1 0 22:38 ? 00:00:00 /usr/sbin/rpc.mountd -f /etc/exports
root 743 1 2 22:38 ? 00:00:00 /sbin/syslogd
distcc 744 695 0 22:38 ? 00:00:00 /usr/bin/distccd --pid-file=/var/run/distcc.pid --daemon --allow 192.168.7.0/24
root 746 1 9 22:38 ? 00:00:01 /sbin/klogd
root 759 1 0 22:38 ? 00:00:00 /usr/sbin/xinetd -pidfile /var/run/xinetd.pid -stayalive
avahi 766 1 5 22:38 ? 00:00:00 avahi-daemon: running [qemuppc.local]
avahi 767 766 0 22:38 ? 00:00:00 avahi-daemon: chroot helper
root 776 1 0 22:38 ? 00:00:00 /usr/sbin/rngd -r /dev/urandom
root 781 1 0 22:38 ? 00:00:00 /usr/sbin/lighttpd -f /etc/lighttpd.conf
root 789 1 0 22:38 ? 00:00:00 /usr/sbin/crond
root 804 1 0 22:38 ? 00:00:00 /bin/sh /bin/start_getty 115200 ttyS0
root 805 1 0 22:38 ? 00:00:00 /bin/sh /bin/start_getty 115200 ttyS1
root 806 1 0 22:38 tty1 00:00:00 /sbin/getty 38400 tty1
root 807 805 3 22:38 ttyS1 00:00:00 /bin/login --
root 808 804 0 22:38 ttyS0 00:00:00 /sbin/getty -L 115200 ttyS0
root 809 807 2 22:38 ttyS1 00:00:00 -sh
root 817 636 49 22:39 ? 00:00:00 sshd: root@notty
root 821 817 0 22:39 ? 00:00:00 sh -c export PATH=/usr/sbin:/sbin:/usr/bin:/bin; ps -ef
root 822 821 0 22:39 ? 00:00:00 ps -ef
======================================================================
FAIL: test_date (oeqa.runtime.date.DateTest)
----------------------------------------------------------------------
Traceback (most recent call last):
File "/home/pokybuild/yocto-autobuilder/yocto-worker/nightly-ppc-lsb/build/meta/lib/oeqa/utils/decorators.py", line 109, in wrapped_f
return func(*args, **kwargs)
File "/home/pokybuild/yocto-autobuilder/yocto-worker/nightly-ppc-lsb/build/meta/lib/oeqa/utils/decorators.py", line 97, in wrapped_f
return f(*args, **kwargs)
File "/home/pokybuild/yocto-autobuilder/yocto-worker/nightly-ppc-lsb/build/meta/lib/oeqa/runtime/date.py", line 19, in test_date
self.assertEqual(status, 0, msg="Failed to get initial date, output: %s" % output)
AssertionError: 255 != 0 : Failed to get initial date, output: Connection to 192.168.7.6 closed by remote host.
======================================================================
FAIL: test_pam (oeqa.runtime.pam.PamBasicTest)
----------------------------------------------------------------------
Traceback (most recent call last):
File "/home/pokybuild/yocto-autobuilder/yocto-worker/nightly-ppc-lsb/build/meta/lib/oeqa/utils/decorators.py", line 109, in wrapped_f
return func(*args, **kwargs)
File "/home/pokybuild/yocto-autobuilder/yocto-worker/nightly-ppc-lsb/build/meta/lib/oeqa/utils/decorators.py", line 97, in wrapped_f
return f(*args, **kwargs)
File "/home/pokybuild/yocto-autobuilder/yocto-worker/nightly-ppc-lsb/build/meta/lib/oeqa/runtime/pam.py", line 19, in test_pam
self.assertEqual(status, 1, msg = "login command does not work as expected. Status and output:%s and %s" %(status, output))
AssertionError: 255 != 1 : login command does not work as expected. Status and output:255 and Connection to 192.168.7.6 closed by remote host.
======================================================================
FAIL: test_parselogs (oeqa.runtime.parselogs.ParseLogsTest)
----------------------------------------------------------------------
Traceback (most recent call last):
File "/home/pokybuild/yocto-autobuilder/yocto-worker/nightly-ppc-lsb/build/meta/lib/oeqa/utils/decorators.py", line 109, in wrapped_f
return func(*args, **kwargs)
File "/home/pokybuild/yocto-autobuilder/yocto-worker/nightly-ppc-lsb/build/meta/lib/oeqa/utils/decorators.py", line 97, in wrapped_f
return f(*args, **kwargs)
File "/home/pokybuild/yocto-autobuilder/yocto-worker/nightly-ppc-lsb/build/meta/lib/oeqa/runtime/parselogs.py", line 288, in test_parselogs
log_list = self.get_local_log_list(self.log_locations)
File "/home/pokybuild/yocto-autobuilder/yocto-worker/nightly-ppc-lsb/build/meta/lib/oeqa/runtime/parselogs.py", line 226, in get_local_log_list
self.transfer_logs(self.getLogList(log_locations))
File "/home/pokybuild/yocto-autobuilder/yocto-worker/nightly-ppc-lsb/build/meta/lib/oeqa/runtime/parselogs.py", line 222, in transfer_logs
self.target.copy_from(f, target_logs)
File "/home/pokybuild/yocto-autobuilder/yocto-worker/nightly-ppc-lsb/build/meta/lib/oeqa/targetcontrol.py", line 108, in copy_from
return self.connection.copy_from(remotepath, localpath)
File "/home/pokybuild/yocto-autobuilder/yocto-worker/nightly-ppc-lsb/build/meta/lib/oeqa/utils/sshcontrol.py", line 160, in copy_from
return self._internal_run(command, ignore_status=False)
File "/home/pokybuild/yocto-autobuilder/yocto-worker/nightly-ppc-lsb/build/meta/lib/oeqa/utils/sshcontrol.py", line 129, in _internal_run
raise AssertionError("Command '%s' returned non-zero exit status %d:\n%s" % (command, status, output))
AssertionError: Command '['scp', '-o', 'UserKnownHostsFile=/dev/null', '-o', 'StrictHostKeyChecking=no', '-o', 'LogLevel=ERROR', 'root@192.168.7.6:/var/log/dmesg', 'target_logs']' returned non-zero exit status 1:
b'Connection to 192.168.7.6 closed by remote host.'
======================================================================
FAIL: test_smart_help (oeqa.runtime.smart.SmartBasicTest)
----------------------------------------------------------------------
Traceback (most recent call last):
File "/home/pokybuild/yocto-autobuilder/yocto-worker/nightly-ppc-lsb/build/meta/lib/oeqa/utils/decorators.py", line 109, in wrapped_f
return func(*args, **kwargs)
File "/home/pokybuild/yocto-autobuilder/yocto-worker/nightly-ppc-lsb/build/meta/lib/oeqa/utils/decorators.py", line 97, in wrapped_f
return f(*args, **kwargs)
File "/home/pokybuild/yocto-autobuilder/yocto-worker/nightly-ppc-lsb/build/meta/lib/oeqa/runtime/smart.py", line 33, in test_smart_help
self.smart('--help')
File "/home/pokybuild/yocto-autobuilder/yocto-worker/nightly-ppc-lsb/build/meta/lib/oeqa/utils/decorators.py", line 97, in wrapped_f
return f(*args, **kwargs)
File "/home/pokybuild/yocto-autobuilder/yocto-worker/nightly-ppc-lsb/build/meta/lib/oeqa/runtime/smart.py", line 24, in smart
self.assertEqual(status, expected, message)
AssertionError: 255 != 0 : smart --help
Connection to 192.168.7.6 closed by remote host.
======================================================================
FAIL: test_check_rpm_install_removal_log_file_size (oeqa.runtime.rpm.RpmInstallRemoveTest)
----------------------------------------------------------------------
Traceback (most recent call last):
File "/home/pokybuild/yocto-autobuilder/yocto-worker/nightly-ppc-lsb/build/meta/lib/oeqa/utils/decorators.py", line 109, in wrapped_f
return func(*args, **kwargs)
File "/home/pokybuild/yocto-autobuilder/yocto-worker/nightly-ppc-lsb/build/meta/lib/oeqa/utils/decorators.py", line 97, in wrapped_f
return f(*args, **kwargs)
File "/home/pokybuild/yocto-autobuilder/yocto-worker/nightly-ppc-lsb/build/meta/lib/oeqa/runtime/rpm.py", line 76, in test_check_rpm_install_removal_log_file_size
self.assertEqual(0, status, 'Failed to find database files under /var/lib/rpm/ as __db.xxx')
AssertionError: 0 != 255 : Failed to find database files under /var/lib/rpm/ as __db.xxx
======================================================================
FAIL: test_rpm_query_nonroot (oeqa.runtime.rpm.RpmInstallRemoveTest)
----------------------------------------------------------------------
Traceback (most recent call last):
File "/home/pokybuild/yocto-autobuilder/yocto-worker/nightly-ppc-lsb/build/meta/lib/oeqa/utils/decorators.py", line 109, in wrapped_f
return func(*args, **kwargs)
File "/home/pokybuild/yocto-autobuilder/yocto-worker/nightly-ppc-lsb/build/meta/lib/oeqa/utils/decorators.py", line 97, in wrapped_f
return f(*args, **kwargs)
File "/home/pokybuild/yocto-autobuilder/yocto-worker/nightly-ppc-lsb/build/meta/lib/oeqa/runtime/rpm.py", line 59, in test_rpm_query_nonroot
self.assertEqual(status, 0, msg="status: %s. Cannot run rpm -qa: %s" % (status, output))
AssertionError: 255 != 0 : status: 255. Cannot run rpm -qa: Connection to 192.168.7.6 closed by remote host.
----------------------------------------------------------------------
Ran 38 tests in 172.321s
FAILED (failures=7, skipped=23)
NOTE: Stopping logging thread
NOTE: Stop event received
NOTE: Tearing down logging thread
NOTE: Sending SIGTERM to runqemu
DEBUG: Python function do_testimage finished
ERROR: Function failed: core-image-lsb - FAILED - check the task log and the ssh log