DEBUG: Executing python function do_testimage
DEBUG: Searching for tests in /home/pokybuild/yocto-autobuilder/yocto-worker/nightly-x86-64-lsb/build/meta-yocto/lib/oeqa/runtime
DEBUG: Searching for tests in /home/pokybuild/yocto-autobuilder/yocto-worker/nightly-x86-64-lsb/build/build/lib/oeqa/runtime
DEBUG: Searching for tests in /home/pokybuild/yocto-autobuilder/yocto-worker/nightly-x86-64-lsb/build/meta/lib/oeqa/runtime
DEBUG: Searching for tests in /home/pokybuild/yocto-autobuilder/yocto-worker/nightly-x86-64-lsb/build/meta-yocto-bsp/lib/oeqa/runtime
DEBUG: Searching for tests in /home/pokybuild/yocto-autobuilder/yocto-worker/nightly-x86-64-lsb/build/meta-qt3/lib/oeqa/runtime
NOTE: rootfs file: /home/pokybuild/yocto-autobuilder/yocto-worker/nightly-x86-64-lsb/build/build/tmp/work/qemux86_64-poky-linux/core-image-lsb/1.0-r0/testimage/core-image-lsb-qemux86-64-testimage.ext4
NOTE: Qemu log file: /home/pokybuild/yocto-autobuilder/yocto-worker/nightly-x86-64-lsb/build/build/tmp/work/qemux86_64-poky-linux/core-image-lsb/1.0-r0/testimage/qemu_boot_log.20150915123237
NOTE: SSH log file: /home/pokybuild/yocto-autobuilder/yocto-worker/nightly-x86-64-lsb/build/build/tmp/work/qemux86_64-poky-linux/core-image-lsb/1.0-r0/testimage/ssh_target_log.20150915123237
NOTE: Created listening socket for qemu serial console on: 127.0.0.1:33516
NOTE: Created listening socket for qemu serial console on: 127.0.0.1:40188
NOTE: runqemu started, pid is 23066
NOTE: waiting at most 60 seconds for qemu pid
NOTE: qemu started - qemu procces pid is 23136
NOTE: qemu cmdline used:
/home/pokybuild/yocto-autobuilder/yocto-worker/nightly-x86-64-lsb/build/build/tmp/sysroots/x86_64-linux/usr/bin/qemu-system-x86_64 -kernel /home/pokybuild/yocto-autobuilder/yocto-worker/nightly-x86-64-lsb/build/build/tmp/deploy/images/qemux86-64/bzImage-qemux86-64.bin -net nic,vlan=0 -net tap,vlan=0,ifname=tap3,script=no,downscript=no -cpu core2duo -drive file=/home/pokybuild/yocto-autobuilder/yocto-worker/nightly-x86-64-lsb/build/build/tmp/work/qemux86_64-poky-linux/core-image-lsb/1.0-r0/testimage/core-image-lsb-qemux86-64-testimage.ext4,if=ide,format=raw -show-cursor -usb -usbdevice wacom-tablet -vga vmware -no-reboot -serial tcp:127.0.0.1:33516 -m 256 -serial tcp:127.0.0.1:40188 --append vga=0 uvesafb.mode_option=640x480-32 root=/dev/hda rw mem=256M ip=192.168.7.8::192.168.7.7:255.255.255.0 oprofile.timer=1 rootfstype=ext4 console=tty1 console=ttyS0,115200n8
NOTE: Target IP: 192.168.7.8
NOTE: Server IP: 192.168.7.7
NOTE: Starting logging thread
NOTE: Starting logging thread
NOTE: Starting thread event loop
NOTE: Connection request received
NOTE: Setting connection established event
NOTE: Waiting at most 1500 seconds for login banner
NOTE: Connection from 127.0.0.1:57760
NOTE: Reached login banner
NOTE: Logged as root in serial console
NOTE: Test modules ['oeqa.runtime.ping', 'oeqa.runtime.buildcvs', 'oeqa.runtime.buildiptables', 'oeqa.runtime.buildsudoku', 'oeqa.runtime.connman', 'oeqa.runtime.date', 'oeqa.runtime.df', 'oeqa.runtime.dmesg', 'oeqa.runtime.gcc', 'oeqa.runtime.kernelmodule', 'oeqa.runtime.ldd', 'oeqa.runtime.logrotate', 'oeqa.runtime.multilib', 'oeqa.runtime.pam', 'oeqa.runtime.parselogs', 'oeqa.runtime.perl', 'oeqa.runtime.python', 'oeqa.runtime.rpm', 'oeqa.runtime.scanelf', 'oeqa.runtime.scp', 'oeqa.runtime.skeletoninit', 'oeqa.runtime.smart', 'oeqa.runtime.ssh', 'oeqa.runtime.syslog', 'oeqa.runtime.systemd', 'oeqa.runtime.vnc', 'oeqa.runtime.x32lib', 'oeqa.runtime.xorg']
NOTE: Found 75 tests
test_ping (oeqa.runtime.ping.PingTest) ... ok
skipped "buildcvs: Image doesn't have tools-sdk in IMAGE_FEATURES"
skipped "buildiptables: Image doesn't have tools-sdk in IMAGE_FEATURES"
skipped "buildsudoku: Image doesn't have tools-sdk in IMAGE_FEATURES"
skipped 'connman: No connman package in image'
test_date (oeqa.runtime.date.DateTest) ... ok
test_df (oeqa.runtime.df.DfTest) ... ok
test_dmesg (oeqa.runtime.dmesg.DmesgTest) ... ok
skipped "gcc: Image doesn't have tools-sdk in IMAGE_FEATURES"
skipped "kernelmodule: Image doesn't have tools-sdk in IMAGE_FEATURES"
skipped "ldd: Image doesn't have tools-sdk in IMAGE_FEATURES"
test_pam (oeqa.runtime.pam.PamBasicTest) ... ok
test_parselogs (oeqa.runtime.parselogs.ParseLogsTest) ... Machine information:
*******************************
Machine name: qemux86-64
CPU: Intel(R) Core(TM)2 Duo CPU T7700 @ 2.40GHz
Arch: x86_64
Physical cores: 1
Logical cores: 1
*******************************
ok
test_perl_exists (oeqa.runtime.perl.PerlTest) ... ok
test_perl_works (oeqa.runtime.perl.PerlTest) ... ok
test_python_exists (oeqa.runtime.python.PythonTest) ... ok
test_python_stdout (oeqa.runtime.python.PythonTest) ... ok
test_python_testfile (oeqa.runtime.python.PythonTest) ... ok
test_rpm_help (oeqa.runtime.rpm.RpmBasicTest) ... ok
test_rpm_query (oeqa.runtime.rpm.RpmBasicTest) ... ok
test_check_rpm_install_removal_log_file_size (oeqa.runtime.rpm.RpmInstallRemoveTest) ... ok
test_rpm_install (oeqa.runtime.rpm.RpmInstallRemoveTest) ... ok
test_rpm_query_nonroot (oeqa.runtime.rpm.RpmInstallRemoveTest) ... ok
test_rpm_remove (oeqa.runtime.rpm.RpmInstallRemoveTest) ... ok
skipped 'scanelf: pax-utils package not installed'
test_scp_file (oeqa.runtime.scp.ScpTest) ... ok
test_smart_help (oeqa.runtime.smart.SmartBasicTest) ... ok
test_smart_info (oeqa.runtime.smart.SmartBasicTest) ... ok
test_smart_query (oeqa.runtime.smart.SmartBasicTest) ... ok
test_smart_search (oeqa.runtime.smart.SmartBasicTest) ... ok
test_smart_stats (oeqa.runtime.smart.SmartBasicTest) ... ok
test_smart_version (oeqa.runtime.smart.SmartBasicTest) ... ok
test_smart_add_rpmdir (oeqa.runtime.smart.SmartRepoTest) ... ok
test_smart_channel (oeqa.runtime.smart.SmartRepoTest) ... ok
test_smart_channel_add (oeqa.runtime.smart.SmartRepoTest) ... FAIL
test_smart_channel_add dump data stored in /tmp/oe-saved-tests/201509150540_test_smart_channel_add
test_smart_channel_help (oeqa.runtime.smart.SmartRepoTest) ... ok
test_smart_channel_list (oeqa.runtime.smart.SmartRepoTest) ... ok
test_smart_channel_rpmsys (oeqa.runtime.smart.SmartRepoTest) ... ok
test_smart_channel_show (oeqa.runtime.smart.SmartRepoTest) ... ok
test_smart_install (oeqa.runtime.smart.SmartRepoTest) ... ok
test_smart_install_dependency (oeqa.runtime.smart.SmartRepoTest) ... ok
test_smart_install_from_disk (oeqa.runtime.smart.SmartRepoTest) ... ok
test_smart_install_from_http (oeqa.runtime.smart.SmartRepoTest) ... ok
test_smart_local_dir (oeqa.runtime.smart.SmartRepoTest) ... ok
test_smart_reinstall (oeqa.runtime.smart.SmartRepoTest) ... ok
test_smart_remote_repo (oeqa.runtime.smart.SmartRepoTest) ... ok
test_smart_remove_package (oeqa.runtime.smart.SmartRepoTest) ... ok
test_ssh (oeqa.runtime.ssh.SshTest) ... ok
test_syslog_running (oeqa.runtime.syslog.SyslogTest) ... ok
test_syslog_logger (oeqa.runtime.syslog.SyslogTestConfig) ... ok
test_syslog_restart (oeqa.runtime.syslog.SyslogTestConfig) ... ok
test_syslog_startup_config (oeqa.runtime.syslog.SyslogTestConfig) ... skipped 'Non-busybox syslog'
test_syslog_startup_config dump data stored in /tmp/oe-saved-tests/201509150553_test_syslog_startup_config
skipped 'vnc: No x11vnc package in image'
skipped 'x32lib: DEFAULTTUNE is not set to x86-64-x32'
skipped "xorg: target doesn't have x11 in IMAGE_FEATURES"
test_1_logrotate_setup (oeqa.runtime.logrotate.LogrotateTest) ... ok
test_2_logrotate (oeqa.runtime.logrotate.LogrotateTest) ... ok
skipped "multilib: this isn't a multilib:lib32 image"
skipped 'skeletoninit: No service package in image'
skipped "systemd: target doesn't have systemd in DISTRO_FEATURES"
======================================================================
FAIL: test_smart_channel_add (oeqa.runtime.smart.SmartRepoTest)
----------------------------------------------------------------------
Traceback (most recent call last):
File "/home/pokybuild/yocto-autobuilder/yocto-worker/nightly-x86-64-lsb/build/meta/lib/oeqa/utils/decorators.py", line 102, in wrapped_f
return func(*args)
File "/home/pokybuild/yocto-autobuilder/yocto-worker/nightly-x86-64-lsb/build/meta/lib/oeqa/runtime/smart.py", line 80, in test_smart_channel_add
self.smart('update')
File "/home/pokybuild/yocto-autobuilder/yocto-worker/nightly-x86-64-lsb/build/meta/lib/oeqa/utils/decorators.py", line 90, in wrapped_f
return f(*args)
File "/home/pokybuild/yocto-autobuilder/yocto-worker/nightly-x86-64-lsb/build/meta/lib/oeqa/runtime/smart.py", line 22, in smart
self.assertEqual(status, expected, message)
AssertionError: 1 != 0 : smart update
Loading cache...
Updating cache... ######################################## [100%]
Fetching information for 'all'...
-> http://192.168.7.7:33381/rpm/all/repodata/repomd.xml
repomd.xml ######################################## [ 16%]
-> http://192.168.7.7:33381/rpm/all/repodata/filelists.xml.gz
filelists.xml.gz ######################################## [ 25%]
-> http://192.168.7.7:33381/rpm/all/repodata/primary.xml.gz
primary.xml.gz ######################################## [ 33%]
Fetching information for 'qemux86_64'...
-> http://192.168.7.7:33381/rpm/qemux86_64/repodata/repomd.xml
repomd.xml ######################################## [ 50%]
error: Failed acquiring information for 'qemux86_64':
error: http://192.168.7.7:33381/rpm/qemux86_64/repodata/filelists.xml.gz: None
Fetching information for 'core2_64'...
-> http://192.168.7.7:33381/rpm/qemux86_64/repodata/primary.xml.gz
primary.xml.gz ######################################## [ 66%]
-> http://192.168.7.7:33381/rpm/qemux86_64/repodata/filelists.xml.gz
filelists.xml.gz ######################################## [ 75%]
-> http://192.168.7.7:33381/rpm/core2_64/repodata/repomd.xml
repomd.xml ######################################## [ 83%]
-> http://192.168.7.7:33381/rpm/core2_64/repodata/primary.xml.gz
primary.xml.gz ######################################## [ 91%]
-> http://192.168.7.7:33381/rpm/core2_64/repodata/filelists.xml.gz
filelists.xml.gz ######################################## [100%]
Updating cache... ######################################## [100%]
Channels have 4667 new packages.
Saving cache...
----------------------------------------------------------------------
Ran 46 tests in 1170.443s
FAILED (failures=1, skipped=15)
NOTE: Stopping logging thread
NOTE: Stop event received
NOTE: Tearing down logging thread
NOTE: Sending SIGTERM to runqemu
DEBUG: Python function do_testimage finished
ERROR: Function failed: core-image-lsb - FAILED - check the task log and the ssh log