### Shell environment set up for builds. ###

You can now run 'bitbake <target>'

Common targets are:
    core-image-minimal
    core-image-sato
    meta-toolchain
    meta-ide-support

You can also run generated qemu images with a command like 'runqemu qemux86'
2019-04-24 09:27:29,647 - oe-selftest - INFO - Adding layer libraries:
2019-04-24 09:27:29,647 - oe-selftest - INFO - 	/home/pokybuild/yocto-worker/qemuppc/build/meta/lib
2019-04-24 09:27:29,647 - oe-selftest - INFO - 	/home/pokybuild/yocto-worker/qemuppc/build/meta-yocto-bsp/lib
2019-04-24 09:27:29,647 - oe-selftest - INFO - 	/home/pokybuild/yocto-worker/qemuppc/build/meta-selftest/lib
2019-04-24 09:27:29,649 - oe-selftest - INFO - Running bitbake -e to test the configuration is valid/parsable
2019-04-24 09:27:33,284 - oe-selftest - INFO - Adding: "include selftest.inc" in /home/pokybuild/yocto-worker/qemuppc/build/build-st-33308/conf/local.conf
2019-04-24 09:27:33,285 - oe-selftest - INFO - Adding: "include bblayers.inc" in bblayers.conf
2019-04-24 09:27:33,286 - oe-selftest - INFO - Adding: "include selftest.inc" in /home/pokybuild/yocto-worker/qemuppc/build/build-st-33310/conf/local.conf
2019-04-24 09:27:33,287 - oe-selftest - INFO - Adding: "include bblayers.inc" in bblayers.conf
2019-04-24 09:27:33,287 - oe-selftest - INFO - Adding: "include selftest.inc" in /home/pokybuild/yocto-worker/qemuppc/build/build-st-33307/conf/local.conf
2019-04-24 09:27:33,288 - oe-selftest - INFO - Adding: "include bblayers.inc" in bblayers.conf
2019-04-24 09:29:27,486 - oe-selftest - INFO - meta_ide.MetaIDE.test_meta_ide_can_build_cpio_project (subunit.RemotedTestCase)
2019-04-24 09:29:27,486 - oe-selftest - INFO -  ... ok
2019-04-24 09:29:27,487 - oe-selftest - INFO - 0: 1/3 1/16 (42.50s) (meta_ide.MetaIDE.test_meta_ide_can_build_cpio_project)
2019-04-24 09:29:27,601 - oe-selftest - INFO - meta_ide.MetaIDE.test_meta_ide_can_compile_c_program (subunit.RemotedTestCase)
2019-04-24 09:29:27,602 - oe-selftest - INFO -  ... ok
2019-04-24 09:29:27,602 - oe-selftest - INFO - 0: 2/3 2/16 (0.12s) (meta_ide.MetaIDE.test_meta_ide_can_compile_c_program)
2019-04-24 09:29:27,606 - oe-selftest - INFO - meta_ide.MetaIDE.test_meta_ide_had_installed_meta_ide_support (subunit.RemotedTestCase)
2019-04-24 09:29:27,606 - oe-selftest - INFO -  ... ok
2019-04-24 09:29:27,606 - oe-selftest - INFO - 0: 3/3 3/16 (0.00s) (meta_ide.MetaIDE.test_meta_ide_had_installed_meta_ide_support)
2019-04-24 09:29:39,127 - oe-selftest - INFO - runqemu.RunqemuTests.test_boot_deploy (subunit.RemotedTestCase)
2019-04-24 09:29:39,127 - oe-selftest - INFO -  ... ok
2019-04-24 09:29:39,128 - oe-selftest - INFO - 2: 1/12 4/16 (125.84s) (runqemu.RunqemuTests.test_boot_deploy)
2019-04-24 09:29:51,510 - oe-selftest - INFO - runqemu.RunqemuTests.test_boot_deploy_hddimg (subunit.RemotedTestCase)
2019-04-24 09:29:51,510 - oe-selftest - INFO -  ... ok
2019-04-24 09:29:51,510 - oe-selftest - INFO - 2: 2/12 5/16 (12.38s) (runqemu.RunqemuTests.test_boot_deploy_hddimg)
2019-04-24 09:30:05,396 - oe-selftest - INFO - runqemu.RunqemuTests.test_boot_machine (subunit.RemotedTestCase)
2019-04-24 09:30:05,396 - oe-selftest - INFO -  ... ok
2019-04-24 09:30:05,396 - oe-selftest - INFO - 2: 3/12 6/16 (13.89s) (runqemu.RunqemuTests.test_boot_machine)
2019-04-24 09:30:19,135 - oe-selftest - INFO - runqemu.RunqemuTests.test_boot_machine_ext4 (subunit.RemotedTestCase)
2019-04-24 09:30:19,135 - oe-selftest - INFO -  ... ok
2019-04-24 09:30:19,135 - oe-selftest - INFO - 2: 4/12 7/16 (13.74s) (runqemu.RunqemuTests.test_boot_machine_ext4)
2019-04-24 09:30:33,520 - oe-selftest - INFO - runqemu.RunqemuTests.test_boot_machine_iso (subunit.RemotedTestCase)
2019-04-24 09:30:33,520 - oe-selftest - INFO -  ... ok
2019-04-24 09:30:33,521 - oe-selftest - INFO - 2: 5/12 8/16 (14.39s) (runqemu.RunqemuTests.test_boot_machine_iso)
2019-04-24 09:30:47,379 - oe-selftest - INFO - runqemu.RunqemuTests.test_boot_machine_slirp (subunit.RemotedTestCase)
2019-04-24 09:30:47,379 - oe-selftest - INFO -  ... ok
2019-04-24 09:30:47,379 - oe-selftest - INFO - 2: 6/12 9/16 (13.86s) (runqemu.RunqemuTests.test_boot_machine_slirp)
2019-04-24 09:31:00,562 - oe-selftest - INFO - runqemu.RunqemuTests.test_boot_machine_slirp_qcow2 (subunit.RemotedTestCase)
2019-04-24 09:31:00,562 - oe-selftest - INFO -  ... ok
2019-04-24 09:31:00,562 - oe-selftest - INFO - 2: 7/12 10/16 (13.18s) (runqemu.RunqemuTests.test_boot_machine_slirp_qcow2)
2019-04-24 09:31:13,084 - oe-selftest - INFO - runqemu.RunqemuTests.test_boot_qemu_boot (subunit.RemotedTestCase)
2019-04-24 09:31:13,084 - oe-selftest - INFO -  ... ok
2019-04-24 09:31:13,085 - oe-selftest - INFO - 2: 8/12 11/16 (12.52s) (runqemu.RunqemuTests.test_boot_qemu_boot)
2019-04-24 09:31:26,829 - oe-selftest - INFO - runqemu.RunqemuTests.test_boot_recipe_image (subunit.RemotedTestCase)
2019-04-24 09:31:26,829 - oe-selftest - INFO -  ... ok
2019-04-24 09:31:26,829 - oe-selftest - INFO - 2: 9/12 12/16 (13.74s) (runqemu.RunqemuTests.test_boot_recipe_image)
2019-04-24 09:31:40,112 - oe-selftest - INFO - runqemu.RunqemuTests.test_boot_recipe_image_vdi (subunit.RemotedTestCase)
2019-04-24 09:31:40,113 - oe-selftest - INFO -  ... ok
2019-04-24 09:31:40,113 - oe-selftest - INFO - 2: 10/12 13/16 (13.28s) (runqemu.RunqemuTests.test_boot_recipe_image_vdi)
2019-04-24 09:31:53,459 - oe-selftest - INFO - runqemu.RunqemuTests.test_boot_recipe_image_vmdk (subunit.RemotedTestCase)
2019-04-24 09:31:53,459 - oe-selftest - INFO -  ... ok
2019-04-24 09:31:53,460 - oe-selftest - INFO - 2: 11/12 14/16 (13.35s) (runqemu.RunqemuTests.test_boot_recipe_image_vmdk)
2019-04-24 09:32:05,928 - oe-selftest - INFO - runqemu.RunqemuTests.test_boot_rootfs (subunit.RemotedTestCase)
2019-04-24 09:32:05,928 - oe-selftest - INFO -  ... ok
2019-04-24 09:32:05,928 - oe-selftest - INFO - 2: 12/12 15/16 (12.47s) (runqemu.RunqemuTests.test_boot_rootfs)
2019-04-24 09:32:33,366 - oe-selftest - INFO - runqemu.QemuTest.test_qemu_can_shutdown (subunit.RemotedTestCase)
2019-04-24 09:32:33,366 - oe-selftest - INFO -  ... FAIL
2019-04-24 09:32:33,366 - oe-selftest - INFO - 1: 1/1 16/16 (200.74s) (runqemu.QemuTest.test_qemu_can_shutdown)
2019-04-24 09:32:33,366 - oe-selftest - INFO - testtools.testresult.real._StringException: Traceback (most recent call last):
  File "/home/pokybuild/yocto-worker/qemuppc/build/meta/lib/oeqa/selftest/cases/runqemu.py", line 200, in test_qemu_can_shutdown
    self.assertTrue(qemu_shutdown_succeeded, 'Failed: %s does not shutdown within timeout(%s)' % (self.machine, shutdown_timeout))
  File "/usr/lib/python3.6/unittest/case.py", line 682, in assertTrue
    raise self.failureException(msg)
AssertionError: False is not true : Failed: qemuppc does not shutdown within timeout(120)


2019-04-24 09:32:36,048 - oe-selftest - INFO - ======================================================================
2019-04-24 09:32:36,048 - oe-selftest - INFO - FAIL: runqemu.QemuTest.test_qemu_can_shutdown (subunit.RemotedTestCase)
2019-04-24 09:32:36,048 - oe-selftest - INFO - ----------------------------------------------------------------------
2019-04-24 09:32:36,048 - oe-selftest - INFO - testtools.testresult.real._StringException: Traceback (most recent call last):
  File "/home/pokybuild/yocto-worker/qemuppc/build/meta/lib/oeqa/selftest/cases/runqemu.py", line 200, in test_qemu_can_shutdown
    self.assertTrue(qemu_shutdown_succeeded, 'Failed: %s does not shutdown within timeout(%s)' % (self.machine, shutdown_timeout))
  File "/usr/lib/python3.6/unittest/case.py", line 682, in assertTrue
    raise self.failureException(msg)
AssertionError: False is not true : Failed: qemuppc does not shutdown within timeout(120)


2019-04-24 09:32:36,048 - oe-selftest - INFO - ----------------------------------------------------------------------
2019-04-24 09:32:36,048 - oe-selftest - INFO - Ran 16 tests in 304.902s
2019-04-24 09:32:36,048 - oe-selftest - INFO - FAILED
2019-04-24 09:32:36,049 - oe-selftest - INFO -  (failures=1)
2019-04-24 09:32:40,422 - oe-selftest - INFO - RESULTS:
2019-04-24 09:32:40,423 - oe-selftest - INFO - RESULTS - meta_ide.MetaIDE.test_meta_ide_can_build_cpio_project - Testcase 1984: PASSED (42.50s)
2019-04-24 09:32:40,423 - oe-selftest - INFO - RESULTS - meta_ide.MetaIDE.test_meta_ide_can_compile_c_program - Testcase 1983: PASSED (0.12s)
2019-04-24 09:32:40,423 - oe-selftest - INFO - RESULTS - meta_ide.MetaIDE.test_meta_ide_had_installed_meta_ide_support - Testcase 1982: PASSED (0.01s)
2019-04-24 09:32:40,424 - oe-selftest - INFO - RESULTS - runqemu.RunqemuTests.test_boot_deploy - Testcase 2007: PASSED (125.84s)
2019-04-24 09:32:40,424 - oe-selftest - INFO - RESULTS - runqemu.RunqemuTests.test_boot_deploy_hddimg - Testcase 2008: PASSED (12.38s)
2019-04-24 09:32:40,424 - oe-selftest - INFO - RESULTS - runqemu.RunqemuTests.test_boot_machine - Testcase 2001: PASSED (13.89s)
2019-04-24 09:32:40,424 - oe-selftest - INFO - RESULTS - runqemu.RunqemuTests.test_boot_machine_ext4 - Testcase 2002: PASSED (13.74s)
2019-04-24 09:32:40,424 - oe-selftest - INFO - RESULTS - runqemu.RunqemuTests.test_boot_machine_iso - Testcase 2003: PASSED (14.39s)
2019-04-24 09:32:40,424 - oe-selftest - INFO - RESULTS - runqemu.RunqemuTests.test_boot_machine_slirp - Testcase 2009: PASSED (13.86s)
2019-04-24 09:32:40,424 - oe-selftest - INFO - RESULTS - runqemu.RunqemuTests.test_boot_machine_slirp_qcow2 - Testcase 2009: PASSED (13.18s)
2019-04-24 09:32:40,424 - oe-selftest - INFO - RESULTS - runqemu.RunqemuTests.test_boot_qemu_boot - Testcase 2010: PASSED (12.52s)
2019-04-24 09:32:40,424 - oe-selftest - INFO - RESULTS - runqemu.RunqemuTests.test_boot_recipe_image - Testcase 2004: PASSED (13.75s)
2019-04-24 09:32:40,424 - oe-selftest - INFO - RESULTS - runqemu.RunqemuTests.test_boot_recipe_image_vdi - Testcase 2006: PASSED (13.28s)
2019-04-24 09:32:40,424 - oe-selftest - INFO - RESULTS - runqemu.RunqemuTests.test_boot_recipe_image_vmdk - Testcase 2005: PASSED (13.35s)
2019-04-24 09:32:40,424 - oe-selftest - INFO - RESULTS - runqemu.RunqemuTests.test_boot_rootfs - Testcase 2011: PASSED (12.47s)
2019-04-24 09:32:40,424 - oe-selftest - INFO - RESULTS - runqemu.QemuTest.test_qemu_can_shutdown - Testcase -1: FAILED (200.74s)
2019-04-24 09:32:40,428 - oe-selftest - INFO - SUMMARY:
2019-04-24 09:32:40,428 - oe-selftest - INFO - oe-selftest () - Ran 16 tests in 305.057s
2019-04-24 09:32:40,428 - oe-selftest - INFO - oe-selftest - FAIL - Required tests failed (successes=15, skipped=0, failures=1, errors=0)

Error details

Submitted on:
24/04/19 04:32
Error type:
OE selftest
Command:
oe-selftest -r runqemu meta_ide -j 15
Machine:
qemuppc
Distro:
poky
Build system:
unknown
Target system:
unknown
Host distro:
unknown
Branch:
master-next
Commit:
unknown
Build:
#80428
Submitter:
yp-ab-ubuntu1804-ty
Link back:
https://autobuilder.yoctoproject.org/typhoon/#builders/63/builds/525
Similar errors:
0
Open a bug