### Shell environment set up for builds. ###

You can now run 'bitbake <target>'

Common targets are:
    core-image-minimal
    core-image-sato
    meta-toolchain
    meta-ide-support

You can also run generated qemu images with a command like 'runqemu qemux86'
2019-05-18 06:31:13,732 - oe-selftest - INFO - Adding layer libraries:
2019-05-18 06:31:13,732 - oe-selftest - INFO - 	/home/pokybuild/yocto-worker/qemuppc/build/meta/lib
2019-05-18 06:31:13,733 - oe-selftest - INFO - 	/home/pokybuild/yocto-worker/qemuppc/build/meta-yocto-bsp/lib
2019-05-18 06:31:13,733 - oe-selftest - INFO - 	/home/pokybuild/yocto-worker/qemuppc/build/meta-selftest/lib
2019-05-18 06:31:13,734 - oe-selftest - INFO - Running bitbake -e to test the configuration is valid/parsable
2019-05-18 06:31:17,216 - oe-selftest - INFO - Adding: "include selftest.inc" in /home/pokybuild/yocto-worker/qemuppc/build/build-st-45327/conf/local.conf
2019-05-18 06:31:17,217 - oe-selftest - INFO - Adding: "include selftest.inc" in /home/pokybuild/yocto-worker/qemuppc/build/build-st-45328/conf/local.conf
2019-05-18 06:31:17,217 - oe-selftest - INFO - Adding: "include bblayers.inc" in bblayers.conf
2019-05-18 06:31:17,218 - oe-selftest - INFO - Adding: "include bblayers.inc" in bblayers.conf
2019-05-18 06:31:17,218 - oe-selftest - INFO - Adding: "include selftest.inc" in /home/pokybuild/yocto-worker/qemuppc/build/build-st-45329/conf/local.conf
2019-05-18 06:31:17,219 - oe-selftest - INFO - Adding: "include bblayers.inc" in bblayers.conf
2019-05-18 06:33:14,188 - oe-selftest - INFO - meta_ide.MetaIDE.test_meta_ide_can_build_cpio_project (subunit.RemotedTestCase)
2019-05-18 06:33:14,188 - oe-selftest - INFO -  ... ok
2019-05-18 06:33:14,188 - oe-selftest - INFO - 0: 1/3 1/16 (42.50s) (meta_ide.MetaIDE.test_meta_ide_can_build_cpio_project)
2019-05-18 06:33:14,352 - oe-selftest - INFO - meta_ide.MetaIDE.test_meta_ide_can_compile_c_program (subunit.RemotedTestCase)
2019-05-18 06:33:14,352 - oe-selftest - INFO -  ... ok
2019-05-18 06:33:14,352 - oe-selftest - INFO - 0: 2/3 2/16 (0.16s) (meta_ide.MetaIDE.test_meta_ide_can_compile_c_program)
2019-05-18 06:33:14,358 - oe-selftest - INFO - meta_ide.MetaIDE.test_meta_ide_had_installed_meta_ide_support (subunit.RemotedTestCase)
2019-05-18 06:33:14,358 - oe-selftest - INFO -  ... ok
2019-05-18 06:33:14,358 - oe-selftest - INFO - 0: 3/3 3/16 (0.01s) (meta_ide.MetaIDE.test_meta_ide_had_installed_meta_ide_support)
2019-05-18 06:33:30,175 - oe-selftest - INFO - runqemu.RunqemuTests.test_boot_deploy (subunit.RemotedTestCase)
2019-05-18 06:33:30,176 - oe-selftest - INFO -  ... ok
2019-05-18 06:33:30,176 - oe-selftest - INFO - 2: 1/12 4/16 (132.96s) (runqemu.RunqemuTests.test_boot_deploy)
2019-05-18 06:33:43,420 - oe-selftest - INFO - runqemu.RunqemuTests.test_boot_deploy_hddimg (subunit.RemotedTestCase)
2019-05-18 06:33:43,420 - oe-selftest - INFO -  ... ok
2019-05-18 06:33:43,420 - oe-selftest - INFO - 2: 2/12 5/16 (13.24s) (runqemu.RunqemuTests.test_boot_deploy_hddimg)
2019-05-18 06:33:58,428 - oe-selftest - INFO - runqemu.RunqemuTests.test_boot_machine (subunit.RemotedTestCase)
2019-05-18 06:33:58,428 - oe-selftest - INFO -  ... ok
2019-05-18 06:33:58,428 - oe-selftest - INFO - 2: 3/12 6/16 (15.01s) (runqemu.RunqemuTests.test_boot_machine)
2019-05-18 06:34:13,536 - oe-selftest - INFO - runqemu.RunqemuTests.test_boot_machine_ext4 (subunit.RemotedTestCase)
2019-05-18 06:34:13,536 - oe-selftest - INFO -  ... ok
2019-05-18 06:34:13,536 - oe-selftest - INFO - 2: 4/12 7/16 (15.11s) (runqemu.RunqemuTests.test_boot_machine_ext4)
2019-05-18 06:34:29,356 - oe-selftest - INFO - runqemu.RunqemuTests.test_boot_machine_iso (subunit.RemotedTestCase)
2019-05-18 06:34:29,356 - oe-selftest - INFO -  ... ok
2019-05-18 06:34:29,356 - oe-selftest - INFO - 2: 5/12 8/16 (15.82s) (runqemu.RunqemuTests.test_boot_machine_iso)
2019-05-18 06:34:44,304 - oe-selftest - INFO - runqemu.RunqemuTests.test_boot_machine_slirp (subunit.RemotedTestCase)
2019-05-18 06:34:44,305 - oe-selftest - INFO -  ... ok
2019-05-18 06:34:44,305 - oe-selftest - INFO - 2: 6/12 9/16 (14.95s) (runqemu.RunqemuTests.test_boot_machine_slirp)
2019-05-18 06:34:58,860 - oe-selftest - INFO - runqemu.RunqemuTests.test_boot_machine_slirp_qcow2 (subunit.RemotedTestCase)
2019-05-18 06:34:58,860 - oe-selftest - INFO -  ... ok
2019-05-18 06:34:58,860 - oe-selftest - INFO - 2: 7/12 10/16 (14.56s) (runqemu.RunqemuTests.test_boot_machine_slirp_qcow2)
2019-05-18 06:35:12,300 - oe-selftest - INFO - runqemu.RunqemuTests.test_boot_qemu_boot (subunit.RemotedTestCase)
2019-05-18 06:35:12,300 - oe-selftest - INFO -  ... ok
2019-05-18 06:35:12,301 - oe-selftest - INFO - 2: 8/12 11/16 (13.44s) (runqemu.RunqemuTests.test_boot_qemu_boot)
2019-05-18 06:35:27,316 - oe-selftest - INFO - runqemu.RunqemuTests.test_boot_recipe_image (subunit.RemotedTestCase)
2019-05-18 06:35:27,316 - oe-selftest - INFO -  ... ok
2019-05-18 06:35:27,316 - oe-selftest - INFO - 2: 9/12 12/16 (15.02s) (runqemu.RunqemuTests.test_boot_recipe_image)
2019-05-18 06:35:41,799 - oe-selftest - INFO - runqemu.RunqemuTests.test_boot_recipe_image_vdi (subunit.RemotedTestCase)
2019-05-18 06:35:41,799 - oe-selftest - INFO -  ... ok
2019-05-18 06:35:41,799 - oe-selftest - INFO - 2: 10/12 13/16 (14.48s) (runqemu.RunqemuTests.test_boot_recipe_image_vdi)
2019-05-18 06:35:56,231 - oe-selftest - INFO - runqemu.RunqemuTests.test_boot_recipe_image_vmdk (subunit.RemotedTestCase)
2019-05-18 06:35:56,231 - oe-selftest - INFO -  ... ok
2019-05-18 06:35:56,231 - oe-selftest - INFO - 2: 11/12 14/16 (14.43s) (runqemu.RunqemuTests.test_boot_recipe_image_vmdk)
2019-05-18 06:36:09,457 - oe-selftest - INFO - runqemu.RunqemuTests.test_boot_rootfs (subunit.RemotedTestCase)
2019-05-18 06:36:09,458 - oe-selftest - INFO -  ... ok
2019-05-18 06:36:09,458 - oe-selftest - INFO - 2: 12/12 15/16 (13.23s) (runqemu.RunqemuTests.test_boot_rootfs)
2019-05-18 06:36:30,083 - oe-selftest - INFO - runqemu.QemuTest.test_qemu_can_shutdown (subunit.RemotedTestCase)
2019-05-18 06:36:30,084 - oe-selftest - INFO -  ... FAIL
2019-05-18 06:36:30,085 - oe-selftest - INFO - 1: 1/1 16/16 (202.18s) (runqemu.QemuTest.test_qemu_can_shutdown)
2019-05-18 06:36:30,085 - oe-selftest - INFO - testtools.testresult.real._StringException: Traceback (most recent call last):
  File "/home/pokybuild/yocto-worker/qemuppc/build/meta/lib/oeqa/selftest/cases/runqemu.py", line 187, in test_qemu_can_shutdown
    self.assertTrue(qemu_shutdown_succeeded, 'Failed: %s does not shutdown within timeout(%s)' % (self.machine, shutdown_timeout))
  File "/usr/lib64/python3.6/unittest/case.py", line 699, in assertTrue
    raise self.failureException(msg)
AssertionError: False is not true : Failed: qemuppc does not shutdown within timeout(120)


2019-05-18 06:36:33,057 - oe-selftest - INFO - ======================================================================
2019-05-18 06:36:33,057 - oe-selftest - INFO - FAIL: runqemu.QemuTest.test_qemu_can_shutdown (subunit.RemotedTestCase)
2019-05-18 06:36:33,057 - oe-selftest - INFO - ----------------------------------------------------------------------
2019-05-18 06:36:33,057 - oe-selftest - INFO - testtools.testresult.real._StringException: Traceback (most recent call last):
  File "/home/pokybuild/yocto-worker/qemuppc/build/meta/lib/oeqa/selftest/cases/runqemu.py", line 187, in test_qemu_can_shutdown
    self.assertTrue(qemu_shutdown_succeeded, 'Failed: %s does not shutdown within timeout(%s)' % (self.machine, shutdown_timeout))
  File "/usr/lib64/python3.6/unittest/case.py", line 699, in assertTrue
    raise self.failureException(msg)
AssertionError: False is not true : Failed: qemuppc does not shutdown within timeout(120)


2019-05-18 06:36:33,058 - oe-selftest - INFO - ----------------------------------------------------------------------
2019-05-18 06:36:33,058 - oe-selftest - INFO - Ran 16 tests in 317.559s
2019-05-18 06:36:33,058 - oe-selftest - INFO - FAILED
2019-05-18 06:36:33,058 - oe-selftest - INFO -  (failures=1)
2019-05-18 06:36:37,928 - oe-selftest - INFO - RESULTS:
2019-05-18 06:36:37,930 - oe-selftest - INFO - RESULTS - meta_ide.MetaIDE.test_meta_ide_can_build_cpio_project: PASSED (42.50s)
2019-05-18 06:36:37,930 - oe-selftest - INFO - RESULTS - meta_ide.MetaIDE.test_meta_ide_can_compile_c_program: PASSED (0.17s)
2019-05-18 06:36:37,930 - oe-selftest - INFO - RESULTS - meta_ide.MetaIDE.test_meta_ide_had_installed_meta_ide_support: PASSED (0.01s)
2019-05-18 06:36:37,930 - oe-selftest - INFO - RESULTS - runqemu.RunqemuTests.test_boot_deploy: PASSED (132.96s)
2019-05-18 06:36:37,930 - oe-selftest - INFO - RESULTS - runqemu.RunqemuTests.test_boot_deploy_hddimg: PASSED (13.24s)
2019-05-18 06:36:37,930 - oe-selftest - INFO - RESULTS - runqemu.RunqemuTests.test_boot_machine: PASSED (15.01s)
2019-05-18 06:36:37,930 - oe-selftest - INFO - RESULTS - runqemu.RunqemuTests.test_boot_machine_ext4: PASSED (15.11s)
2019-05-18 06:36:37,931 - oe-selftest - INFO - RESULTS - runqemu.RunqemuTests.test_boot_machine_iso: PASSED (15.82s)
2019-05-18 06:36:37,931 - oe-selftest - INFO - RESULTS - runqemu.RunqemuTests.test_boot_machine_slirp: PASSED (14.95s)
2019-05-18 06:36:37,931 - oe-selftest - INFO - RESULTS - runqemu.RunqemuTests.test_boot_machine_slirp_qcow2: PASSED (14.56s)
2019-05-18 06:36:37,931 - oe-selftest - INFO - RESULTS - runqemu.RunqemuTests.test_boot_qemu_boot: PASSED (13.44s)
2019-05-18 06:36:37,931 - oe-selftest - INFO - RESULTS - runqemu.RunqemuTests.test_boot_recipe_image: PASSED (15.02s)
2019-05-18 06:36:37,931 - oe-selftest - INFO - RESULTS - runqemu.RunqemuTests.test_boot_recipe_image_vdi: PASSED (14.48s)
2019-05-18 06:36:37,931 - oe-selftest - INFO - RESULTS - runqemu.RunqemuTests.test_boot_recipe_image_vmdk: PASSED (14.43s)
2019-05-18 06:36:37,931 - oe-selftest - INFO - RESULTS - runqemu.RunqemuTests.test_boot_rootfs: PASSED (13.23s)
2019-05-18 06:36:37,931 - oe-selftest - INFO - RESULTS - runqemu.QemuTest.test_qemu_can_shutdown: FAILED (202.18s)
2019-05-18 06:36:37,936 - oe-selftest - INFO - SUMMARY:
2019-05-18 06:36:37,936 - oe-selftest - INFO - oe-selftest () - Ran 16 tests in 317.722s
2019-05-18 06:36:37,936 - oe-selftest - INFO - oe-selftest - FAIL - Required tests failed (successes=15, skipped=0, failures=1, errors=0)

Error details

Submitted on:
18/05/19 01:36
Error type:
OE selftest
Command:
oe-selftest -r runqemu meta_ide -j 15
Machine:
qemuppc
Distro:
poky
Build system:
unknown
Target system:
unknown
Host distro:
unknown
Branch:
stable/warrior-nmut
Commit:
unknown
Build:
#81543
Submitter:
yp-ab-centos7-ty-2.yocto.io
Link back:
https://autobuilder.yoctoproject.org/typhoon/#builders/63/builds/602
Similar errors:
0
Open a bug