DEBUG: SITE files ['endian-little', 'bit-32', 'arm-common', 'arm-32', 'common-linux', 'common-musl', 'arm-linux', 'arm-linux-musleabi', 'common']
DEBUG: Executing shell function do_compile
NOTE: make -j 16 -l 24.0 -l 24.0
Making all in src
make[1]: Entering directory 'TOPDIR/build/tmp/work/armv7vet2hf-neon-yoe-linux-musleabi/stressapptest/1.0.9-r0/build/src'
make all-am
make[2]: Entering directory 'TOPDIR/build/tmp/work/armv7vet2hf-neon-yoe-linux-musleabi/stressapptest/1.0.9-r0/build/src'
arm-yoe-linux-musleabi-g++ -march=armv7ve -mthumb -mfpu=neon -mfloat-abi=hard -fstack-protector-strong -D_FORTIFY_SOURCE=2 -Wformat -Wformat-security -Werror=format-security --sysroot=TOPDIR/build/tmp/work/armv7vet2hf-neon-yoe-linux-musleabi/stressapptest/1.0.9-r0/recipe-sysroot -DHAVE_CONFIG_H -I. -I../../stressapptest-1.0.9/src -O2 -pipe -g -feliminate-unused-debug-types -fmacro-prefix-map=TOPDIR/build/tmp/work/armv7vet2hf-neon-yoe-linux-musleabi/stressapptest/1.0.9-r0=/usr/src/debug/stressapptest/1.0.9-r0 -fdebug-prefix-map=TOPDIR/build/tmp/work/armv7vet2hf-neon-yoe-linux-musleabi/stressapptest/1.0.9-r0=/usr/src/debug/stressapptest/1.0.9-r0 -fdebug-prefix-map=TOPDIR/build/tmp/work/armv7vet2hf-neon-yoe-linux-musleabi/stressapptest/1.0.9-r0/recipe-sysroot= -fdebug-prefix-map=TOPDIR/build/tmp/work/armv7vet2hf-neon-yoe-linux-musleabi/stressapptest/1.0.9-r0/recipe-sysroot-native= -fvisibility-inlines-hidden -DCHECKOPTS -Wreturn-type -Wunused -Wuninitialized -Wall -O3 -funroll-all-loops -funroll-loops -DNDEBUG -c -o main.o ../../stressapptest-1.0.9/src/main.cc
In file included from ../../stressapptest-1.0.9/src/main.cc:17:
../../stressapptest-1.0.9/src/sattypes.h:233:2: warning: #warning "Unsupported CPU type." [-Wcpp]
233 | #warning "Unsupported CPU type."
| ^~~~~~~
In file included from ../../stressapptest-1.0.9/src/finelock_queue.h:29,
from ../../stressapptest-1.0.9/src/sat.h:28,
from ../../stressapptest-1.0.9/src/main.cc:18:
../../stressapptest-1.0.9/src/os.h:166:4: warning: #warning "Unsupported CPU type: Unable to force cache flushes." [-Wcpp]
166 | #warning "Unsupported CPU type: Unable to force cache flushes."
| ^~~~~~~
../../stressapptest-1.0.9/src/os.h:200:6: warning: #warning "Unsupported CPU type: Unable to force cache flushes." [-Wcpp]
200 | #warning "Unsupported CPU type: Unable to force cache flushes."
| ^~~~~~~
../../stressapptest-1.0.9/src/os.h:223:6: warning: #warning "Unsupported CPU type: Unable to force cache flushes." [-Wcpp]
223 | #warning "Unsupported CPU type: Unable to force cache flushes."
| ^~~~~~~
../../stressapptest-1.0.9/src/os.h:249:4: warning: #warning "Unsupported CPU type: Unable to force cache flushes." [-Wcpp]
249 | #warning "Unsupported CPU type: Unable to force cache flushes."
| ^~~~~~~
../../stressapptest-1.0.9/src/os.h:281:6: warning: #warning "Unsupported CPU type: your timer may not function correctly" [-Wcpp]
281 | #warning "Unsupported CPU type: your timer may not function correctly"
| ^~~~~~~
arm-yoe-linux-musleabi-gcc -march=armv7ve -mthumb -mfpu=neon -mfloat-abi=hard -fstack-protector-strong -D_FORTIFY_SOURCE=2 -Wformat -Wformat-security -Werror=format-security --sysroot=TOPDIR/build/tmp/work/armv7vet2hf-neon-yoe-linux-musleabi/stressapptest/1.0.9-r0/recipe-sysroot -DHAVE_CONFIG_H -I. -I../../stressapptest-1.0.9/src -O2 -pipe -g -feliminate-unused-debug-types -fmacro-prefix-map=TOPDIR/build/tmp/work/armv7vet2hf-neon-yoe-linux-musleabi/stressapptest/1.0.9-r0=/usr/src/debug/stressapptest/1.0.9-r0 -fdebug-prefix-map=TOPDIR/build/tmp/work/armv7vet2hf-neon-yoe-linux-musleabi/stressapptest/1.0.9-r0=/usr/src/debug/stressapptest/1.0.9-r0 -fdebug-prefix-map=TOPDIR/build/tmp/work/armv7vet2hf-neon-yoe-linux-musleabi/stressapptest/1.0.9-r0/recipe-sysroot= -fdebug-prefix-map=TOPDIR/build/tmp/work/armv7vet2hf-neon-yoe-linux-musleabi/stressapptest/1.0.9-r0/recipe-sysroot-native= -c -o findmask.o ../../stressapptest-1.0.9/src/findmask.c
arm-yoe-linux-musleabi-g++ -march=armv7ve -mthumb -mfpu=neon -mfloat-abi=hard -fstack-protector-strong -D_FORTIFY_SOURCE=2 -Wformat -Wformat-security -Werror=format-security --sysroot=TOPDIR/build/tmp/work/armv7vet2hf-neon-yoe-linux-musleabi/stressapptest/1.0.9-r0/recipe-sysroot -DHAVE_CONFIG_H -I. -I../../stressapptest-1.0.9/src -O2 -pipe -g -feliminate-unused-debug-types -fmacro-prefix-map=TOPDIR/build/tmp/work/armv7vet2hf-neon-yoe-linux-musleabi/stressapptest/1.0.9-r0=/usr/src/debug/stressapptest/1.0.9-r0 -fdebug-prefix-map=TOPDIR/build/tmp/work/armv7vet2hf-neon-yoe-linux-musleabi/stressapptest/1.0.9-r0=/usr/src/debug/stressapptest/1.0.9-r0 -fdebug-prefix-map=TOPDIR/build/tmp/work/armv7vet2hf-neon-yoe-linux-musleabi/stressapptest/1.0.9-r0/recipe-sysroot= -fdebug-prefix-map=TOPDIR/build/tmp/work/armv7vet2hf-neon-yoe-linux-musleabi/stressapptest/1.0.9-r0/recipe-sysroot-native= -fvisibility-inlines-hidden -DCHECKOPTS -Wreturn-type -Wunused -Wuninitialized -Wall -O3 -funroll-all-loops -funroll-loops -DNDEBUG -c -o logger.o ../../stressapptest-1.0.9/src/logger.cc
In file included from ../../stressapptest-1.0.9/src/logger.h:26,
from ../../stressapptest-1.0.9/src/logger.cc:15:
../../stressapptest-1.0.9/src/sattypes.h:233:2: warning: #warning "Unsupported CPU type." [-Wcpp]
233 | #warning "Unsupported CPU type."
| ^~~~~~~
arm-yoe-linux-musleabi-gcc -march=armv7ve -mthumb -mfpu=neon -mfloat-abi=hard -fstack-protector-strong -D_FORTIFY_SOURCE=2 -Wformat -Wformat-security -Werror=format-security --sysroot=TOPDIR/build/tmp/work/armv7vet2hf-neon-yoe-linux-musleabi/stressapptest/1.0.9-r0/recipe-sysroot -O2 -pipe -g -feliminate-unused-debug-types -fmacro-prefix-map=TOPDIR/build/tmp/work/armv7vet2hf-neon-yoe-linux-musleabi/stressapptest/1.0.9-r0=/usr/src/debug/stressapptest/1.0.9-r0 -fdebug-prefix-map=TOPDIR/build/tmp/work/armv7vet2hf-neon-yoe-linux-musleabi/stressapptest/1.0.9-r0=/usr/src/debug/stressapptest/1.0.9-r0 -fdebug-prefix-map=TOPDIR/build/tmp/work/armv7vet2hf-neon-yoe-linux-musleabi/stressapptest/1.0.9-r0/recipe-sysroot= -fdebug-prefix-map=TOPDIR/build/tmp/work/armv7vet2hf-neon-yoe-linux-musleabi/stressapptest/1.0.9-r0/recipe-sysroot-native= -Wl,-O1 -Wl,--hash-style=gnu -Wl,--as-needed -fstack-protector-strong -Wl,-z,relro,-z,now -o findmask findmask.o
arm-yoe-linux-musleabi-g++ -march=armv7ve -mthumb -mfpu=neon -mfloat-abi=hard -fstack-protector-strong -D_FORTIFY_SOURCE=2 -Wformat -Wformat-security -Werror=format-security --sysroot=TOPDIR/build/tmp/work/armv7vet2hf-neon-yoe-linux-musleabi/stressapptest/1.0.9-r0/recipe-sysroot -DHAVE_CONFIG_H -I. -I../../stressapptest-1.0.9/src -O2 -pipe -g -feliminate-unused-debug-types -fmacro-prefix-map=TOPDIR/build/tmp/work/armv7vet2hf-neon-yoe-linux-musleabi/stressapptest/1.0.9-r0=/usr/src/debug/stressapptest/1.0.9-r0 -fdebug-prefix-map=TOPDIR/build/tmp/work/armv7vet2hf-neon-yoe-linux-musleabi/stressapptest/1.0.9-r0=/usr/src/debug/stressapptest/1.0.9-r0 -fdebug-prefix-map=TOPDIR/build/tmp/work/armv7vet2hf-neon-yoe-linux-musleabi/stressapptest/1.0.9-r0/recipe-sysroot= -fdebug-prefix-map=TOPDIR/build/tmp/work/armv7vet2hf-neon-yoe-linux-musleabi/stressapptest/1.0.9-r0/recipe-sysroot-native= -fvisibility-inlines-hidden -DCHECKOPTS -Wreturn-type -Wunused -Wuninitialized -Wall -O3 -funroll-all-loops -funroll-loops -DNDEBUG -c -o adler32memcpy.o ../../stressapptest-1.0.9/src/adler32memcpy.cc
In file included from ../../stressapptest-1.0.9/src/adler32memcpy.h:19,
from ../../stressapptest-1.0.9/src/adler32memcpy.cc:15:
../../stressapptest-1.0.9/src/sattypes.h:233:2: warning: #warning "Unsupported CPU type." [-Wcpp]
233 | #warning "Unsupported CPU type."
| ^~~~~~~
../../stressapptest-1.0.9/src/adler32memcpy.cc:519:4: warning: #warning "No vector copy defined for this architecture." [-Wcpp]
519 | #warning "No vector copy defined for this architecture."
| ^~~~~~~
arm-yoe-linux-musleabi-g++ -march=armv7ve -mthumb -mfpu=neon -mfloat-abi=hard -fstack-protector-strong -D_FORTIFY_SOURCE=2 -Wformat -Wformat-security -Werror=format-security --sysroot=TOPDIR/build/tmp/work/armv7vet2hf-neon-yoe-linux-musleabi/stressapptest/1.0.9-r0/recipe-sysroot -DHAVE_CONFIG_H -I. -I../../stressapptest-1.0.9/src -O2 -pipe -g -feliminate-unused-debug-types -fmacro-prefix-map=TOPDIR/build/tmp/work/armv7vet2hf-neon-yoe-linux-musleabi/stressapptest/1.0.9-r0=/usr/src/debug/stressapptest/1.0.9-r0 -fdebug-prefix-map=TOPDIR/build/tmp/work/armv7vet2hf-neon-yoe-linux-musleabi/stressapptest/1.0.9-r0=/usr/src/debug/stressapptest/1.0.9-r0 -fdebug-prefix-map=TOPDIR/build/tmp/work/armv7vet2hf-neon-yoe-linux-musleabi/stressapptest/1.0.9-r0/recipe-sysroot= -fdebug-prefix-map=TOPDIR/build/tmp/work/armv7vet2hf-neon-yoe-linux-musleabi/stressapptest/1.0.9-r0/recipe-sysroot-native= -fvisibility-inlines-hidden -DCHECKOPTS -Wreturn-type -Wunused -Wuninitialized -Wall -O3 -funroll-all-loops -funroll-loops -DNDEBUG -c -o disk_blocks.o ../../stressapptest-1.0.9/src/disk_blocks.cc
In file included from ../../stressapptest-1.0.9/src/disk_blocks.h:29,
from ../../stressapptest-1.0.9/src/disk_blocks.cc:19:
../../stressapptest-1.0.9/src/sattypes.h:233:2: warning: #warning "Unsupported CPU type." [-Wcpp]
233 | #warning "Unsupported CPU type."
| ^~~~~~~
In file included from TOPDIR/build/tmp/work/armv7vet2hf-neon-yoe-linux-musleabi/stressapptest/1.0.9-r0/recipe-sysroot/usr/include/c++/9.1.0/vector:72,
from ../../stressapptest-1.0.9/src/disk_blocks.h:26,
from ../../stressapptest-1.0.9/src/disk_blocks.cc:19:
TOPDIR/build/tmp/work/armv7vet2hf-neon-yoe-linux-musleabi/stressapptest/1.0.9-r0/recipe-sysroot/usr/include/c++/9.1.0/bits/vector.tcc: In member function 'void std::vector<_Tp, _Alloc>::_M_realloc_insert(std::vector<_Tp, _Alloc>::iterator, _Args&& ...) [with _Args = {const long long int&}; _Tp = long long int; _Alloc = std::allocator<long long int>]':
TOPDIR/build/tmp/work/armv7vet2hf-neon-yoe-linux-musleabi/stressapptest/1.0.9-r0/recipe-sysroot/usr/include/c++/9.1.0/bits/vector.tcc:426:7: note: parameter passing for argument of type 'std::vector<long long int>::iterator' {aka '__gnu_cxx::__normal_iterator<long long int*, std::vector<long long int> >'} changed in GCC 7.1
426 | vector<_Tp, _Alloc>::
| ^~~~~~~~~~~~~~~~~~~
TOPDIR/build/tmp/work/armv7vet2hf-neon-yoe-linux-musleabi/stressapptest/1.0.9-r0/recipe-sysroot/usr/include/c++/9.1.0/bits/vector.tcc: In member function 'void DiskBlockTable::InsertOnStructure(BlockData*)':
TOPDIR/build/tmp/work/armv7vet2hf-neon-yoe-linux-musleabi/stressapptest/1.0.9-r0/recipe-sysroot/usr/include/c++/9.1.0/bits/vector.tcc:161:2: note: parameter passing for argument of type '__gnu_cxx::__normal_iterator<long long int*, std::vector<long long int> >' changed in GCC 7.1
161 | _M_realloc_insert(begin() + (__position - cbegin()), __x);
| ^~~~~~~~~~~~~~~~~
arm-yoe-linux-musleabi-g++ -march=armv7ve -mthumb -mfpu=neon -mfloat-abi=hard -fstack-protector-strong -D_FORTIFY_SOURCE=2 -Wformat -Wformat-security -Werror=format-security --sysroot=TOPDIR/build/tmp/work/armv7vet2hf-neon-yoe-linux-musleabi/stressapptest/1.0.9-r0/recipe-sysroot -DHAVE_CONFIG_H -I. -I../../stressapptest-1.0.9/src -O2 -pipe -g -feliminate-unused-debug-types -fmacro-prefix-map=TOPDIR/build/tmp/work/armv7vet2hf-neon-yoe-linux-musleabi/stressapptest/1.0.9-r0=/usr/src/debug/stressapptest/1.0.9-r0 -fdebug-prefix-map=TOPDIR/build/tmp/work/armv7vet2hf-neon-yoe-linux-musleabi/stressapptest/1.0.9-r0=/usr/src/debug/stressapptest/1.0.9-r0 -fdebug-prefix-map=TOPDIR/build/tmp/work/armv7vet2hf-neon-yoe-linux-musleabi/stressapptest/1.0.9-r0/recipe-sysroot= -fdebug-prefix-map=TOPDIR/build/tmp/work/armv7vet2hf-neon-yoe-linux-musleabi/stressapptest/1.0.9-r0/recipe-sysroot-native= -fvisibility-inlines-hidden -DCHECKOPTS -Wreturn-type -Wunused -Wuninitialized -Wall -O3 -funroll-all-loops -funroll-loops -DNDEBUG -c -o error_diag.o ../../stressapptest-1.0.9/src/error_diag.cc
In file included from ../../stressapptest-1.0.9/src/error_diag.h:28,
from ../../stressapptest-1.0.9/src/error_diag.cc:24:
../../stressapptest-1.0.9/src/sattypes.h:233:2: warning: #warning "Unsupported CPU type." [-Wcpp]
233 | #warning "Unsupported CPU type."
| ^~~~~~~
In file included from ../../stressapptest-1.0.9/src/error_diag.h:29,
from ../../stressapptest-1.0.9/src/error_diag.cc:24:
../../stressapptest-1.0.9/src/os.h:166:4: warning: #warning "Unsupported CPU type: Unable to force cache flushes." [-Wcpp]
166 | #warning "Unsupported CPU type: Unable to force cache flushes."
| ^~~~~~~
../../stressapptest-1.0.9/src/os.h:200:6: warning: #warning "Unsupported CPU type: Unable to force cache flushes." [-Wcpp]
200 | #warning "Unsupported CPU type: Unable to force cache flushes."
| ^~~~~~~
../../stressapptest-1.0.9/src/os.h:223:6: warning: #warning "Unsupported CPU type: Unable to force cache flushes." [-Wcpp]
223 | #warning "Unsupported CPU type: Unable to force cache flushes."
| ^~~~~~~
../../stressapptest-1.0.9/src/os.h:249:4: warning: #warning "Unsupported CPU type: Unable to force cache flushes." [-Wcpp]
249 | #warning "Unsupported CPU type: Unable to force cache flushes."
| ^~~~~~~
../../stressapptest-1.0.9/src/os.h:281:6: warning: #warning "Unsupported CPU type: your timer may not function correctly" [-Wcpp]
281 | #warning "Unsupported CPU type: your timer may not function correctly"
| ^~~~~~~
arm-yoe-linux-musleabi-g++ -march=armv7ve -mthumb -mfpu=neon -mfloat-abi=hard -fstack-protector-strong -D_FORTIFY_SOURCE=2 -Wformat -Wformat-security -Werror=format-security --sysroot=TOPDIR/build/tmp/work/armv7vet2hf-neon-yoe-linux-musleabi/stressapptest/1.0.9-r0/recipe-sysroot -DHAVE_CONFIG_H -I. -I../../stressapptest-1.0.9/src -O2 -pipe -g -feliminate-unused-debug-types -fmacro-prefix-map=TOPDIR/build/tmp/work/armv7vet2hf-neon-yoe-linux-musleabi/stressapptest/1.0.9-r0=/usr/src/debug/stressapptest/1.0.9-r0 -fdebug-prefix-map=TOPDIR/build/tmp/work/armv7vet2hf-neon-yoe-linux-musleabi/stressapptest/1.0.9-r0=/usr/src/debug/stressapptest/1.0.9-r0 -fdebug-prefix-map=TOPDIR/build/tmp/work/armv7vet2hf-neon-yoe-linux-musleabi/stressapptest/1.0.9-r0/recipe-sysroot= -fdebug-prefix-map=TOPDIR/build/tmp/work/armv7vet2hf-neon-yoe-linux-musleabi/stressapptest/1.0.9-r0/recipe-sysroot-native= -fvisibility-inlines-hidden -DCHECKOPTS -Wreturn-type -Wunused -Wuninitialized -Wall -O3 -funroll-all-loops -funroll-loops -DNDEBUG -c -o finelock_queue.o ../../stressapptest-1.0.9/src/finelock_queue.cc
In file included from ../../stressapptest-1.0.9/src/finelock_queue.h:26,
from ../../stressapptest-1.0.9/src/finelock_queue.cc:20:
../../stressapptest-1.0.9/src/sattypes.h:233:2: warning: #warning "Unsupported CPU type." [-Wcpp]
233 | #warning "Unsupported CPU type."
| ^~~~~~~
In file included from ../../stressapptest-1.0.9/src/finelock_queue.h:29,
from ../../stressapptest-1.0.9/src/finelock_queue.cc:20:
../../stressapptest-1.0.9/src/os.h:166:4: warning: #warning "Unsupported CPU type: Unable to force cache flushes." [-Wcpp]
166 | #warning "Unsupported CPU type: Unable to force cache flushes."
| ^~~~~~~
../../stressapptest-1.0.9/src/os.h:200:6: warning: #warning "Unsupported CPU type: Unable to force cache flushes." [-Wcpp]
200 | #warning "Unsupported CPU type: Unable to force cache flushes."
| ^~~~~~~
../../stressapptest-1.0.9/src/os.h:223:6: warning: #warning "Unsupported CPU type: Unable to force cache flushes." [-Wcpp]
223 | #warning "Unsupported CPU type: Unable to force cache flushes."
| ^~~~~~~
../../stressapptest-1.0.9/src/os.h:249:4: warning: #warning "Unsupported CPU type: Unable to force cache flushes." [-Wcpp]
249 | #warning "Unsupported CPU type: Unable to force cache flushes."
| ^~~~~~~
../../stressapptest-1.0.9/src/os.h:281:6: warning: #warning "Unsupported CPU type: your timer may not function correctly" [-Wcpp]
281 | #warning "Unsupported CPU type: your timer may not function correctly"
| ^~~~~~~
arm-yoe-linux-musleabi-g++ -march=armv7ve -mthumb -mfpu=neon -mfloat-abi=hard -fstack-protector-strong -D_FORTIFY_SOURCE=2 -Wformat -Wformat-security -Werror=format-security --sysroot=TOPDIR/build/tmp/work/armv7vet2hf-neon-yoe-linux-musleabi/stressapptest/1.0.9-r0/recipe-sysroot -DHAVE_CONFIG_H -I. -I../../stressapptest-1.0.9/src -O2 -pipe -g -feliminate-unused-debug-types -fmacro-prefix-map=TOPDIR/build/tmp/work/armv7vet2hf-neon-yoe-linux-musleabi/stressapptest/1.0.9-r0=/usr/src/debug/stressapptest/1.0.9-r0 -fdebug-prefix-map=TOPDIR/build/tmp/work/armv7vet2hf-neon-yoe-linux-musleabi/stressapptest/1.0.9-r0=/usr/src/debug/stressapptest/1.0.9-r0 -fdebug-prefix-map=TOPDIR/build/tmp/work/armv7vet2hf-neon-yoe-linux-musleabi/stressapptest/1.0.9-r0/recipe-sysroot= -fdebug-prefix-map=TOPDIR/build/tmp/work/armv7vet2hf-neon-yoe-linux-musleabi/stressapptest/1.0.9-r0/recipe-sysroot-native= -fvisibility-inlines-hidden -DCHECKOPTS -Wreturn-type -Wunused -Wuninitialized -Wall -O3 -funroll-all-loops -funroll-loops -DNDEBUG -c -o worker.o ../../stressapptest-1.0.9/src/worker.cc
In file included from ../../stressapptest-1.0.9/src/error_diag.h:28,
from ../../stressapptest-1.0.9/src/worker.cc:58:
../../stressapptest-1.0.9/src/sattypes.h:233:2: warning: #warning "Unsupported CPU type." [-Wcpp]
233 | #warning "Unsupported CPU type."
| ^~~~~~~
In file included from ../../stressapptest-1.0.9/src/error_diag.h:29,
from ../../stressapptest-1.0.9/src/worker.cc:58:
../../stressapptest-1.0.9/src/os.h:166:4: warning: #warning "Unsupported CPU type: Unable to force cache flushes." [-Wcpp]
166 | #warning "Unsupported CPU type: Unable to force cache flushes."
| ^~~~~~~
../../stressapptest-1.0.9/src/os.h:200:6: warning: #warning "Unsupported CPU type: Unable to force cache flushes." [-Wcpp]
200 | #warning "Unsupported CPU type: Unable to force cache flushes."
| ^~~~~~~
../../stressapptest-1.0.9/src/os.h:223:6: warning: #warning "Unsupported CPU type: Unable to force cache flushes." [-Wcpp]
223 | #warning "Unsupported CPU type: Unable to force cache flushes."
| ^~~~~~~
../../stressapptest-1.0.9/src/os.h:249:4: warning: #warning "Unsupported CPU type: Unable to force cache flushes." [-Wcpp]
249 | #warning "Unsupported CPU type: Unable to force cache flushes."
| ^~~~~~~
../../stressapptest-1.0.9/src/os.h:281:6: warning: #warning "Unsupported CPU type: your timer may not function correctly" [-Wcpp]
281 | #warning "Unsupported CPU type: your timer may not function correctly"
| ^~~~~~~
../../stressapptest-1.0.9/src/worker.cc: In member function 'virtual void NetworkThread::SetIP(const char*)':
../../stressapptest-1.0.9/src/worker.cc:2005:10: warning: 'char* strncpy(char*, const char*, size_t)' specified bound 256 equals destination size [-Wstringop-truncation]
2005 | strncpy(ipaddr_, ipaddr_init, 256);
| ~~~~~~~^~~~~~~~~~~~~~~~~~~~~~~~~~~
In function 'bool {anonymous}::sat_strerror(int, char*, int)',
inlined from 'virtual bool NetworkThread::ReceivePage(int, page_entry*)' at ../../stressapptest-1.0.9/src/worker.cc:2154:23:
../../stressapptest-1.0.9/src/worker.cc:92:14: warning: 'char* strncpy(char*, const char*, size_t)' specified bound 256 equals destination size [-Wstringop-truncation]
92 | strncpy(buf, errmsg, len);
| ~~~~~~~^~~~~~~~~~~~~~~~~~
In function 'bool {anonymous}::sat_strerror(int, char*, int)',
inlined from 'virtual bool NetworkListenThread::Listen()' at ../../stressapptest-1.0.9/src/worker.cc:2065:17:
../../stressapptest-1.0.9/src/worker.cc:92:14: warning: 'char* strncpy(char*, const char*, size_t)' specified bound 256 equals destination size [-Wstringop-truncation]
92 | strncpy(buf, errmsg, len);
| ~~~~~~~^~~~~~~~~~~~~~~~~~
In function 'bool {anonymous}::sat_strerror(int, char*, int)',
inlined from 'virtual bool NetworkThread::SendPage(int, page_entry*)' at ../../stressapptest-1.0.9/src/worker.cc:2121:21,
inlined from 'virtual bool NetworkThread::SendPage(int, page_entry*)' at ../../stressapptest-1.0.9/src/worker.cc:2110:6:
../../stressapptest-1.0.9/src/worker.cc:92:14: warning: 'char* strncpy(char*, const char*, size_t)' specified bound 256 equals destination size [-Wstringop-truncation]
92 | strncpy(buf, errmsg, len);
| ~~~~~~~^~~~~~~~~~~~~~~~~~
In function 'bool {anonymous}::sat_strerror(int, char*, int)',
inlined from 'virtual bool NetworkThread::ReceivePage(int, page_entry*)' at ../../stressapptest-1.0.9/src/worker.cc:2154:23,
inlined from 'virtual bool NetworkSlaveThread::Work()' at ../../stressapptest-1.0.9/src/worker.cc:2402:21:
../../stressapptest-1.0.9/src/worker.cc:92:14: warning: 'char* strncpy(char*, const char*, size_t)' specified bound 256 equals destination size [-Wstringop-truncation]
92 | strncpy(buf, errmsg, len);
| ~~~~~~~^~~~~~~~~~~~~~~~~~
In function 'bool {anonymous}::sat_strerror(int, char*, int)',
inlined from 'virtual bool NetworkThread::SendPage(int, page_entry*)' at ../../stressapptest-1.0.9/src/worker.cc:2121:21,
inlined from 'virtual bool NetworkThread::SendPage(int, page_entry*)' at ../../stressapptest-1.0.9/src/worker.cc:2110:6,
inlined from 'virtual bool NetworkSlaveThread::Work()' at ../../stressapptest-1.0.9/src/worker.cc:2406:18:
../../stressapptest-1.0.9/src/worker.cc:92:14: warning: 'char* strncpy(char*, const char*, size_t)' specified bound 256 equals destination size [-Wstringop-truncation]
92 | strncpy(buf, errmsg, len);
| ~~~~~~~^~~~~~~~~~~~~~~~~~
In function 'bool {anonymous}::sat_strerror(int, char*, int)',
inlined from 'virtual bool NetworkThread::SendPage(int, page_entry*)' at ../../stressapptest-1.0.9/src/worker.cc:2121:21,
inlined from 'virtual bool NetworkThread::SendPage(int, page_entry*)' at ../../stressapptest-1.0.9/src/worker.cc:2110:6,
inlined from 'virtual bool NetworkThread::Work()' at ../../stressapptest-1.0.9/src/worker.cc:2228:38:
../../stressapptest-1.0.9/src/worker.cc:92:14: warning: 'char* strncpy(char*, const char*, size_t)' specified bound 256 equals destination size [-Wstringop-truncation]
92 | strncpy(buf, errmsg, len);
| ~~~~~~~^~~~~~~~~~~~~~~~~~
In function 'bool {anonymous}::sat_strerror(int, char*, int)',
inlined from 'int WorkerThread::SpawnThread()' at ../../stressapptest-1.0.9/src/worker.cc:339:17:
../../stressapptest-1.0.9/src/worker.cc:92:14: warning: 'char* strncpy(char*, const char*, size_t)' specified bound 256 equals destination size [-Wstringop-truncation]
92 | strncpy(buf, errmsg, len);
| ~~~~~~~^~~~~~~~~~~~~~~~~~
arm-yoe-linux-musleabi-g++ -march=armv7ve -mthumb -mfpu=neon -mfloat-abi=hard -fstack-protector-strong -D_FORTIFY_SOURCE=2 -Wformat -Wformat-security -Werror=format-security --sysroot=TOPDIR/build/tmp/work/armv7vet2hf-neon-yoe-linux-musleabi/stressapptest/1.0.9-r0/recipe-sysroot -DHAVE_CONFIG_H -I. -I../../stressapptest-1.0.9/src -O2 -pipe -g -feliminate-unused-debug-types -fmacro-prefix-map=TOPDIR/build/tmp/work/armv7vet2hf-neon-yoe-linux-musleabi/stressapptest/1.0.9-r0=/usr/src/debug/stressapptest/1.0.9-r0 -fdebug-prefix-map=TOPDIR/build/tmp/work/armv7vet2hf-neon-yoe-linux-musleabi/stressapptest/1.0.9-r0=/usr/src/debug/stressapptest/1.0.9-r0 -fdebug-prefix-map=TOPDIR/build/tmp/work/armv7vet2hf-neon-yoe-linux-musleabi/stressapptest/1.0.9-r0/recipe-sysroot= -fdebug-prefix-map=TOPDIR/build/tmp/work/armv7vet2hf-neon-yoe-linux-musleabi/stressapptest/1.0.9-r0/recipe-sysroot-native= -fvisibility-inlines-hidden -DCHECKOPTS -Wreturn-type -Wunused -Wuninitialized -Wall -O3 -funroll-all-loops -funroll-loops -DNDEBUG -c -o sat_factory.o ../../stressapptest-1.0.9/src/sat_factory.cc
In file included from ../../stressapptest-1.0.9/src/finelock_queue.h:26,
from ../../stressapptest-1.0.9/src/sat.h:28,
from ../../stressapptest-1.0.9/src/sat_factory.cc:17:
../../stressapptest-1.0.9/src/sattypes.h:233:2: warning: #warning "Unsupported CPU type." [-Wcpp]
233 | #warning "Unsupported CPU type."
| ^~~~~~~
In file included from ../../stressapptest-1.0.9/src/finelock_queue.h:29,
from ../../stressapptest-1.0.9/src/sat.h:28,
from ../../stressapptest-1.0.9/src/sat_factory.cc:17:
../../stressapptest-1.0.9/src/os.h:166:4: warning: #warning "Unsupported CPU type: Unable to force cache flushes." [-Wcpp]
166 | #warning "Unsupported CPU type: Unable to force cache flushes."
| ^~~~~~~
../../stressapptest-1.0.9/src/os.h:200:6: warning: #warning "Unsupported CPU type: Unable to force cache flushes." [-Wcpp]
200 | #warning "Unsupported CPU type: Unable to force cache flushes."
| ^~~~~~~
../../stressapptest-1.0.9/src/os.h:223:6: warning: #warning "Unsupported CPU type: Unable to force cache flushes." [-Wcpp]
223 | #warning "Unsupported CPU type: Unable to force cache flushes."
| ^~~~~~~
../../stressapptest-1.0.9/src/os.h:249:4: warning: #warning "Unsupported CPU type: Unable to force cache flushes." [-Wcpp]
249 | #warning "Unsupported CPU type: Unable to force cache flushes."
| ^~~~~~~
../../stressapptest-1.0.9/src/os.h:281:6: warning: #warning "Unsupported CPU type: your timer may not function correctly" [-Wcpp]
281 | #warning "Unsupported CPU type: your timer may not function correctly"
| ^~~~~~~
arm-yoe-linux-musleabi-g++ -march=armv7ve -mthumb -mfpu=neon -mfloat-abi=hard -fstack-protector-strong -D_FORTIFY_SOURCE=2 -Wformat -Wformat-security -Werror=format-security --sysroot=TOPDIR/build/tmp/work/armv7vet2hf-neon-yoe-linux-musleabi/stressapptest/1.0.9-r0/recipe-sysroot -DHAVE_CONFIG_H -I. -I../../stressapptest-1.0.9/src -O2 -pipe -g -feliminate-unused-debug-types -fmacro-prefix-map=TOPDIR/build/tmp/work/armv7vet2hf-neon-yoe-linux-musleabi/stressapptest/1.0.9-r0=/usr/src/debug/stressapptest/1.0.9-r0 -fdebug-prefix-map=TOPDIR/build/tmp/work/armv7vet2hf-neon-yoe-linux-musleabi/stressapptest/1.0.9-r0=/usr/src/debug/stressapptest/1.0.9-r0 -fdebug-prefix-map=TOPDIR/build/tmp/work/armv7vet2hf-neon-yoe-linux-musleabi/stressapptest/1.0.9-r0/recipe-sysroot= -fdebug-prefix-map=TOPDIR/build/tmp/work/armv7vet2hf-neon-yoe-linux-musleabi/stressapptest/1.0.9-r0/recipe-sysroot-native= -fvisibility-inlines-hidden -DCHECKOPTS -Wreturn-type -Wunused -Wuninitialized -Wall -O3 -funroll-all-loops -funroll-loops -DNDEBUG -c -o sat.o ../../stressapptest-1.0.9/src/sat.cc
In file included from ../../stressapptest-1.0.9/src/disk_blocks.h:29,
from ../../stressapptest-1.0.9/src/sat.cc:44:
../../stressapptest-1.0.9/src/sattypes.h:233:2: warning: #warning "Unsupported CPU type." [-Wcpp]
233 | #warning "Unsupported CPU type."
| ^~~~~~~
In file included from ../../stressapptest-1.0.9/src/sat.cc:46:
../../stressapptest-1.0.9/src/os.h:166:4: warning: #warning "Unsupported CPU type: Unable to force cache flushes." [-Wcpp]
166 | #warning "Unsupported CPU type: Unable to force cache flushes."
| ^~~~~~~
../../stressapptest-1.0.9/src/os.h:200:6: warning: #warning "Unsupported CPU type: Unable to force cache flushes." [-Wcpp]
200 | #warning "Unsupported CPU type: Unable to force cache flushes."
| ^~~~~~~
../../stressapptest-1.0.9/src/os.h:223:6: warning: #warning "Unsupported CPU type: Unable to force cache flushes." [-Wcpp]
223 | #warning "Unsupported CPU type: Unable to force cache flushes."
| ^~~~~~~
../../stressapptest-1.0.9/src/os.h:249:4: warning: #warning "Unsupported CPU type: Unable to force cache flushes." [-Wcpp]
249 | #warning "Unsupported CPU type: Unable to force cache flushes."
| ^~~~~~~
../../stressapptest-1.0.9/src/os.h:281:6: warning: #warning "Unsupported CPU type: your timer may not function correctly" [-Wcpp]
281 | #warning "Unsupported CPU type: your timer may not function correctly"
| ^~~~~~~
../../stressapptest-1.0.9/src/sat.cc: In member function 'int Sat::CacheLineSize()':
../../stressapptest-1.0.9/src/sat.cc:1488:30: error: '_SC_LEVEL1_DCACHE_LINESIZE' was not declared in this scope
1488 | int max_linesize = sysconf(_SC_LEVEL1_DCACHE_LINESIZE);
| ^~~~~~~~~~~~~~~~~~~~~~~~~~
../../stressapptest-1.0.9/src/sat.cc:1489:26: error: '_SC_LEVEL2_CACHE_LINESIZE' was not declared in this scope
1489 | int linesize = sysconf(_SC_LEVEL2_CACHE_LINESIZE);
| ^~~~~~~~~~~~~~~~~~~~~~~~~
../../stressapptest-1.0.9/src/sat.cc:1491:22: error: '_SC_LEVEL3_CACHE_LINESIZE' was not declared in this scope
1491 | linesize = sysconf(_SC_LEVEL3_CACHE_LINESIZE);
| ^~~~~~~~~~~~~~~~~~~~~~~~~
../../stressapptest-1.0.9/src/sat.cc:1493:22: error: '_SC_LEVEL4_CACHE_LINESIZE' was not declared in this scope
1493 | linesize = sysconf(_SC_LEVEL4_CACHE_LINESIZE);
| ^~~~~~~~~~~~~~~~~~~~~~~~~
Makefile:454: recipe for target 'sat.o' failed
make[2]: *** [sat.o] Error 1
make[2]: Leaving directory 'TOPDIR/build/tmp/work/armv7vet2hf-neon-yoe-linux-musleabi/stressapptest/1.0.9-r0/build/src'
Makefile:306: recipe for target 'all' failed
make[1]: *** [all] Error 2
make[1]: Leaving directory 'TOPDIR/build/tmp/work/armv7vet2hf-neon-yoe-linux-musleabi/stressapptest/1.0.9-r0/build/src'
Makefile:422: recipe for target 'all-recursive' failed
make: *** [all-recursive] Error 1
ERROR: oe_runmake failed
WARNING: TOPDIR/build/tmp/work/armv7vet2hf-neon-yoe-linux-musleabi/stressapptest/1.0.9-r0/temp/run.do_compile.9889:1 exit 1 from 'exit 1'
ERROR: Function failed: do_compile (log file is located at TOPDIR/build/tmp/work/armv7vet2hf-neon-yoe-linux-musleabi/stressapptest/1.0.9-r0/temp/log.do_compile.9889)