auto.conf settings:
MACHINE = "qemux86"
DISTRO = "poky"
SDKMACHINE = "x86_64"
PACKAGE_CLASSES = "package_rpm package_deb package_ipk"
DL_DIR = '/srv/autobuilder/autobuilder.yoctoproject.org/current_sources'
SSTATE_DIR ?= '/srv/autobuilder/autobuilder.yoctoproject.org/pub/sstate-dunfell'
QEMU_USE_KVM = 'True'
INHERIT += 'report-error'
PREMIRRORS = ''
BB_GENERATE_MIRROR_TARBALLS = '1'
BB_NUMBER_THREADS = '16'
PARALLEL_MAKE = '-j 16'
BB_TASK_NICE_LEVEL = '5'
BB_TASK_NICE_LEVEL_task-testimage = '0'
BB_TASK_IONICE_LEVEL = '2.7'
BB_TASK_IONICE_LEVEL_task-testimage = '2.1'
INHERIT += 'testimage'
TEST_QEMUBOOT_TIMEOUT = '1500'
SANITY_TESTED_DISTROS = ''
SDK_EXT_TYPE = 'minimal'
SDK_INCLUDE_TOOLCHAIN = '1'
BB_DISKMON_DIRS = 'STOPTASKS,${TMPDIR},1G,100K STOPTASKS,${DL_DIR},1G STOPTASKS,${SSTATE_DIR},1G STOPTASKS,/tmp,100M,100K ABORT,${TMPDIR},100M,1K ABORT,${DL_DIR},100M ABORT,${SSTATE_DIR},100M ABORT,/tmp,10M,1K'
BB_HASHSERVE = 'typhoon.yocto.io:8686'
### Shell environment set up for builds. ###
You can now run 'bitbake <target>'
Common targets are:
core-image-minimal
core-image-sato
meta-toolchain
meta-ide-support
You can also run generated qemu images with a command like 'runqemu qemux86'
Other commonly useful commands are:
- 'devtool' and 'recipetool' handle common recipe tasks
- 'bitbake-layers' handles common layer tasks
- 'oe-pkgdata-util' handles common target package tasks
2020-12-03 07:26:31,175 - oe-selftest - INFO - Adding layer libraries:
2020-12-03 07:26:31,175 - oe-selftest - INFO - /home/pokybuild/yocto-worker/a-full/build/meta/lib
2020-12-03 07:26:31,176 - oe-selftest - INFO - /home/pokybuild/yocto-worker/a-full/build/meta-yocto-bsp/lib
2020-12-03 07:26:31,176 - oe-selftest - INFO - /home/pokybuild/yocto-worker/a-full/build/meta-selftest/lib
2020-12-03 07:26:31,176 - oe-selftest - INFO - Running bitbake -e to test the configuration is valid/parsable
2020-12-03 07:26:33,248 - oe-selftest - INFO - Adding: "include selftest.inc" in /home/pokybuild/yocto-worker/a-full/build/build-st/conf/local.conf
2020-12-03 07:26:33,248 - oe-selftest - INFO - Adding: "include bblayers.inc" in bblayers.conf
2020-12-03 07:26:33,249 - oe-selftest - INFO - test_yocto_source_mirror (buildoptions.SourceMirroring)
2020-12-03 08:05:49,381 - oe-selftest - INFO - ... FAIL
2020-12-03 08:05:49,381 - oe-selftest - INFO - Traceback (most recent call last):
File "/home/pokybuild/yocto-worker/a-full/build/meta/lib/oeqa/selftest/cases/buildoptions.py", line 197, in test_yocto_source_mirror
bitbake("world --runall fetch")
File "/home/pokybuild/yocto-worker/a-full/build/meta/lib/oeqa/utils/commands.py", line 229, in bitbake
return runCmd(cmd, ignore_status, timeout, output_log=output_log, **options)
File "/home/pokybuild/yocto-worker/a-full/build/meta/lib/oeqa/utils/commands.py", line 207, in runCmd
raise AssertionError("Command '%s' returned non-zero exit status %d:\n%s" % (command, result.status, exc_output))
AssertionError: Command 'bitbake world --runall fetch' returned non-zero exit status 1:
Parsing recipes...done.
Parsing of 807 .bb files complete (0 cached, 807 parsed). 1358 targets, 45 skipped, 0 masked, 0 errors.
NOTE: Resolving any missing task queue dependencies
Build Configuration:
BB_VERSION = "1.46.0"
BUILD_SYS = "x86_64-linux"
NATIVELSBSTRING = "debian-10"
TARGET_SYS = "i686-poky-linux"
MACHINE = "qemux86"
DISTRO = "poky"
DISTRO_VERSION = "3.1.4"
TUNE_FEATURES = "m32 core2"
TARGET_FPU = ""
meta
meta-poky
meta-yocto-bsp = "stable/dunfell-nut:5070a3a8f4ffe39ad1e481458097fc5c62e08066"
meta-selftest = "master:4212e0d98299c3f76b7c0636044e7b3e562fd9ab"
NOTE: Fetching uninative binary shim http://downloads.yoctoproject.org/releases/uninative/2.9/x86_64-nativesdk-libc.tar.xz;sha256sum=d07916b95c419c81541a19c8ef0ed8cbd78ae18437ff28a4c8a60ef40518e423 (will check PREMIRRORS first)
Initialising tasks...done.
Sstate summary: Wanted 0 Found 0 Missed 0 Current 0 (0% match, 0% complete)
NOTE: No setscene tasks
NOTE: Executing Tasks
NOTE: Running task 1 of 841 (virtual:native:/home/pokybuild/yocto-worker/a-full/build/meta/recipes-graphics/xorg-lib/libxtst_1.2.3.bb:do_fetch)
NOTE: Running task 2 of 841 (virtual:native:/home/pokybuild/yocto-worker/a-full/build/meta/recipes-graphics/xorg-lib/libice_1.0.10.bb:do_fetch)
NOTE: Running task 3 of 841 (virtual:native:/home/pokybuild/yocto-worker/a-full/build/meta/recipes-graphics/xorg-proto/xcb-proto_1.13.bb:do_fetch)
NOTE: Running task 4 of 841 (virtual:native:/home/pokybuild/yocto-worker/a-full/build/meta/recipes-graphics/xorg-lib/libxdmcp_1.1.3.bb:do_fetch)
NOTE: Running task 5 of 841 (virtual:native:/home/pokybuild/yocto-worker/a-full/build/meta/recipes-graphics/xorg-lib/libxau_1.0.9.bb:do_fetch)
NOTE: Running task 6 of 841 (virtual:native:/home/pokybuild/yocto-worker/a-full/build/meta/recipes-graphics/xorg-lib/libpthread-stubs_0.4.bb:do_fetch)
NOTE: Running task 7 of 841 (virtual:native:/home/pokybuild/yocto-worker/a-full/build/meta/recipes-support/libunistring/libunistring_0.9.10.bb:do_fetch)
NOTE: Running task 8 of 841 (virtual:native:/home/pokybuild/yocto-worker/a-full/build/meta/recipes-extended/libidn/libidn2_2.3.0.bb:do_fetch)
NOTE: Running task 9 of 841 (virtual:native:/home/pokybuild/yocto-worker/a-full/build/meta/recipes-support/nettle/nettle_3.5.1.bb:do_fetch)
NOTE: Running task 10 of 841 (virtual:native:/home/pokybuild/yocto-worker/a-full/build/meta/recipes-support/atk/at-spi2-core_2.34.0.bb:do_fetch)
NOTE: Running task 11 of 841 (virtual:native:/home/pokybuild/yocto-worker/a-full/build/meta/recipes-graphics/xorg-lib/libxft_2.3.3.bb:do_fetch)
NOTE: Running task 12 of 841 (virtual:native:/home/pokybuild/yocto-worker/a-full/build/meta/recipes-graphics/harfbuzz/harfbuzz_2.6.4.bb:do_fetch)
NOTE: Running task 13 of 841 (virtual:native:/home/pokybuild/yocto-worker/a-full/build/meta/recipes-support/fribidi/fribidi_1.0.9.bb:do_fetch)
NOTE: Running task 14 of 841 (virtual:native:/home/pokybuild/yocto-worker/a-full/build/meta/recipes-graphics/xorg-lib/libsm_1.2.3.bb:do_fetch)
NOTE: Running task 15 of 841 (virtual:native:/home/pokybuild/yocto-worker/a-full/build/meta/recipes-graphics/xorg-lib/xtrans_1.4.0.bb:do_fetch)
NOTE: Running task 16 of 841 (virtual:native:/home/pokybuild/yocto-worker/a-full/build/meta/recipes-graphics/xorg-lib/libxcb_1.13.1.bb:do_fetch)
NOTE: recipe libxtst-native-1_1.2.3-r0: task do_fetch: Started
NOTE: recipe libice-native-1_1.0.10-r0: task do_fetch: Started
NOTE: recipe xcb-proto-native-1.13-r0: task do_fetch: Started
NOTE: recipe libunistring-native-0.9.10-r0: task do_fetch: Started
NOTE: recipe libxau-native-1_1.0.9-r0: task do_fetch: Started
NOTE: recipe libxdmcp-native-1_1.1.3-r0: task do_fetch: Started
NOTE: recipe libxft-native-1_2.3.3-r0: task do_fetch: Started
NOTE: recipe fribidi-native-1.0.9-r0: task do_fetch: Started
NOTE: recipe libpthread-stubs-native-0.4-r0: task do_fetch: Started
NOTE: recipe libsm-native-1_1.2.3-r0: task do_fetch: Started
NOTE: recipe nettle-native-3.5.1-r0: task do_fetch: Started
NOTE: recipe xtrans-native-1_1.4.0-r0: task do_fetch: Started
NOTE: recipe libidn2-native-2.3.0-r0: task do_fetch: Started
NOTE: recipe harfbuzz-native-2.6.4-r0: task do_fetch: Started
NOTE: recipe at-spi2-core-native-2.34.0-r0: task do_fetch: Started
NOTE: recipe libxcb-native-1.13.1-r0: task do_fetch: Started
NOTE: recipe libsm-native-1_1.2.3-r0: task do_fetch: Succeeded
NOTE: Running task 17 of 841 (virtual:native:/home/pokybuild/yocto-worker/a-full/build/meta/recipes-support/libcap/libcap_2.32.bb:do_fetch)
NOTE: recipe libcap-native-2.32-r0: task do_fetch: Started
NOTE: recipe fribidi-native-1.0.9-r0: task do_fetch: Succeeded
NOTE: Running task 18 of 841 (virtual:native:/home/pokybuild/yocto-worker/a-full/build/meta/recipes-support/libgpg-error/libgpg-error_1.37.bb:do_fetch)
NOTE: recipe libgpg-error-native-1.37-r0: task do_fetch: Started
NOTE: recipe libpthread-stubs-native-0.4-r0: task do_fetch: Succeeded
NOTE: Running task 19 of 841 (/home/pokybuild/yocto-worker/a-full/build/meta/recipes-core/glibc/cross-localedef-native_2.31.bb:do_fetch)
NOTE: recipe cross-localedef-native-2.31+gitAUTOINC+6fdf971c9d_cd9f958c4c-r0: task do_fetch: Started
NOTE: recipe libxdmcp-native-1_1.1.3-r0: task do_fetch: Succeeded
NOTE: Running task 20 of 841 (virtual:native:/home/pokybuild/yocto-worker/a-full/build/meta/recipes-devtools/libedit/libedit_20191231-3.1.bb:do_fetch)
NOTE: recipe libedit-native-20191231-3.1-r0: task do_fetch: Started
NOTE: recipe at-spi2-core-native-2.34.0-r0: task do_fetch: Succeeded
NOTE: Running task 21 of 841 (virtual:native:/home/pokybuild/yocto-worker/a-full/build/meta/recipes-support/libgcrypt/libgcrypt_1.8.5.bb:do_fetch)
NOTE: recipe libxft-native-1_2.3.3-r0: task do_fetch: Succeeded
NOTE: Running task 22 of 841 (virtual:native:/home/pokybuild/yocto-worker/a-full/build/meta/recipes-support/libassuan/libassuan_2.5.3.bb:do_fetch)
NOTE: recipe libice-native-1_1.0.10-r0: task do_fetch: Succeeded
NOTE: Running task 23 of 841 (virtual:native:/home/pokybuild/yocto-worker/a-full/build/meta/recipes-support/gnutls/gnutls_3.6.14.bb:do_fetch)
NOTE: recipe libgcrypt-native-1.8.5-r0: task do_fetch: Started
NOTE: recipe libassuan-native-2.5.3-r0: task do_fetch: Started
NOTE: recipe gnutls-native-3.6.14-r0: task do_fetch: Started
NOTE: recipe xtrans-native-1_1.4.0-r0: task do_fetch: Succeeded
NOTE: Running task 24 of 841 (virtual:native:/home/pokybuild/yocto-worker/a-full/build/meta/recipes-support/libksba/libksba_1.3.5.bb:do_fetch)
NOTE: recipe libksba-native-1.3.5-r0: task do_fetch: Started
NOTE: recipe xcb-proto-native-1.13-r0: task do_fetch: Succeeded
NOTE: Running task 25 of 841 (virtual:native:/home/pokybuild/yocto-worker/a-full/build/meta/recipes-support/npth/npth_1.6.bb:do_fetch)
NOTE: recipe npth-native-1.6-r0: task do_fetch: Started
NOTE: recipe libxtst-native-1_1.2.3-r0: task do_fetch: Succeeded
NOTE: Running task 26 of 841 (virtual:native:/home/pokybuild/yocto-worker/a-full/build/meta/recipes-kernel/dtc/dtc_1.6.0.bb:do_fetch)
NOTE: recipe dtc-native-1.6.0-r0: task do_fetch: Started
NOTE: recipe libxau-native-1_1.0.9-r0: task do_fetch: Succeeded
NOTE: Running task 27 of 841 (virtual:native:/home/pokybuild/yocto-worker/a-full/build/meta/recipes-graphics/xorg-lib/pixman_0.38.4.bb:do_fetch)
NOTE: recipe pixman-native-1_0.38.4-r0: task do_fetch: Started
NOTE: recipe libxcb-native-1.13.1-r0: task do_fetch: Succeeded
NOTE: Running task 28 of 841 (virtual:native:/home/pokybuild/yocto-worker/a-full/build/meta/recipes-multimedia/alsa/alsa-lib_1.2.1.2.bb:do_fetch)
NOTE: recipe alsa-lib-native-1.2.1.2-r0: task do_fetch: Started
NOTE: recipe libidn2-native-2.3.0-r0: task do_fetch: Succeeded
NOTE: Running task 29 of 841 (virtual:native:/home/pokybuild/yocto-worker/a-full/build/meta/recipes-graphics/libsdl2/libsdl2_2.0.12.bb:do_fetch)
NOTE: recipe libsdl2-native-2.0.12-r0: task do_fetch: Started
NOTE: recipe nettle-native-3.5.1-r0: task do_fetch: Succeeded
NOTE: Running task 30 of 841 (virtual:native:/home/pokybuild/yocto-worker/a-full/build/meta/recipes-support/libyaml/libyaml_0.2.2.bb:do_fetch)
NOTE: recipe libyaml-native-0.2.2-r0: task do_fetch: Started
NOTE: recipe libcap-native-2.32-r0: task do_fetch: Succeeded
NOTE: Running task 31 of 841 (virtual:native:/home/pokybuild/yocto-worker/a-full/build/meta/recipes-graphics/xorg-lib/libfontenc_1.1.4.bb:do_fetch)
NOTE: recipe libfontenc-native-1_1.1.4-r0: task do_fetch: Started
NOTE: recipe libedit-native-20191231-3.1-r0: task do_fetch: Succeeded
NOTE: Running task 32 of 841 (virtual:native:/home/pokybuild/yocto-worker/a-full/build/meta/recipes-graphics/freetype/freetype_2.10.1.bb:do_fetch)
NOTE: recipe freetype-native-2.10.1-r0: task do_fetch: Started
NOTE: recipe npth-native-1.6-r0: task do_fetch: Succeeded
NOTE: Running task 33 of 841 (virtual:native:/home/pokybuild/yocto-worker/a-full/build/meta/recipes-support/lzop/lzop_1.04.bb:do_fetch)
NOTE: recipe lzop-native-1.04-r0: task do_fetch: Started
NOTE: recipe libgpg-error-native-1.37-r0: task do_fetch: Succeeded
NOTE: Running task 34 of 841 (virtual:native:/home/pokybuild/yocto-worker/a-full/build/meta/recipes-support/libpcre/libpcre_8.44.bb:do_fetch)
NOTE: recipe libpcre-native-8.44-r0: task do_fetch: Started
NOTE: recipe pixman-native-1_0.38.4-r0: task do_fetch: Succeeded
NOTE: Running task 35 of 841 (virtual:native:/home/pokybuild/yocto-worker/a-full/build/meta/recipes-graphics/xorg-util/makedepend_1.0.6.bb:do_fetch)
NOTE: recipe makedepend-native-1_1.0.6-r0: task do_fetch: Started
NOTE: recipe libunistring-native-0.9.10-r0: task do_fetch: Succeeded
NOTE: Running task 36 of 841 (virtual:native:/home/pokybuild/yocto-worker/a-full/build/meta/recipes-devtools/chrpath/chrpath_0.16.bb:do_fetch)
NOTE: recipe chrpath-native-0.16-r0: task do_fetch: Started
NOTE: recipe libassuan-native-2.5.3-r0: task do_fetch: Succeeded
NOTE: Running task 37 of 841 (virtual:native:/home/pokybuild/yocto-worker/a-full/build/meta/recipes-devtools/autoconf-archive/autoconf-archive_2019.01.06.bb:do_fetch)
NOTE: recipe autoconf-archive-native-2019.01.06-r0: task do_fetch: Started
NOTE: recipe libksba-native-1.3.5-r0: task do_fetch: Succeeded
NOTE: Running task 38 of 841 (virtual:native:/home/pokybuild/yocto-worker/a-full/build/meta/recipes-support/lz4/lz4_1.9.2.bb:do_fetch)
NOTE: recipe lz4-native-1_1.9.2-r0: task do_fetch: Started
NOTE: recipe libgcrypt-native-1.8.5-r0: task do_fetch: Succeeded
NOTE: Running task 39 of 841 (virtual:native:/home/pokybuild/yocto-worker/a-full/build/meta/recipes-support/libcap-ng/libcap-ng_0.7.10.bb:do_fetch)
NOTE: recipe libcap-ng-native-0.7.10-r0: task do_fetch: Started
NOTE: recipe alsa-lib-native-1.2.1.2-r0: task do_fetch: Succeeded
NOTE: Running task 40 of 841 (virtual:native:/home/pokybuild/yocto-worker/a-full/build/meta/recipes-support/libpcre/libpcre2_10.34.bb:do_fetch)
NOTE: recipe libpcre2-native-10.34-r0: task do_fetch: Started
NOTE: recipe libfontenc-native-1_1.1.4-r0: task do_fetch: Succeeded
NOTE: Running task 41 of 841 (virtual:native:/home/pokybuild/yocto-worker/a-full/build/meta/recipes-support/attr/acl_2.2.53.bb:do_fetch)
NOTE: recipe acl-native-2.2.53-r0: task do_fetch: Started
NOTE: recipe libyaml-native-0.2.2-r0: task do_fetch: Succeeded
NOTE: Running task 42 of 841 (virtual:native:/home/pokybuild/yocto-worker/a-full/build/meta/recipes-support/lzo/lzo_2.10.bb:do_fetch)
NOTE: recipe lzo-native-2.10-r0: task do_fetch: Started
NOTE: recipe dtc-native-1.6.0-r0: task do_fetch: Succeeded
NOTE: Running task 43 of 841 (virtual:native:/home/pokybuild/yocto-worker/a-full/build/meta/recipes-support/libcroco/libcroco_0.6.13.bb:do_fetch)
NOTE: recipe libcroco-native-0.6.13-r0: task do_fetch: Started
NOTE: recipe chrpath-native-0.16-r0: task do_fetch: Succeeded
NOTE: Running task 44 of 841 (virtual:native:/home/pokybuild/yocto-worker/a-full/build/meta/recipes-support/atk/atk_2.34.1.bb:do_fetch)
NOTE: recipe autoconf-archive-native-2019.01.06-r0: task do_fetch: Succeeded
NOTE: Running task 45 of 841 (virtual:native:/home/pokybuild/yocto-worker/a-full/build/meta/recipes-support/atk/at-spi2-atk_2.34.1.bb:do_fetch)
NOTE: recipe at-spi2-atk-native-2.34.1-r0: task do_fetch: Started
NOTE: recipe atk-native-2.34.1-r0: task do_fetch: Started
NOTE: recipe lzop-native-1.04-r0: task do_fetch: Succeeded
NOTE: Running task 46 of 841 (virtual:native:/home/pokybuild/yocto-worker/a-full/build/meta/recipes-graphics/xorg-lib/libxcomposite_0.4.5.bb:do_fetch)
NOTE: recipe libxcomposite-native-1_0.4.5-r0: task do_fetch: Started
NOTE: recipe harfbuzz-native-2.6.4-r0: task do_fetch: Succeeded
NOTE: Running task 47 of 841 (virtual:native:/home/pokybuild/yocto-worker/a-full/build/meta/recipes-graphics/pango/pango_1.44.7.bb:do_fetch)
NOTE: recipe pango-native-1.44.7-r0: task do_fetch: Started
NOTE: recipe freetype-native-2.10.1-r0: task do_fetch: Succeeded
NOTE: Running task 48 of 841 (virtual:native:/home/pokybuild/yocto-worker/a-full/build/meta/recipes-graphics/xorg-lib/libxdamage_1.1.5.bb:do_fetch)
NOTE: recipe libxdamage-native-1_1.1.5-r0: task do_fetch: Started
NOTE: recipe makedepend-native-1_1.0.6-r0: task do_fetch: Succeeded
NOTE: Running task 49 of 841 (virtual:native:/home/pokybuild/yocto-worker/a-full/build/meta/recipes-graphics/xorg-lib/libxrandr_1.5.2.bb:do_fetch)
NOTE: recipe libxrandr-native-1_1.5.2-r0: task do_fetch: Started
NOTE: recipe libpcre-native-8.44-r0: task do_fetch: Succeeded
NOTE: Running task 50 of 841 (virtual:native:/home/pokybuild/yocto-worker/a-full/build/meta/recipes-multimedia/libpng/libpng_1.6.37.bb:do_fetch)
NOTE: recipe libpng-native-1.6.37-r0: task do_fetch: Started
NOTE: recipe libsdl2-native-2.0.12-r0: task do_fetch: Succeeded
NOTE: Running task 51 of 841 (virtual:native:/home/pokybuild/yocto-worker/a-full/build/meta/recipes-graphics/xorg-lib/libxext_1.3.4.bb:do_fetch)
NOTE: recipe libxext-native-1_1.3.4-r0: task do_fetch: Started
NOTE: recipe libcap-ng-native-0.7.10-r0: task do_fetch: Succeeded
NOTE: Running task 52 of 841 (virtual:native:/home/pokybuild/yocto-worker/a-full/build/meta/recipes-graphics/xorg-lib/libxfixes_5.0.3.bb:do_fetch)
NOTE: recipe libxfixes-native-1_5.0.3-r0: task do_fetch: Started
NOTE: recipe libcroco-native-0.6.13-r0: task do_fetch: Succeeded
NOTE: Running task 53 of 841 (virtual:native:/home/pokybuild/yocto-worker/a-full/build/meta/recipes-graphics/xorg-lib/libxcursor_1.2.0.bb:do_fetch)
NOTE: recipe libxcursor-native-1_1.2.0-r0: task do_fetch: Started
NOTE: recipe lzo-native-2.10-r0: task do_fetch: Succeeded
NOTE: Running task 54 of 841 (virtual:native:/home/pokybuild/yocto-worker/a-full/build/meta/recipes-graphics/xorg-lib/libxi_1.7.10.bb:do_fetch)
NOTE: recipe libxi-native-1_1.7.10-r0: task do_fetch: Started
NOTE: recipe at-spi2-atk-native-2.34.1-r0: task do_fetch: Succeeded
NOTE: Running task 55 of 841 (virtual:native:/home/pokybuild/yocto-worker/a-full/build/meta/recipes-graphics/fontconfig/fontconfig_2.13.1.bb:do_fetch)
NOTE: recipe fontconfig-native-2.13.1-r0: task do_fetch: Started
NOTE: recipe libxcomposite-native-1_0.4.5-r0: task do_fetch: Succeeded
NOTE: Running task 56 of 841 (virtual:native:/home/pokybuild/yocto-worker/a-full/build/meta/recipes-graphics/xorg-lib/libxrender_0.9.10.bb:do_fetch)
NOTE: recipe libxrender-native-1_0.9.10-r0: task do_fetch: Started
NOTE: recipe atk-native-2.34.1-r0: task do_fetch: Succeeded
NOTE: Running task 57 of 841 (virtual:native:/home/pokybuild/yocto-worker/a-full/build/meta/recipes-graphics/jpeg/libjpeg-turbo_2.0.4.bb:do_fetch)
NOTE: recipe libjpeg-turbo-native-1_2.0.4-r0: task do_fetch: Started
NOTE: recipe libxrandr-native-1_1.5.2-r0: task do_fetch: Succeeded
NOTE: Running task 58 of 841 (virtual:native:/home/pokybuild/yocto-worker/a-full/build/meta/recipes-graphics/cairo/cairo_1.16.0.bb:do_fetch)
NOTE: recipe cairo-native-1.16.0-r0: task do_fetch: Started
NOTE: recipe acl-native-2.2.53-r0: task do_fetch: Succeeded
NOTE: Running task 59 of 841 (virtual:native:/home/pokybuild/yocto-worker/a-full/build/meta/recipes-graphics/xorg-lib/libx11_1.6.9.bb:do_fetch)
NOTE: recipe libx11-native-1_1.6.9-r0: task do_fetch: Started
NOTE: recipe pango-native-1.44.7-r0: task do_fetch: Succeeded
NOTE: Running task 60 of 841 (virtual:native:/home/pokybuild/yocto-worker/a-full/build/meta/recipes-graphics/xorg-proto/xorgproto_2019.2.bb:do_fetch)
NOTE: recipe xorgproto-native-2019.2-r0: task do_fetch: Started
NOTE: recipe libxdamage-native-1_1.1.5-r0: task do_fetch: Succeeded
NOTE: Running task 61 of 841 (virtual:native:/home/pokybuild/yocto-worker/a-full/build/meta/recipes-support/gmp/gmp_6.2.0.bb:do_fetch)
NOTE: recipe gmp-native-6.2.0-r0: task do_fetch: Started
NOTE: recipe libpcre2-native-10.34-r0: task do_fetch: Succeeded
NOTE: Running task 62 of 841 (virtual:native:/home/pokybuild/yocto-worker/a-full/build/meta/recipes-support/libmpc/libmpc_1.1.0.bb:do_fetch)
NOTE: recipe libmpc-native-1.1.0-r0: task do_fetch: Started
NOTE: recipe libxext-native-1_1.3.4-r0: task do_fetch: Succeeded
NOTE: Running task 63 of 841 (virtual:native:/home/pokybuild/yocto-worker/a-full/build/meta/recipes-support/mpfr/mpfr_4.0.2.bb:do_fetch)
NOTE: recipe mpfr-native-4.0.2-r0: task do_fetch: Started
NOTE: recipe libxfixes-native-1_5.0.3-r0: task do_fetch: Succeeded
NOTE: Running task 64 of 841 (virtual:native:/home/pokybuild/yocto-worker/a-full/build/meta/recipes-devtools/make/make_4.3.bb:do_fetch)
NOTE: recipe make-native-4.3-r0: task do_fetch: Started
NOTE: recipe libxcursor-native-1_1.2.0-r0: task do_fetch: Succeeded
NOTE: Running noexec task 65 of 841 (/home/pokybuild/yocto-worker/a-full/build/meta/recipes-devtools/gcc/libgcc-initial_9.3.bb:do_fetch)
NOTE: Running task 66 of 841 (virtual:native:/home/pokybuild/yocto-worker/a-full/build/meta/recipes-extended/libnsl/libnsl2_git.bb:do_fetch)
NOTE: recipe libnsl2-native-1.2.0+gitAUTOINC+4a062cf418-r0: task do_fetch: Started
NOTE: recipe libpng-native-1.6.37-r0: task do_fetch: Succeeded
NOTE: Running task 67 of 841 (virtual:native:/home/pokybuild/yocto-worker/a-full/build/meta/recipes-core/readline/readline_8.0.bb:do_fetch)
NOTE: recipe readline-native-8.0-r0: task do_fetch: Started
NOTE: recipe libxi-native-1_1.7.10-r0: task do_fetch: Succeeded
NOTE: Running task 68 of 841 (virtual:native:/home/pokybuild/yocto-worker/a-full/build/meta/recipes-support/libffi/libffi_3.3.bb:do_fetch)
NOTE: recipe libffi-native-3.3-r0: task do_fetch: Started
NOTE: recipe gnutls-native-3.6.14-r0: task do_fetch: Succeeded
NOTE: Running task 69 of 841 (virtual:native:/home/pokybuild/yocto-worker/a-full/build/meta/recipes-extended/libtirpc/libtirpc_1.2.6.bb:do_fetch)
NOTE: recipe libtirpc-native-1.2.6-r0: task do_fetch: Started
NOTE: recipe libxrender-native-1_0.9.10-r0: task do_fetch: Succeeded
NOTE: Running task 70 of 841 (virtual:native:/home/pokybuild/yocto-worker/a-full/build/meta/recipes-support/gdbm/gdbm_1.18.1.bb:do_fetch)
NOTE: recipe gdbm-native-1.18.1-r0: task do_fetch: Started
NOTE: recipe xorgproto-native-2019.2-r0: task do_fetch: Succeeded
NOTE: Running task 71 of 841 (virtual:native:/home/pokybuild/yocto-worker/a-full/build/meta/recipes-support/popt/popt_1.16.bb:do_fetch)
NOTE: recipe popt-native-1.16-r3: task do_fetch: Started
NOTE: recipe libmpc-native-1.1.0-r0: task do_fetch: Succeeded
NOTE: Running task 72 of 841 (virtual:native:/home/pokybuild/yocto-worker/a-full/build/meta/recipes-devtools/elfutils/elfutils_0.178.bb:do_fetch)
NOTE: recipe elfutils-native-0.178-r0: task do_fetch: Started
NOTE: recipe libx11-native-1_1.6.9-r0: task do_fetch: Succeeded
NOTE: Running task 73 of 841 (virtual:native:/home/pokybuild/yocto-worker/a-full/build/meta/recipes-core/dbus/dbus_1.12.16.bb:do_fetch)
NOTE: recipe dbus-native-1.12.16-r0: task do_fetch: Started
NOTE: recipe gmp-native-6.2.0-r0: task do_fetch: Succeeded
NOTE: Running task 74 of 841 (virtual:native:/home/pokybuild/yocto-worker/a-full/build/meta/recipes-extended/libarchive/libarchive_3.4.2.bb:do_fetch)
NOTE: recipe libarchive-native-3.4.2-r0: task do_fetch: Started
NOTE: recipe fontconfig-native-2.13.1-r0: task do_fetch: Succeeded
NOTE: Running task 75 of 841 (virtual:native:/home/pokybuild/yocto-worker/a-full/build/meta/recipes-support/db/db_5.3.28.bb:do_fetch)
NOTE: recipe db-native-1_5.3.28-r1: task do_fetch: Started
NOTE: recipe mpfr-native-4.0.2-r0: task do_fetch: Succeeded
NOTE: Running task 76 of 841 (virtual:native:/home/pokybuild/yocto-worker/a-full/build/meta/recipes-support/curl/curl_7.69.1.bb:do_fetch)
NOTE: recipe curl-native-7.69.1-r0: task do_fetch: Started
NOTE: recipe libnsl2-native-1.2.0+gitAUTOINC+4a062cf418-r0: task do_fetch: Succeeded
NOTE: Running task 77 of 841 (virtual:native:/home/pokybuild/yocto-worker/a-full/build/meta/recipes-core/expat/expat_2.2.9.bb:do_fetch)
NOTE: recipe expat-native-2.2.9-r0: task do_fetch: Started
NOTE: recipe lz4-native-1_1.9.2-r0: task do_fetch: Succeeded
NOTE: Running task 78 of 841 (/home/pokybuild/yocto-worker/a-full/build/meta/recipes-core/gettext/gettext-minimal-native_0.20.1.bb:do_fetch)
NOTE: recipe gettext-minimal-native-0.20.1-r0: task do_fetch: Started
NOTE: recipe gettext-minimal-native-0.20.1-r0: task do_fetch: Succeeded
NOTE: Running task 79 of 841 (virtual:native:/home/pokybuild/yocto-worker/a-full/build/meta/recipes-support/sqlite/sqlite3_3.31.1.bb:do_fetch)
NOTE: recipe sqlite3-native-3_3.31.1-r0: task do_fetch: Started
NOTE: recipe make-native-4.3-r0: task do_fetch: Succeeded
NOTE: Running task 80 of 841 (virtual:native:/home/pokybuild/yocto-worker/a-full/build/meta/recipes-support/attr/attr_2.4.48.bb:do_fetch)
NOTE: recipe attr-native-2.4.48-r0: task do_fetch: Started
NOTE: recipe libffi-native-3.3-r0: task do_fetch: Succeeded
NOTE: Running task 81 of 841 (virtual:native:/home/pokybuild/yocto-worker/a-full/build/meta/recipes-support/pinentry/pinentry_1.1.0.bb:do_fetch)
NOTE: recipe pinentry-native-1.1.0-r0: task do_fetch: Started
NOTE: recipe libtirpc-native-1.2.6-r0: task do_fetch: Succeeded
NOTE: Running task 82 of 841 (virtual:native:/home/pokybuild/yocto-worker/a-full/build/meta/recipes-devtools/python/python3-pip_20.0.2.bb:do_fetch)
NOTE: recipe python3-pip-native-20.0.2-r0: task do_fetch: Started
NOTE: recipe gdbm-native-1.18.1-r0: task do_fetch: Succeeded
NOTE: Running task 83 of 841 (/home/pokybuild/yocto-worker/a-full/build/meta/recipes-bsp/u-boot/u-boot_2020.01.bb:do_fetch)
NOTE: recipe u-boot-1_2020.01-r0: task do_fetch: Started
NOTE: recipe readline-native-8.0-r0: task do_fetch: Succeeded
NOTE: Running task 84 of 841 (/home/pokybuild/yocto-worker/a-full/build/meta/recipes-devtools/pseudo/pseudo_git.bb:do_fetch)
NOTE: recipe pseudo-1.9.0+gitAUTOINC+cca0d7f15b-r0: task do_fetch: Started
NOTE: recipe popt-native-1.16-r3: task do_fetch: Succeeded
NOTE: Running task 85 of 841 (/home/pokybuild/yocto-worker/a-full/build/meta/recipes-devtools/pkgconfig/pkgconfig_git.bb:do_fetch)
NOTE: recipe pkgconfig-0.29.2+gitAUTOINC+edf8e6f0ea-r0: task do_fetch: Started
NOTE: recipe expat-native-2.2.9-r0: task do_fetch: Succeeded
NOTE: Running task 86 of 841 (/home/pokybuild/yocto-worker/a-full/build/meta/recipes-devtools/make/make_4.3.bb:do_fetch)
NOTE: recipe make-4.3-r0: task do_fetch: Started
NOTE: recipe make-4.3-r0: task do_fetch: Succeeded
NOTE: Running task 87 of 841 (virtual:native:/home/pokybuild/yocto-worker/a-full/build/meta/recipes-extended/perl/libxml-namespacesupport-perl_1.12.bb:do_fetch)
NOTE: recipe libxml-namespacesupport-perl-native-1.12-r0: task do_fetch: Started
NOTE: recipe dbus-native-1.12.16-r0: task do_fetch: Succeeded
NOTE: Running task 88 of 841 (virtual:native:/home/pokybuild/yocto-worker/a-full/build/meta/recipes-extended/bc/bc_1.07.1.bb:do_fetch)
NOTE: recipe bc-native-1.07.1-r0: task do_fetch: Started
NOTE: recipe attr-native-2.4.48-r0: task do_fetch: Succeeded
NOTE: Running task 89 of 841 (virtual:native:/home/pokybuild/yocto-worker/a-full/build/meta/recipes-extended/zip/zip_3.0.bb:do_fetch)
NOTE: recipe zip-native-3.0-r2: task do_fetch: Started
NOTE: recipe pinentry-native-1.1.0-r0: task do_fetch: Succeeded
NOTE: Running task 90 of 841 (virtual:native:/home/pokybuild/yocto-worker/a-full/build/meta/recipes-extended/cwautomacros/cwautomacros_20110201.bb:do_fetch)
NOTE: recipe cwautomacros-native-20110201-r0: task do_fetch: Started
NOTE: recipe python3-pip-native-20.0.2-r0: task do_fetch: Succeeded
NOTE: Running task 91 of 841 (virtual:native:/home/pokybuild/yocto-worker/a-full/build/meta/recipes-devtools/unfs3/unfs3_git.bb:do_fetch)
NOTE: recipe unfs3-native-0.9.22+AUTOINC+c12a5c69a8-r0: task do_fetch: Started
NOTE: recipe pseudo-1.9.0+gitAUTOINC+cca0d7f15b-r0: task do_fetch: Succeeded
NOTE: Running task 92 of 841 (/home/pokybuild/yocto-worker/a-full/build/meta/recipes-devtools/gdb/gdb-cross_9.1.bb:do_fetch)
NOTE: recipe libarchive-native-3.4.2-r0: task do_fetch: Succeeded
NOTE: Running task 93 of 841 (virtual:native:/home/pokybuild/yocto-worker/a-full/build/meta/recipes-support/gnutls/libtasn1_4.16.0.bb:do_fetch)
NOTE: recipe gdb-cross-i686-9.1-r0: task do_fetch: Started
NOTE: recipe libtasn1-native-4.16.0-r0: task do_fetch: Started
NOTE: recipe curl-native-7.69.1-r0: task do_fetch: Succeeded
NOTE: Running task 94 of 841 (virtual:native:/home/pokybuild/yocto-worker/a-full/build/meta/recipes-devtools/unifdef/unifdef_2.12.bb:do_fetch)
NOTE: recipe unifdef-native-2.12-r0: task do_fetch: Started
NOTE: recipe sqlite3-native-3_3.31.1-r0: task do_fetch: Succeeded
NOTE: Running task 95 of 841 (virtual:native:/home/pokybuild/yocto-worker/a-full/build/meta/recipes-devtools/rsync/rsync_3.1.3.bb:do_fetch)
NOTE: recipe rsync-native-3.1.3-r0: task do_fetch: Started
NOTE: recipe libxml-namespacesupport-perl-native-1.12-r0: task do_fetch: Succeeded
NOTE: Running task 96 of 841 (virtual:native:/home/pokybuild/yocto-worker/a-full/build/meta/recipes-devtools/llvm/llvm_git.bb:do_fetch)
NOTE: recipe llvm-native-9.0.1-r0: task do_fetch: Started
NOTE: recipe libjpeg-turbo-native-1_2.0.4-r0: task do_fetch: Succeeded
NOTE: Running task 97 of 841 (virtual:native:/home/pokybuild/yocto-worker/a-full/build/meta/recipes-core/coreutils/coreutils_8.31.bb:do_fetch)
NOTE: recipe coreutils-native-8.31-r0: task do_fetch: Started
NOTE: recipe bc-native-1.07.1-r0: task do_fetch: Succeeded
NOTE: Running task 98 of 841 (virtual:native:/home/pokybuild/yocto-worker/a-full/build/meta/recipes-support/gnupg/gnupg_2.2.20.bb:do_fetch)
NOTE: recipe elfutils-native-0.178-r0: task do_fetch: Succeeded
NOTE: Running task 99 of 841 (/home/pokybuild/yocto-worker/a-full/build/meta/recipes-extended/timezone/tzcode-native.bb:do_fetch)
NOTE: recipe tzcode-native-2020d-r0: task do_fetch: Started
NOTE: recipe gnupg-native-2.2.20-r0: task do_fetch: Started
NOTE: recipe zip-native-3.0-r2: task do_fetch: Succeeded
NOTE: Running task 100 of 841 (virtual:native:/home/pokybuild/yocto-worker/a-full/build/meta/recipes-devtools/file/file_5.38.bb:do_fetch)
NOTE: recipe file-native-5.38-r0: task do_fetch: Started
NOTE: recipe unifdef-native-2.12-r0: task do_fetch: Succeeded
NOTE: Running task 101 of 841 (virtual:native:/home/pokybuild/yocto-worker/a-full/build/meta/recipes-support/debianutils/debianutils_4.9.1.bb:do_fetch)
NOTE: recipe debianutils-native-4.9.1-r0: task do_fetch: Started
NOTE: recipe unfs3-native-0.9.22+AUTOINC+c12a5c69a8-r0: task do_fetch: Succeeded
NOTE: Running task 102 of 841 (virtual:native:/home/pokybuild/yocto-worker/a-full/build/meta/recipes-connectivity/openssl/openssl_1.1.1g.bb:do_fetch)
NOTE: recipe openssl-native-1.1.1g-r0: task do_fetch: Started
NOTE: recipe libtasn1-native-4.16.0-r0: task do_fetch: Succeeded
NOTE: Running task 103 of 841 (virtual:native:/home/pokybuild/yocto-worker/a-full/build/meta/recipes-gnome/gnome/gconf_3.2.6.bb:do_fetch)
NOTE: recipe gconf-native-3.2.6-r0: task do_fetch: Started
NOTE: recipe cwautomacros-native-20110201-r0: task do_fetch: Succeeded
NOTE: Running task 104 of 841 (virtual:native:/home/pokybuild/yocto-worker/a-full/build/meta/recipes-core/ovmf/ovmf_git.bb:do_fetch)
NOTE: recipe ovmf-native-edk2-stable201911-r0: task do_fetch: Started
NOTE: recipe rsync-native-3.1.3-r0: task do_fetch: Succeeded
NOTE: Running task 105 of 841 (virtual:native:/home/pokybuild/yocto-worker/a-full/build/meta/recipes-extended/acpica/acpica_20200430.bb:do_fetch)
NOTE: recipe acpica-native-20200430-r0: task do_fetch: Started
NOTE: recipe pkgconfig-0.29.2+gitAUTOINC+edf8e6f0ea-r0: task do_fetch: Succeeded
NOTE: Running task 106 of 841 (/home/pokybuild/yocto-worker/a-full/build/meta/recipes-devtools/qemu/qemu-system-native_4.2.0.bb:do_fetch)
NOTE: recipe qemu-system-native-4.2.0-r0: task do_fetch: Started
NOTE: recipe coreutils-native-8.31-r0: task do_fetch: Succeeded
NOTE: Running task 107 of 841 (/home/pokybuild/yocto-worker/a-full/build/meta/recipes-devtools/python/python3-scons-native_3.1.2.bb:do_fetch)
NOTE: recipe python3-scons-native-3.1.2-r0: task do_fetch: Started
NOTE: recipe debianutils-native-4.9.1-r0: task do_fetch: Succeeded
NOTE: Running task 108 of 841 (virtual:native:/home/pokybuild/yocto-worker/a-full/build/meta/recipes-devtools/python-numpy/python3-numpy_1.17.4.bb:do_fetch)
NOTE: recipe python3-numpy-native-1.17.4-r0: task do_fetch: Started
NOTE: recipe gnupg-native-2.2.20-r0: task do_fetch: Succeeded
NOTE: Running task 109 of 841 (virtual:native:/home/pokybuild/yocto-worker/a-full/build/meta/recipes-devtools/python/python3-six_1.14.0.bb:do_fetch)
NOTE: recipe python3-six-native-1.14.0-r0: task do_fetch: Started
NOTE: recipe gconf-native-3.2.6-r0: task do_fetch: Succeeded
NOTE: Running task 110 of 841 (virtual:native:/home/pokybuild/yocto-worker/a-full/build/meta/recipes-devtools/python/python3-mako_1.1.1.bb:do_fetch)
NOTE: recipe python3-mako-native-1.1.1-r0: task do_fetch: Started
NOTE: recipe acpica-native-20200430-r0: task do_fetch: Succeeded
NOTE: Running task 111 of 841 (virtual:native:/home/pokybuild/yocto-worker/a-full/build/meta/recipes-extended/rpcsvc-proto/rpcsvc-proto.bb:do_fetch)
NOTE: recipe rpcsvc-proto-native-1.4+gitAUTOINC+9bc3b5b785-r0: task do_fetch: Started
NOTE: recipe python3-numpy-native-1.17.4-r0: task do_fetch: Succeeded
NOTE: Running task 112 of 841 (virtual:native:/home/pokybuild/yocto-worker/a-full/build/meta/recipes-extended/asciidoc/asciidoc_8.6.9.bb:do_fetch)
NOTE: recipe asciidoc-native-8.6.9+py3-gitAUTOINC+618f6e6f6b-r0: task do_fetch: Started
NOTE: recipe python3-six-native-1.14.0-r0: task do_fetch: Succeeded
NOTE: Running task 113 of 841 (virtual:native:/home/pokybuild/yocto-worker/a-full/build/meta/recipes-graphics/xorg-font/font-util_1.3.2.bb:do_fetch)
NOTE: recipe font-util-native-1.3.2-r0: task do_fetch: Started
NOTE: recipe tzcode-native-2020d-r0: task do_fetch: Succeeded
NOTE: Running task 114 of 841 (virtual:native:/home/pokybuild/yocto-worker/a-full/build/meta/recipes-support/icu/icu_66.1.bb:do_fetch)
NOTE: recipe icu-native-66.1-r0: task do_fetch: Started
NOTE: recipe rpcsvc-proto-native-1.4+gitAUTOINC+9bc3b5b785-r0: task do_fetch: Succeeded
NOTE: Running task 115 of 841 (virtual:native:/home/pokybuild/yocto-worker/a-full/build/meta/recipes-extended/groff/groff_1.22.4.bb:do_fetch)
NOTE: recipe openssl-native-1.1.1g-r0: task do_fetch: Succeeded
NOTE: Running task 116 of 841 (virtual:native:/home/pokybuild/yocto-worker/a-full/build/meta/recipes-devtools/orc/orc_0.4.31.bb:do_fetch)
NOTE: recipe groff-native-1.22.4-r0: task do_fetch: Started
NOTE: recipe orc-native-0.4.31-r0: task do_fetch: Started
NOTE: recipe python3-mako-native-1.1.1-r0: task do_fetch: Succeeded
NOTE: Running task 117 of 841 (virtual:native:/home/pokybuild/yocto-worker/a-full/build/meta/recipes-graphics/wayland/wayland_1.18.0.bb:do_fetch)
NOTE: recipe wayland-native-1.18.0-r0: task do_fetch: Started
NOTE: recipe python3-scons-native-3.1.2-r0: task do_fetch: Succeeded
NOTE: Running task 118 of 841 (/home/pokybuild/yocto-worker/a-full/build/meta/recipes-graphics/libsdl2/libsdl2_2.0.12.bb:do_fetch)
NOTE: recipe libsdl2-2.0.12-r0: task do_fetch: Started
NOTE: recipe libsdl2-2.0.12-r0: task do_fetch: Succeeded
NOTE: Running task 119 of 841 (virtual:native:/home/pokybuild/yocto-worker/a-full/build/meta/recipes-extended/cracklib/cracklib_2.9.5.bb:do_fetch)
NOTE: recipe cracklib-native-2.9.5-r0: task do_fetch: Started
NOTE: recipe db-native-1_5.3.28-r1: task do_fetch: Succeeded
NOTE: Running task 120 of 841 (virtual:native:/home/pokybuild/yocto-worker/a-full/build/meta/recipes-devtools/ruby/ruby_2.7.1.bb:do_fetch)
NOTE: recipe ruby-native-2.7.1-r0: task do_fetch: Started
NOTE: recipe font-util-native-1.3.2-r0: task do_fetch: Succeeded
NOTE: Running task 121 of 841 (virtual:native:/home/pokybuild/yocto-worker/a-full/build/meta/recipes-devtools/desktop-file-utils/desktop-file-utils_0.24.bb:do_fetch)
NOTE: recipe desktop-file-utils-native-0.24-r0: task do_fetch: Started
NOTE: recipe gdb-cross-i686-9.1-r0: task do_fetch: Succeeded
NOTE: Running task 122 of 841 (virtual:native:/home/pokybuild/yocto-worker/a-full/build/meta/recipes-extended/lzip/lzip_1.21.bb:do_fetch)
NOTE: recipe lzip-native-1.21-r0: task do_fetch: Started
NOTE: recipe orc-native-0.4.31-r0: task do_fetch: Succeeded
NOTE: Running task 123 of 841 (/home/pokybuild/yocto-worker/a-full/build/meta/recipes-support/boost/bjam-native_1.72.0.bb:do_fetch)
NOTE: recipe bjam-native-1.72.0-r0: task do_fetch: Started
NOTE: recipe wayland-native-1.18.0-r0: task do_fetch: Succeeded
NOTE: Running task 124 of 841 (virtual:native:/home/pokybuild/yocto-worker/a-full/build/meta/recipes-extended/bzip2/bzip2_1.0.8.bb:do_fetch)
NOTE: recipe cracklib-native-2.9.5-r0: task do_fetch: Succeeded
NOTE: Running task 125 of 841 (/home/pokybuild/yocto-worker/a-full/build/meta/recipes-devtools/go/go-runtime_1.14.bb:do_fetch)
NOTE: recipe go-runtime-1.14.7-r0: task do_fetch: Started
NOTE: recipe bzip2-native-1.0.8-r0: task do_fetch: Started
NOTE: recipe groff-native-1.22.4-r0: task do_fetch: Succeeded
NOTE: Running task 126 of 841 (virtual:native:/home/pokybuild/yocto-worker/a-full/build/meta/recipes-extended/texinfo/texinfo_6.7.bb:do_fetch)
NOTE: recipe texinfo-native-6.7-r0: task do_fetch: Started
NOTE: recipe desktop-file-utils-native-0.24-r0: task do_fetch: Succeeded
NOTE: Running task 127 of 841 (virtual:native:/home/pokybuild/yocto-worker/a-full/build/meta/recipes-devtools/tcltk/tcl_8.6.10.bb:do_fetch)
NOTE: recipe tcl-native-8.6.10-r0: task do_fetch: Started
NOTE: recipe lzip-native-1.21-r0: task do_fetch: Succeeded
NOTE: Running task 128 of 841 (/home/pokybuild/yocto-worker/a-full/build/meta/recipes-kernel/kern-tools/kern-tools-native_git.bb:do_fetch)
NOTE: recipe kern-tools-native-0.2+gitAUTOINC+c66833e1ca-r12: task do_fetch: Started
NOTE: recipe asciidoc-native-8.6.9+py3-gitAUTOINC+618f6e6f6b-r0: task do_fetch: Succeeded
NOTE: Running task 129 of 841 (virtual:native:/home/pokybuild/yocto-worker/a-full/build/meta/recipes-core/ncurses/ncurses_6.2.bb:do_fetch)
NOTE: recipe ncurses-native-6.2-r0: task do_fetch: Started
NOTE: recipe file-native-5.38-r0: task do_fetch: Succeeded
NOTE: Running task 130 of 841 (virtual:native:/home/pokybuild/yocto-worker/a-full/build/meta/recipes-support/re2c/re2c_1.0.1.bb:do_fetch)
NOTE: recipe re2c-native-1.0.1-r0: task do_fetch: Started
NOTE: recipe kern-tools-native-0.2+gitAUTOINC+c66833e1ca-r12: task do_fetch: Succeeded
NOTE: Running task 131 of 841 (/home/pokybuild/yocto-worker/a-full/build/meta/recipes-devtools/go/go-cross_1.14.bb:do_fetch)
NOTE: recipe go-cross-core2-32-1.14.7-r0: task do_fetch: Started
NOTE: recipe cairo-native-1.16.0-r0: task do_fetch: Succeeded
NOTE: Running task 132 of 841 (/home/pokybuild/yocto-worker/a-full/build/meta/recipes-devtools/go/go-native_1.14.bb:do_fetch)
NOTE: recipe go-native-1.14.7-r0: task do_fetch: Started
NOTE: recipe texinfo-native-6.7-r0: task do_fetch: Succeeded
NOTE: Running task 133 of 841 (virtual:native:/home/pokybuild/yocto-worker/a-full/build/meta/recipes-devtools/python/python3-pbr_5.4.4.bb:do_fetch)
NOTE: recipe python3-pbr-native-5.4.4-r0: task do_fetch: Started
NOTE: recipe tcl-native-8.6.10-r0: task do_fetch: Succeeded
NOTE: Running task 134 of 841 (virtual:native:/home/pokybuild/yocto-worker/a-full/build/meta/recipes-devtools/nasm/nasm_2.15.03.bb:do_fetch)
NOTE: recipe nasm-native-2.15.03-r0: task do_fetch: Started
NOTE: recipe bzip2-native-1.0.8-r0: task do_fetch: Succeeded
NOTE: Running task 135 of 841 (virtual:native:/home/pokybuild/yocto-worker/a-full/build/meta/recipes-devtools/binutils/binutils_2.34.bb:do_fetch)
NOTE: recipe binutils-native-2.34-r0: task do_fetch: Started
NOTE: recipe ruby-native-2.7.1-r0: task do_fetch: Succeeded
NOTE: Running task 136 of 841 (virtual:native:/home/pokybuild/yocto-worker/a-full/build/meta/recipes-devtools/expect/expect_5.45.4.bb:do_fetch)
NOTE: recipe expect-native-5.45.4-r0: task do_fetch: Started
NOTE: recipe re2c-native-1.0.1-r0: task do_fetch: Succeeded
NOTE: Running task 137 of 841 (virtual:native:/home/pokybuild/yocto-worker/a-full/build/meta/recipes-core/zlib/zlib_1.2.11.bb:do_fetch)
NOTE: recipe zlib-native-1.2.11-r0: task do_fetch: Started
NOTE: recipe go-runtime-1.14.7-r0: task do_fetch: Succeeded
NOTE: Running task 138 of 841 (/home/pokybuild/yocto-worker/a-full/build/meta/recipes-kernel/kmod/kmod-native_git.bb:do_fetch)
NOTE: recipe go-cross-core2-32-1.14.7-r0: task do_fetch: Succeeded
NOTE: Running task 139 of 841 (virtual:native:/home/pokybuild/yocto-worker/a-full/build/meta/recipes-extended/gperf/gperf_3.1.bb:do_fetch)
NOTE: recipe kmod-native-26-r0: task do_fetch: Started
NOTE: recipe gperf-native-3.1-r0: task do_fetch: Started
NOTE: recipe python3-pbr-native-5.4.4-r0: task do_fetch: Succeeded
NOTE: Running task 140 of 841 (virtual:native:/home/pokybuild/yocto-worker/a-full/build/meta/recipes-graphics/xorg-app/mkfontscale_1.2.1.bb:do_fetch)
NOTE: recipe mkfontscale-native-1.2.1-r0: task do_fetch: Started
NOTE: recipe nasm-native-2.15.03-r0: task do_fetch: Succeeded
NOTE: Running task 141 of 841 (virtual:native:/home/pokybuild/yocto-worker/a-full/build/meta/recipes-devtools/xmlto/xmlto_0.0.28.bb:do_fetch)
NOTE: recipe xmlto-native-0.0.28-r0: task do_fetch: Started
NOTE: recipe expect-native-5.45.4-r0: task do_fetch: Succeeded
NOTE: Running task 142 of 841 (virtual:native:/home/pokybuild/yocto-worker/a-full/build/meta/recipes-extended/ghostscript/ghostscript_9.52.bb:do_fetch)
NOTE: recipe ghostscript-native-9.52-r0: task do_fetch: Started
NOTE: recipe ncurses-native-6.2-r0: task do_fetch: Succeeded
NOTE: Running task 143 of 841 (virtual:native:/home/pokybuild/yocto-worker/a-full/build/meta/recipes-support/itstool/itstool_2.0.6.bb:do_fetch)
NOTE: recipe itstool-native-2.0.6-r0: task do_fetch: Started
NOTE: recipe zlib-native-1.2.11-r0: task do_fetch: Succeeded
NOTE: Running task 144 of 841 (virtual:native:/home/pokybuild/yocto-worker/a-full/build/meta/recipes-support/shared-mime-info/shared-mime-info_git.bb:do_fetch)
NOTE: recipe shared-mime-info-native-1.15-r0: task do_fetch: Started
NOTE: recipe gperf-native-3.1-r0: task do_fetch: Succeeded
NOTE: Running task 145 of 841 (virtual:native:/home/pokybuild/yocto-worker/a-full/build/meta/recipes-devtools/intltool/intltool_0.51.0.bb:do_fetch)
NOTE: recipe intltool-native-0.51.0-r0: task do_fetch: Started
NOTE: recipe mkfontscale-native-1.2.1-r0: task do_fetch: Succeeded
NOTE: Running task 146 of 841 (virtual:native:/home/pokybuild/yocto-worker/a-full/build/meta/recipes-graphics/xorg-util/util-macros_1.19.2.bb:do_fetch)
NOTE: recipe util-macros-native-1_1.19.2-r0: task do_fetch: Started
NOTE: recipe xmlto-native-0.0.28-r0: task do_fetch: Succeeded
NOTE: Running task 147 of 841 (virtual:native:/home/pokybuild/yocto-worker/a-full/build/meta/recipes-devtools/swig/swig_3.0.12.bb:do_fetch)
NOTE: recipe swig-native-3.0.12-r0: task do_fetch: Started
NOTE: recipe itstool-native-2.0.6-r0: task do_fetch: Succeeded
NOTE: Running task 148 of 841 (virtual:native:/home/pokybuild/yocto-worker/a-full/build/meta/recipes-devtools/docbook-xml/docbook-xml-dtd4_4.5.bb:do_fetch)
NOTE: recipe docbook-xml-dtd4-native-4.5-r0: task do_fetch: Started
NOTE: recipe intltool-native-0.51.0-r0: task do_fetch: Succeeded
NOTE: Running task 149 of 841 (virtual:native:/home/pokybuild/yocto-worker/a-full/build/meta/recipes-support/libxslt/libxslt_1.1.34.bb:do_fetch)
NOTE: recipe libxslt-native-1.1.34-r0: task do_fetch: Started
NOTE: recipe util-macros-native-1_1.19.2-r0: task do_fetch: Succeeded
NOTE: Running task 150 of 841 (virtual:native:/home/pokybuild/yocto-worker/a-full/build/meta/recipes-core/libxml/libxml2_2.9.10.bb:do_fetch)
NOTE: recipe libxml2-native-2.9.10-r0: task do_fetch: Started
NOTE: recipe docbook-xml-dtd4-native-4.5-r0: task do_fetch: Succeeded
NOTE: Running task 151 of 841 (virtual:native:/home/pokybuild/yocto-worker/a-full/build/meta/recipes-devtools/docbook-xml/docbook-xsl-stylesheets_1.79.1.bb:do_fetch)
NOTE: recipe docbook-xsl-stylesheets-native-1.79.1-r0: task do_fetch: Started
NOTE: recipe go-native-1.14.7-r0: task do_fetch: Succeeded
NOTE: Running task 152 of 841 (/home/pokybuild/yocto-worker/a-full/build/meta/recipes-kernel/linux/linux-yocto_5.4.bb:do_fetch)
NOTE: recipe linux-yocto-5.4.69+gitAUTOINC+7f765dcb29_cfcdd63145-r0: task do_fetch: Started
NOTE: recipe swig-native-3.0.12-r0: task do_fetch: Succeeded
NOTE: Running task 153 of 841 (virtual:native:/home/pokybuild/yocto-worker/a-full/build/meta/recipes-devtools/perl/libxml-parser-perl_2.46.bb:do_fetch)
NOTE: recipe libxml-parser-perl-native-2.46-r0: task do_fetch: Started
NOTE: recipe libxslt-native-1.1.34-r0: task do_fetch: Succeeded
NOTE: Running task 154 of 841 (/home/pokybuild/yocto-worker/a-full/build/meta/recipes-devtools/gcc/gcc-source_9.3.bb:do_fetch)
NOTE: recipe gcc-source-9.3.0-9.3.0-r0: task do_fetch: Started
NOTE: recipe libxml-parser-perl-native-2.46-r0: task do_fetch: Succeeded
NOTE: Running task 155 of 841 (virtual:native:/home/pokybuild/yocto-worker/a-full/build/meta/recipes-devtools/vala/vala_0.46.6.bb:do_fetch)
NOTE: recipe vala-native-0.46.6-r0: task do_fetch: Started
NOTE: recipe kmod-native-26-r0: task do_fetch: Succeeded
NOTE: Running task 156 of 841 (virtual:native:/home/pokybuild/yocto-worker/a-full/build/meta/recipes-core/glib-2.0/glib-2.0_2.62.6.bb:do_fetch)
NOTE: recipe glib-2.0-native-1_2.62.6-r0: task do_fetch: Started
NOTE: recipe libxml2-native-2.9.10-r0: task do_fetch: Succeeded
NOTE: Running task 157 of 841 (/home/pokybuild/yocto-worker/a-full/build/meta/recipes-core/libxcrypt/libxcrypt_4.4.15.bb:do_fetch)
NOTE: recipe libxcrypt-4.4.15-r0: task do_fetch: Started
NOTE: recipe qemu-system-native-4.2.0-r0: task do_fetch: Succeeded
NOTE: Running task 158 of 841 (/home/pokybuild/yocto-worker/a-full/build/meta/recipes-graphics/mesa/mesa_20.0.2.bb:do_fetch)
NOTE: recipe mesa-2_20.0.2-r0: task do_fetch: Started
NOTE: recipe vala-native-0.46.6-r0: task do_fetch: Succeeded
NOTE: Running task 159 of 841 (virtual:native:/home/pokybuild/yocto-worker/a-full/build/meta/recipes-devtools/prelink/prelink_git.bb:do_fetch)
NOTE: recipe prelink-native-1.0+gitAUTOINC+f9975537db-r0: task do_fetch: Started
NOTE: recipe docbook-xsl-stylesheets-native-1.79.1-r0: task do_fetch: Succeeded
NOTE: Running task 160 of 841 (virtual:native:/home/pokybuild/yocto-worker/a-full/build/meta/recipes-devtools/meson/meson_0.53.2.bb:do_fetch)
NOTE: recipe meson-native-0.53.2-r0: task do_fetch: Started
NOTE: recipe glib-2.0-native-1_2.62.6-r0: task do_fetch: Succeeded
NOTE: Running task 161 of 841 (virtual:native:/home/pokybuild/yocto-worker/a-full/build/meta/recipes-gnome/gobject-introspection/gobject-introspection_1.62.0.bb:do_fetch)
NOTE: recipe gobject-introspection-native-1.62.0-r0: task do_fetch: Started
NOTE: recipe ghostscript-native-9.52-r0: task do_fetch: Succeeded
NOTE: Running task 162 of 841 (virtual:native:/home/pokybuild/yocto-worker/a-full/build/meta/recipes-core/dbus/dbus-glib_0.110.bb:do_fetch)
NOTE: recipe dbus-glib-native-0.110-r0: task do_fetch: Started
WARNING: mesa-2_20.0.2-r0 do_fetch: Failed to fetch URL https://mesa.freedesktop.org/archive/mesa-20.0.2.tar.xz, attempting MIRRORS if available
NOTE: recipe shared-mime-info-native-1.15-r0: task do_fetch: Succeeded
NOTE: Running task 163 of 841 (virtual:native:/home/pokybuild/yocto-worker/a-full/build/meta/recipes-devtools/perl/perl_5.30.1.bb:do_fetch)
NOTE: recipe perl-native-5.30.1-r0: task do_fetch: Started
NOTE: recipe libxcrypt-4.4.15-r0: task do_fetch: Succeeded
NOTE: Running task 164 of 841 (virtual:native:/home/pokybuild/yocto-worker/a-full/build/meta/recipes-devtools/e2fsprogs/e2fsprogs_1.45.4.bb:do_fetch)
NOTE: recipe e2fsprogs-native-1.45.4-r0: task do_fetch: Started
NOTE: recipe icu-native-66.1-r0: task do_fetch: Succeeded
NOTE: Running task 165 of 841 (virtual:native:/home/pokybuild/yocto-worker/a-full/build/meta/recipes-devtools/squashfs-tools/squashfs-tools_git.bb:do_fetch)
NOTE: recipe squashfs-tools-native-4.4-r0: task do_fetch: Started
NOTE: recipe dbus-glib-native-0.110-r0: task do_fetch: Succeeded
NOTE: Running task 166 of 841 (virtual:native:/home/pokybuild/yocto-worker/a-full/build/meta/recipes-devtools/dosfstools/dosfstools_4.1.bb:do_fetch)
NOTE: recipe dosfstools-native-4.1-r0: task do_fetch: Started
WARNING: prelink-native-1.0+gitAUTOINC+f9975537db-r0 do_fetch: Failed to fetch URL git://git.yoctoproject.org/prelink-cross.git;branch=cross_prelink_staging, attempting MIRRORS if available
WARNING: meson-native-0.53.2-r0 do_fetch: Failed to fetch URL https://github.com/mesonbuild/meson/releases/download/0.53.2/meson-0.53.2.tar.gz, attempting MIRRORS if available
NOTE: recipe gobject-introspection-native-1.62.0-r0: task do_fetch: Succeeded
NOTE: Running task 167 of 841 (virtual:native:/home/pokybuild/yocto-worker/a-full/build/meta/recipes-core/util-linux/util-linux_2.35.1.bb:do_fetch)
NOTE: recipe util-linux-native-2.35.1-r0: task do_fetch: Started
NOTE: recipe dosfstools-native-4.1-r0: task do_fetch: Succeeded
NOTE: Running task 168 of 841 (virtual:native:/home/pokybuild/yocto-worker/a-full/build/meta/recipes-devtools/fdisk/gptfdisk_1.0.4.bb:do_fetch)
NOTE: recipe gptfdisk-native-1.0.4-r0: task do_fetch: Started
WARNING: squashfs-tools-native-4.4-r0 do_fetch: Failed to fetch URL git://github.com/plougher/squashfs-tools.git;protocol=https, attempting MIRRORS if available
NOTE: recipe bjam-native-1.72.0-r0: task do_fetch: Succeeded
NOTE: Running task 169 of 841 (virtual:native:/home/pokybuild/yocto-worker/a-full/build/meta/recipes-devtools/btrfs-tools/btrfs-tools_5.4.1.bb:do_fetch)
NOTE: recipe btrfs-tools-native-5.4.1-r0: task do_fetch: Started
NOTE: recipe meson-native-0.53.2-r0: task do_fetch: Succeeded
NOTE: Running task 170 of 841 (virtual:native:/home/pokybuild/yocto-worker/a-full/build/meta/recipes-extended/parted/parted_3.3.bb:do_fetch)
NOTE: recipe parted-native-3.3-r0: task do_fetch: Started
NOTE: recipe util-linux-native-2.35.1-r0: task do_fetch: Succeeded
NOTE: Running task 171 of 841 (/home/pokybuild/yocto-worker/a-full/build/meta/recipes-devtools/cdrtools/cdrtools-native_3.01.bb:do_fetch)
NOTE: recipe cdrtools-native-3.01-r0: task do_fetch: Started
NOTE: recipe prelink-native-1.0+gitAUTOINC+f9975537db-r0: task do_fetch: Succeeded
NOTE: Running task 172 of 841 (virtual:native:/home/pokybuild/yocto-worker/a-full/build/meta/recipes-devtools/mtools/mtools_4.0.23.bb:do_fetch)
NOTE: recipe mtools-native-4.0.23-r0: task do_fetch: Started
NOTE: recipe parted-native-3.3-r0: task do_fetch: Succeeded
NOTE: Running task 173 of 841 (virtual:native:/home/pokybuild/yocto-worker/a-full/build/meta/recipes-support/bmap-tools/bmap-tools_3.5.bb:do_fetch)
NOTE: recipe bmap-tools-native-3.5+gitAUTOINC+db7087b883-r0: task do_fetch: Started
NOTE: recipe mesa-2_20.0.2-r0: task do_fetch: Succeeded
NOTE: Running task 174 of 841 (virtual:native:/home/pokybuild/yocto-worker/a-full/build/meta/recipes-devtools/syslinux/syslinux_6.04-pre2.bb:do_fetch)
NOTE: recipe syslinux-native-6.04-pre2-r0: task do_fetch: Started
NOTE: recipe gptfdisk-native-1.0.4-r0: task do_fetch: Succeeded
NOTE: Running task 175 of 841 (virtual:native:/home/pokybuild/yocto-worker/a-full/build/meta/recipes-bsp/grub/grub-efi_2.04.bb:do_fetch)
NOTE: recipe grub-efi-native-2.04-r0: task do_fetch: Started
NOTE: recipe mtools-native-4.0.23-r0: task do_fetch: Succeeded
NOTE: Running task 176 of 841 (virtual:native:/home/pokybuild/yocto-worker/a-full/build/meta/recipes-gnome/librsvg/librsvg_2.40.21.bb:do_fetch)
NOTE: recipe librsvg-native-2.40.21-r0: task do_fetch: Started
NOTE: recipe cdrtools-native-3.01-r0: task do_fetch: Succeeded
NOTE: recipe bmap-tools-native-3.5+gitAUTOINC+db7087b883-r0: task do_fetch: Succeeded
NOTE: Running task 177 of 841 (virtual:native:/home/pokybuild/yocto-worker/a-full/build/meta/recipes-gnome/gdk-pixbuf/gdk-pixbuf_2.40.0.bb:do_fetch)
NOTE: Running task 178 of 841 (virtual:native:/home/pokybuild/yocto-worker/a-full/build/meta/recipes-gnome/gtk+/gtk+3_3.24.14.bb:do_fetch)
NOTE: recipe gdk-pixbuf-native-2.40.0-r0: task do_fetch: Started
NOTE: recipe gtk+3-native-3.24.14-r0: task do_fetch: Started
NOTE: recipe squashfs-tools-native-4.4-r0: task do_fetch: Succeeded
NOTE: Running task 179 of 841 (/home/pokybuild/yocto-worker/a-full/build/meta/recipes-devtools/dpkg/dpkg_1.19.7.bb:do_fetch)
NOTE: recipe dpkg-1.19.7-r0: task do_fetch: Started
NOTE: recipe perl-native-5.30.1-r0: task do_fetch: Succeeded
NOTE: Running task 180 of 841 (/home/pokybuild/yocto-worker/a-full/build/meta/recipes-devtools/opkg-utils/opkg-utils_0.4.2.bb:do_fetch)
NOTE: recipe opkg-utils-0.4.2-r0: task do_fetch: Started
NOTE: recipe e2fsprogs-native-1.45.4-r0: task do_fetch: Succeeded
NOTE: Running task 181 of 841 (/home/pokybuild/yocto-worker/a-full/build/meta/recipes-devtools/m4/m4-native_1.4.18.bb:do_fetch)
NOTE: recipe m4-native-1.4.18-r0: task do_fetch: Started
NOTE: recipe syslinux-native-6.04-pre2-r0: task do_fetch: Succeeded
NOTE: Running task 182 of 841 (virtual:native:/home/pokybuild/yocto-worker/a-full/build/meta/recipes-devtools/flex/flex_2.6.4.bb:do_fetch)
NOTE: recipe flex-native-2.6.4-r0: task do_fetch: Started
NOTE: recipe gdk-pixbuf-native-2.40.0-r0: task do_fetch: Succeeded
NOTE: Running task 183 of 841 (/home/pokybuild/yocto-worker/a-full/build/meta/recipes-devtools/cmake/cmake-native_3.16.5.bb:do_fetch)
NOTE: recipe cmake-native-3.16.5-r0: task do_fetch: Started
WARNING: librsvg-native-2.40.21-r0 do_fetch: Failed to fetch URL https://ftp.gnome.org/pub/GNOME/sources/librsvg/2.40/librsvg-2.40.21.tar.xz;name=archive, attempting MIRRORS if available
NOTE: recipe grub-efi-native-2.04-r0: task do_fetch: Succeeded
NOTE: Running task 184 of 841 (virtual:native:/home/pokybuild/yocto-worker/a-full/build/meta/recipes-devtools/ninja/ninja_1.10.0.bb:do_fetch)
NOTE: recipe ninja-native-1.10.0-r0: task do_fetch: Started
NOTE: recipe opkg-utils-0.4.2-r0: task do_fetch: Succeeded
NOTE: Running task 185 of 841 (/home/pokybuild/yocto-worker/a-full/build/meta/recipes-graphics/xorg-xserver/xserver-xorg_1.20.8.bb:do_fetch)
NOTE: recipe xserver-xorg-2_1.20.8-r0: task do_fetch: Started
NOTE: recipe m4-native-1.4.18-r0: task do_fetch: Succeeded
NOTE: Running task 186 of 841 (virtual:native:/home/pokybuild/yocto-worker/a-full/build/meta/recipes-gnome/gtk-doc/gtk-doc_1.32.bb:do_fetch)
NOTE: recipe gtk-doc-native-1.32-r0: task do_fetch: Started
NOTE: recipe dpkg-1.19.7-r0: task do_fetch: Succeeded
NOTE: Running task 187 of 841 (virtual:native:/home/pokybuild/yocto-worker/a-full/build/meta/recipes-devtools/bison/bison_3.5.4.bb:do_fetch)
NOTE: recipe bison-native-3.5.4-r0: task do_fetch: Started
NOTE: recipe librsvg-native-2.40.21-r0: task do_fetch: Succeeded
NOTE: Running task 188 of 841 (/home/pokybuild/yocto-worker/a-full/build/meta/recipes-core/gettext/gettext_0.20.1.bb:do_fetch)
NOTE: recipe gettext-0.20.1-r0: task do_fetch: Started
NOTE: recipe btrfs-tools-native-5.4.1-r0: task do_fetch: Succeeded
NOTE: Running task 189 of 841 (/home/pokybuild/yocto-worker/a-full/build/meta/recipes-graphics/xorg-lib/libx11_1.6.9.bb:do_fetch)
NOTE: recipe libx11-1_1.6.9-r0: task do_fetch: Started
NOTE: recipe libx11-1_1.6.9-r0: task do_fetch: Succeeded
NOTE: Running task 190 of 841 (virtual:native:/home/pokybuild/yocto-worker/a-full/build/meta/recipes-extended/shadow/shadow_4.8.1.bb:do_fetch)
NOTE: recipe shadow-native-4.8.1-r0: task do_fetch: Started
NOTE: recipe flex-native-2.6.4-r0: task do_fetch: Succeeded
NOTE: Running task 191 of 841 (virtual:native:/home/pokybuild/yocto-worker/a-full/build/meta/recipes-core/gettext/gettext_0.20.1.bb:do_fetch)
NOTE: recipe gettext-native-0.20.1-r0: task do_fetch: Started
NOTE: recipe gtk+3-native-3.24.14-r0: task do_fetch: Succeeded
NOTE: Running task 192 of 841 (/home/pokybuild/yocto-worker/a-full/build/meta/recipes-extended/texinfo-dummy-native/texinfo-dummy-native.bb:do_fetch)
NOTE: recipe texinfo-dummy-native-1.0-r0: task do_fetch: Started
NOTE: recipe texinfo-dummy-native-1.0-r0: task do_fetch: Succeeded
NOTE: Running task 193 of 841 (virtual:native:/home/pokybuild/yocto-worker/a-full/build/meta/recipes-devtools/pkgconfig/pkgconfig_git.bb:do_fetch)
NOTE: recipe pkgconfig-native-0.29.2+gitAUTOINC+edf8e6f0ea-r0: task do_fetch: Started
NOTE: recipe pkgconfig-native-0.29.2+gitAUTOINC+edf8e6f0ea-r0: task do_fetch: Succeeded
NOTE: Running task 194 of 841 (virtual:native:/home/pokybuild/yocto-worker/a-full/build/meta/recipes-devtools/gnu-config/gnu-config_git.bb:do_fetch)
NOTE: recipe gnu-config-native-20200117+gitAUTOINC+5256817ace-r0: task do_fetch: Started
NOTE: recipe gtk-doc-native-1.32-r0: task do_fetch: Succeeded
NOTE: Running task 195 of 841 (/home/pokybuild/yocto-worker/a-full/build/meta/recipes-devtools/libtool/libtool-native_2.4.6.bb:do_fetch)
NOTE: recipe libtool-native-2.4.6-r0: task do_fetch: Started
NOTE: recipe shadow-native-4.8.1-r0: task do_fetch: Succeeded
NOTE: Running task 196 of 841 (virtual:native:/home/pokybuild/yocto-worker/a-full/build/meta/recipes-devtools/automake/automake_1.16.1.bb:do_fetch)
NOTE: recipe automake-native-1.16.1-r0: task do_fetch: Started
NOTE: recipe cmake-native-3.16.5-r0: task do_fetch: Succeeded
NOTE: Running task 197 of 841 (virtual:native:/home/pokybuild/yocto-worker/a-full/build/meta/recipes-devtools/autoconf/autoconf_2.69.bb:do_fetch)
NOTE: recipe autoconf-native-2.69-r11: task do_fetch: Started
NOTE: recipe xserver-xorg-2_1.20.8-r0: task do_fetch: Succeeded
NOTE: Running task 198 of 841 (/home/pokybuild/yocto-worker/a-full/build/meta/recipes-extended/libtirpc/libtirpc_1.2.6.bb:do_fetch)
NOTE: recipe libtirpc-1.2.6-r0: task do_fetch: Started
NOTE: recipe libtirpc-1.2.6-r0: task do_fetch: Succeeded
NOTE: Running task 199 of 841 (virtual:native:/home/pokybuild/yocto-worker/a-full/build/meta/recipes-core/update-rc.d/update-rc.d_0.8.bb:do_fetch)
NOTE: recipe update-rc.d-native-0.8-r0: task do_fetch: Started
NOTE: recipe ninja-native-1.10.0-r0: task do_fetch: Succeeded
NOTE: Running noexec task 200 of 841 (/home/pokybuild/yocto-worker/a-full/build/meta/recipes-devtools/gcc/gcc-cross_9.3.bb:do_fetch)
NOTE: Running task 201 of 841 (virtual:native:/home/pokybuild/yocto-worker/a-full/build/meta/recipes-devtools/python/python3-setuptools_45.2.0.bb:do_fetch)
NOTE: recipe python3-setuptools-native-45.2.0-r0: task do_fetch: Started
NOTE: recipe bison-native-3.5.4-r0: task do_fetch: Succeeded
NOTE: Running noexec task 202 of 841 (/home/pokybuild/yocto-worker/a-full/build/meta/recipes-devtools/gcc/gcc-runtime_9.3.bb:do_fetch)
NOTE: Running task 203 of 841 (/home/pokybuild/yocto-worker/a-full/build/meta/recipes-core/glibc/glibc_2.31.bb:do_fetch)
NOTE: recipe glibc-2.31+gitAUTOINC+6fdf971c9d-r0: task do_fetch: Started
NOTE: recipe automake-native-1.16.1-r0: task do_fetch: Succeeded
NOTE: Running task 204 of 841 (virtual:native:/home/pokybuild/yocto-worker/a-full/build/meta/recipes-devtools/python/python3_3.8.2.bb:do_fetch)
NOTE: recipe python3-native-3.8.2-r0: task do_fetch: Started
NOTE: recipe update-rc.d-native-0.8-r0: task do_fetch: Succeeded
NOTE: Running task 205 of 841 (virtual:native:/home/pokybuild/yocto-worker/a-full/build/meta/recipes-extended/xz/xz_5.2.4.bb:do_fetch)
NOTE: recipe xz-native-5.2.4-r0: task do_fetch: Started
NOTE: recipe autoconf-native-2.69-r11: task do_fetch: Succeeded
NOTE: Running task 206 of 841 (virtual:native:/home/pokybuild/yocto-worker/a-full/build/meta/recipes-devtools/opkg-utils/opkg-utils_0.4.2.bb:do_fetch)
NOTE: recipe opkg-utils-native-0.4.2-r0: task do_fetch: Started
NOTE: recipe opkg-utils-native-0.4.2-r0: task do_fetch: Succeeded
NOTE: Running task 207 of 841 (virtual:native:/home/pokybuild/yocto-worker/a-full/build/meta/recipes-devtools/dpkg/dpkg_1.19.7.bb:do_fetch)
NOTE: recipe dpkg-native-1.19.7-r0: task do_fetch: Started
NOTE: recipe dpkg-native-1.19.7-r0: task do_fetch: Succeeded
NOTE: Running task 208 of 841 (virtual:native:/home/pokybuild/yocto-worker/a-full/build/meta/recipes-devtools/dwarfsrcfiles/dwarfsrcfiles.bb:do_fetch)
NOTE: recipe dwarfsrcfiles-native-1.0-r0: task do_fetch: Started
NOTE: recipe dwarfsrcfiles-native-1.0-r0: task do_fetch: Succeeded
NOTE: Running task 209 of 841 (virtual:native:/home/pokybuild/yocto-worker/a-full/build/meta/recipes-devtools/rpm/rpm_4.14.2.1.bb:do_fetch)
NOTE: recipe rpm-native-1_4.14.2.1-r0: task do_fetch: Started
NOTE: recipe gnu-config-native-20200117+gitAUTOINC+5256817ace-r0: task do_fetch: Succeeded
NOTE: Running task 210 of 841 (/home/pokybuild/yocto-worker/a-full/build/meta/recipes-devtools/qemu/qemu-helper-native_1.0.bb:do_fetch)
NOTE: recipe qemu-helper-native-1.0-r1: task do_fetch: Started
NOTE: recipe qemu-helper-native-1.0-r1: task do_fetch: Succeeded
NOTE: Running task 211 of 841 (/home/pokybuild/yocto-worker/a-full/build/meta/recipes-devtools/qemu/qemu-native_4.2.0.bb:do_fetch)
NOTE: recipe qemu-native-4.2.0-r0: task do_fetch: Started
NOTE: recipe qemu-native-4.2.0-r0: task do_fetch: Succeeded
NOTE: Running task 212 of 841 (virtual:native:/home/pokybuild/yocto-worker/a-full/build/meta/recipes-extended/unzip/unzip_6.0.bb:do_fetch)
NOTE: recipe unzip-native-1_6.0-r5: task do_fetch: Started
NOTE: recipe gcc-source-9.3.0-9.3.0-r0: task do_fetch: Succeeded
NOTE: Running task 213 of 841 (virtual:native:/home/pokybuild/yocto-worker/a-full/build/meta/recipes-devtools/pseudo/pseudo_git.bb:do_fetch)
NOTE: recipe pseudo-native-1.9.0+gitAUTOINC+cca0d7f15b-r0: task do_fetch: Started
NOTE: recipe pseudo-native-1.9.0+gitAUTOINC+cca0d7f15b-r0: task do_fetch: Succeeded
NOTE: Running task 214 of 841 (/home/pokybuild/yocto-worker/a-full/build/meta/recipes-devtools/binutils/binutils-cross_2.34.bb:do_fetch)
NOTE: recipe binutils-cross-i686-2.34-r0: task do_fetch: Started
NOTE: recipe libtool-native-2.4.6-r0: task do_fetch: Succeeded
NOTE: Running task 215 of 841 (virtual:native:/home/pokybuild/yocto-worker/a-full/build/meta/recipes-devtools/patch/patch_2.7.6.bb:do_fetch)
NOTE: recipe patch-native-2.7.6-r0: task do_fetch: Started
NOTE: recipe gettext-0.20.1-r0: task do_fetch: Succeeded
NOTE: Running task 216 of 841 (/home/pokybuild/yocto-worker/a-full/build/meta/recipes-devtools/quilt/quilt-native_0.66.bb:do_fetch)
NOTE: recipe gettext-native-0.20.1-r0: task do_fetch: Succeeded
NOTE: Running task 217 of 841 (/home/pokybuild/yocto-worker/a-full/build/meta/recipes-devtools/dejagnu/dejagnu_1.6.2.bb:do_fetch)
NOTE: recipe quilt-native-0.66-r0: task do_fetch: Started
NOTE: recipe dejagnu-1.6.2-r0: task do_fetch: Started
NOTE: recipe unzip-native-1_6.0-r5: task do_fetch: Succeeded
NOTE: Running task 218 of 841 (/home/pokybuild/yocto-worker/a-full/build/meta/recipes-graphics/xorg-lib/xcb-util_0.4.0.bb:do_fetch)
NOTE: recipe xcb-util-0.4.0-r0: task do_fetch: Started
WARNING: python3-setuptools-native-45.2.0-r0 do_fetch: Failed to fetch URL https://files.pythonhosted.org/packages/source/s/setuptools/setuptools-45.2.0.zip, attempting MIRRORS if available
NOTE: recipe dejagnu-1.6.2-r0: task do_fetch: Succeeded
NOTE: Running task 219 of 841 (/home/pokybuild/yocto-worker/a-full/build/meta/recipes-extended/libmnl/libmnl_1.0.4.bb:do_fetch)
NOTE: recipe libmnl-1.0.4-r0: task do_fetch: Started
NOTE: recipe xz-native-5.2.4-r0: task do_fetch: Succeeded
NOTE: Running task 220 of 841 (/home/pokybuild/yocto-worker/a-full/build/meta/recipes-extended/libidn/libidn2_2.3.0.bb:do_fetch)
NOTE: recipe libidn2-2.3.0-r0: task do_fetch: Started
NOTE: recipe libidn2-2.3.0-r0: task do_fetch: Succeeded
NOTE: Running task 221 of 841 (/home/pokybuild/yocto-worker/a-full/build/meta/recipes-graphics/vulkan/vulkan-demos_git.bb:do_fetch)
NOTE: recipe vulkan-demos-git-r0: task do_fetch: Started
NOTE: recipe xcb-util-0.4.0-r0: task do_fetch: Succeeded
NOTE: Running task 222 of 841 (/home/pokybuild/yocto-worker/a-full/build/meta/recipes-devtools/mmc/mmc-utils_git.bb:do_fetch)
NOTE: recipe mmc-utils-0.1+gitAUTOINC+73d6c59af8-r0: task do_fetch: Started
NOTE: recipe quilt-native-0.66-r0: task do_fetch: Succeeded
NOTE: Running task 223 of 841 (/home/pokybuild/yocto-worker/a-full/build/meta/recipes-support/debianutils/debianutils_4.9.1.bb:do_fetch)
NOTE: recipe debianutils-4.9.1-r0: task do_fetch: Started
NOTE: recipe debianutils-4.9.1-r0: task do_fetch: Succeeded
NOTE: Running task 224 of 841 (/home/pokybuild/yocto-worker/a-full/build/build-st/meta-selftest/recipes-test/selftest-ed/selftest-ed_1.14.1.bb:do_fetch)
NOTE: recipe selftest-ed-1.14.1-r0: task do_fetch: Started
NOTE: recipe patch-native-2.7.6-r0: task do_fetch: Succeeded
NOTE: Running task 225 of 841 (/home/pokybuild/yocto-worker/a-full/build/meta/recipes-connectivity/nfs-utils/nfs-utils_2.4.3.bb:do_fetch)
NOTE: recipe nfs-utils-2.4.3-r0: task do_fetch: Started
NOTE: recipe libmnl-1.0.4-r0: task do_fetch: Succeeded
NOTE: Running task 226 of 841 (/home/pokybuild/yocto-worker/a-full/build/meta/recipes-graphics/xorg-lib/libxfixes_5.0.3.bb:do_fetch)
NOTE: recipe libxfixes-1_5.0.3-r0: task do_fetch: Started
NOTE: recipe libxfixes-1_5.0.3-r0: task do_fetch: Succeeded
NOTE: Running task 227 of 841 (/home/pokybuild/yocto-worker/a-full/build/meta/recipes-extended/perl/libxml-namespacesupport-perl_1.12.bb:do_fetch)
NOTE: recipe libxml-namespacesupport-perl-1.12-r0: task do_fetch: Started
NOTE: recipe libxml-namespacesupport-perl-1.12-r0: task do_fetch: Succeeded
NOTE: Running task 228 of 841 (/home/pokybuild/yocto-worker/a-full/build/meta/recipes-connectivity/ppp-dialin/ppp-dialin_0.1.bb:do_fetch)
NOTE: recipe ppp-dialin-0.1-r8: task do_fetch: Started
NOTE: recipe ppp-dialin-0.1-r8: task do_fetch: Succeeded
NOTE: Running task 229 of 841 (/home/pokybuild/yocto-worker/a-full/build/meta/recipes-devtools/python/python3-pycairo_1.19.0.bb:do_fetch)
NOTE: recipe python3-pycairo-1.19.0-r0: task do_fetch: Started
ERROR: python3-setuptools-native-45.2.0-r0 do_fetch: The URL: 'https://files.pythonhosted.org/packages/source/s/setuptools/setuptools-45.2.0.zip' is not trusted and cannot be used
ERROR: python3-setuptools-native-45.2.0-r0 do_fetch: Fetcher failure for URL: 'https://files.pythonhosted.org/packages/source/s/setuptools/setuptools-45.2.0.zip'. Unable to fetch URL from any source.
ERROR: Logfile of failure stored in: /home/pokybuild/yocto-worker/a-full/build/build-st/tmp/work/x86_64-linux/python3-setuptools-native/45.2.0-r0/temp/log.do_fetch.48297
NOTE: recipe python3-setuptools-native-45.2.0-r0: task do_fetch: Failed
ERROR: Task (virtual:native:/home/pokybuild/yocto-worker/a-full/build/meta/recipes-devtools/python/python3-setuptools_45.2.0.bb:do_fetch) failed with exit code '1'
NOTE: Running task 230 of 841 (/home/pokybuild/yocto-worker/a-full/build/meta/recipes-core/meta/meta-ide-support.bb:do_fetch)
NOTE: recipe meta-ide-support-1.0-r3: task do_fetch: Started
NOTE: recipe meta-ide-support-1.0-r3: task do_fetch: Succeeded
NOTE: recipe python3-native-3.8.2-r0: task do_fetch: Succeeded
WARNING: ovmf-native-edk2-stable201911-r0 do_fetch: Failed to fetch URL gitsm://github.com/tianocore/edk2.git;branch=master;protocol=git, attempting MIRRORS if available
ERROR: ovmf-native-edk2-stable201911-r0 do_fetch: The URL: 'gitsm://github.com/tianocore/edk2.git;branch=master;protocol=git' is not trusted and cannot be used
ERROR: ovmf-native-edk2-stable201911-r0 do_fetch: Fetcher failure for URL: 'gitsm://github.com/tianocore/edk2.git;branch=master;protocol=git'. Unable to fetch URL from any source.
ERROR: Logfile of failure stored in: /home/pokybuild/yocto-worker/a-full/build/build-st/tmp/work/x86_64-linux/ovmf-native/edk2-stable201911-r0/temp/log.do_fetch.45779
NOTE: recipe ovmf-native-edk2-stable201911-r0: task do_fetch: Failed
ERROR: Task (virtual:native:/home/pokybuild/yocto-worker/a-full/build/meta/recipes-core/ovmf/ovmf_git.bb:do_fetch) failed with exit code '1'
NOTE: recipe selftest-ed-1.14.1-r0: task do_fetch: Succeeded
NOTE: recipe mmc-utils-0.1+gitAUTOINC+73d6c59af8-r0: task do_fetch: Succeeded
NOTE: recipe nfs-utils-2.4.3-r0: task do_fetch: Succeeded
NOTE: recipe python3-pycairo-1.19.0-r0: task do_fetch: Succeeded
WARNING: llvm-native-9.0.1-r0 do_fetch: Failed to fetch URL git://github.com/llvm/llvm-project.git;branch=release/9.x, attempting MIRRORS if available
ERROR: llvm-native-9.0.1-r0 do_fetch: The URL: 'git://github.com/llvm/llvm-project.git;branch=release/9.x' is not trusted and cannot be used
ERROR: llvm-native-9.0.1-r0 do_fetch: Fetcher failure for URL: 'git://github.com/llvm/llvm-project.git;branch=release/9.x'. Unable to fetch URL from any source.
ERROR: Logfile of failure stored in: /home/pokybuild/yocto-worker/a-full/build/build-st/tmp/work/x86_64-linux/llvm-native/9.0.1-r0/temp/log.do_fetch.45656
NOTE: recipe llvm-native-9.0.1-r0: task do_fetch: Failed
ERROR: Task (virtual:native:/home/pokybuild/yocto-worker/a-full/build/meta/recipes-devtools/llvm/llvm_git.bb:do_fetch) failed with exit code '1'
NOTE: recipe u-boot-1_2020.01-r0: task do_fetch: Succeeded
NOTE: recipe rpm-native-1_4.14.2.1-r0: task do_fetch: Succeeded
WARNING: linux-yocto-5.4.69+gitAUTOINC+7f765dcb29_cfcdd63145-r0 do_fetch: Failed to fetch URL git://git.yoctoproject.org/linux-yocto.git;name=machine;branch=v5.4/standard/base;, attempting MIRRORS if available
NOTE: recipe glibc-2.31+gitAUTOINC+6fdf971c9d-r0: task do_fetch: Succeeded
NOTE: recipe cross-localedef-native-2.31+gitAUTOINC+6fdf971c9d_cd9f958c4c-r0: task do_fetch: Succeeded
NOTE: recipe binutils-native-2.34-r0: task do_fetch: Succeeded
NOTE: recipe binutils-cross-i686-2.34-r0: task do_fetch: Succeeded
NOTE: recipe vulkan-demos-git-r0: task do_fetch: Succeeded
NOTE: recipe linux-yocto-5.4.69+gitAUTOINC+7f765dcb29_cfcdd63145-r0: task do_fetch: Succeeded
NOTE: Tasks Summary: Attempted 230 tasks of which 0 didn't need to be rerun and 3 failed.
NOTE: The errors for this build are stored in /home/pokybuild/yocto-worker/a-full/build/build-st/tmp/log/error-report/error_report_20201203072644.txt
You can send the errors to a reports server by running:
send-error-report /home/pokybuild/yocto-worker/a-full/build/build-st/tmp/log/error-report/error_report_20201203072644.txt [-s server]
NOTE: The contents of these logs will be posted in public if you use the above command with the default server. Please ensure you remove any identifying or proprietary information when prompted before sending.
Summary: 3 tasks failed:
virtual:native:/home/pokybuild/yocto-worker/a-full/build/meta/recipes-devtools/python/python3-setuptools_45.2.0.bb:do_fetch
virtual:native:/home/pokybuild/yocto-worker/a-full/build/meta/recipes-core/ovmf/ovmf_git.bb:do_fetch
virtual:native:/home/pokybuild/yocto-worker/a-full/build/meta/recipes-devtools/llvm/llvm_git.bb:do_fetch
Summary: There were 9 WARNING messages shown.
Summary: There were 6 ERROR messages shown, returning a non-zero exit code.
2020-12-03 08:05:49,383 - oe-selftest - INFO - ======================================================================
2020-12-03 08:05:49,383 - oe-selftest - INFO - FAIL: test_yocto_source_mirror (buildoptions.SourceMirroring)
2020-12-03 08:05:49,383 - oe-selftest - INFO - ----------------------------------------------------------------------
2020-12-03 08:05:49,383 - oe-selftest - INFO - Traceback (most recent call last):
File "/home/pokybuild/yocto-worker/a-full/build/meta/lib/oeqa/selftest/cases/buildoptions.py", line 197, in test_yocto_source_mirror
bitbake("world --runall fetch")
File "/home/pokybuild/yocto-worker/a-full/build/meta/lib/oeqa/utils/commands.py", line 229, in bitbake
return runCmd(cmd, ignore_status, timeout, output_log=output_log, **options)
File "/home/pokybuild/yocto-worker/a-full/build/meta/lib/oeqa/utils/commands.py", line 207, in runCmd
raise AssertionError("Command '%s' returned non-zero exit status %d:\n%s" % (command, result.status, exc_output))
AssertionError: Command 'bitbake world --runall fetch' returned non-zero exit status 1:
Parsing recipes...done.
Parsing of 807 .bb files complete (0 cached, 807 parsed). 1358 targets, 45 skipped, 0 masked, 0 errors.
NOTE: Resolving any missing task queue dependencies
Build Configuration:
BB_VERSION = "1.46.0"
BUILD_SYS = "x86_64-linux"
NATIVELSBSTRING = "debian-10"
TARGET_SYS = "i686-poky-linux"
MACHINE = "qemux86"
DISTRO = "poky"
DISTRO_VERSION = "3.1.4"
TUNE_FEATURES = "m32 core2"
TARGET_FPU = ""
meta
meta-poky
meta-yocto-bsp = "stable/dunfell-nut:5070a3a8f4ffe39ad1e481458097fc5c62e08066"
meta-selftest = "master:4212e0d98299c3f76b7c0636044e7b3e562fd9ab"
NOTE: Fetching uninative binary shim http://downloads.yoctoproject.org/releases/uninative/2.9/x86_64-nativesdk-libc.tar.xz;sha256sum=d07916b95c419c81541a19c8ef0ed8cbd78ae18437ff28a4c8a60ef40518e423 (will check PREMIRRORS first)
Initialising tasks...done.
Sstate summary: Wanted 0 Found 0 Missed 0 Current 0 (0% match, 0% complete)
NOTE: No setscene tasks
NOTE: Executing Tasks
NOTE: Running task 1 of 841 (virtual:native:/home/pokybuild/yocto-worker/a-full/build/meta/recipes-graphics/xorg-lib/libxtst_1.2.3.bb:do_fetch)
NOTE: Running task 2 of 841 (virtual:native:/home/pokybuild/yocto-worker/a-full/build/meta/recipes-graphics/xorg-lib/libice_1.0.10.bb:do_fetch)
NOTE: Running task 3 of 841 (virtual:native:/home/pokybuild/yocto-worker/a-full/build/meta/recipes-graphics/xorg-proto/xcb-proto_1.13.bb:do_fetch)
NOTE: Running task 4 of 841 (virtual:native:/home/pokybuild/yocto-worker/a-full/build/meta/recipes-graphics/xorg-lib/libxdmcp_1.1.3.bb:do_fetch)
NOTE: Running task 5 of 841 (virtual:native:/home/pokybuild/yocto-worker/a-full/build/meta/recipes-graphics/xorg-lib/libxau_1.0.9.bb:do_fetch)
NOTE: Running task 6 of 841 (virtual:native:/home/pokybuild/yocto-worker/a-full/build/meta/recipes-graphics/xorg-lib/libpthread-stubs_0.4.bb:do_fetch)
NOTE: Running task 7 of 841 (virtual:native:/home/pokybuild/yocto-worker/a-full/build/meta/recipes-support/libunistring/libunistring_0.9.10.bb:do_fetch)
NOTE: Running task 8 of 841 (virtual:native:/home/pokybuild/yocto-worker/a-full/build/meta/recipes-extended/libidn/libidn2_2.3.0.bb:do_fetch)
NOTE: Running task 9 of 841 (virtual:native:/home/pokybuild/yocto-worker/a-full/build/meta/recipes-support/nettle/nettle_3.5.1.bb:do_fetch)
NOTE: Running task 10 of 841 (virtual:native:/home/pokybuild/yocto-worker/a-full/build/meta/recipes-support/atk/at-spi2-core_2.34.0.bb:do_fetch)
NOTE: Running task 11 of 841 (virtual:native:/home/pokybuild/yocto-worker/a-full/build/meta/recipes-graphics/xorg-lib/libxft_2.3.3.bb:do_fetch)
NOTE: Running task 12 of 841 (virtual:native:/home/pokybuild/yocto-worker/a-full/build/meta/recipes-graphics/harfbuzz/harfbuzz_2.6.4.bb:do_fetch)
NOTE: Running task 13 of 841 (virtual:native:/home/pokybuild/yocto-worker/a-full/build/meta/recipes-support/fribidi/fribidi_1.0.9.bb:do_fetch)
NOTE: Running task 14 of 841 (virtual:native:/home/pokybuild/yocto-worker/a-full/build/meta/recipes-graphics/xorg-lib/libsm_1.2.3.bb:do_fetch)
NOTE: Running task 15 of 841 (virtual:native:/home/pokybuild/yocto-worker/a-full/build/meta/recipes-graphics/xorg-lib/xtrans_1.4.0.bb:do_fetch)
NOTE: Running task 16 of 841 (virtual:native:/home/pokybuild/yocto-worker/a-full/build/meta/recipes-graphics/xorg-lib/libxcb_1.13.1.bb:do_fetch)
NOTE: recipe libxtst-native-1_1.2.3-r0: task do_fetch: Started
NOTE: recipe libice-native-1_1.0.10-r0: task do_fetch: Started
NOTE: recipe xcb-proto-native-1.13-r0: task do_fetch: Started
NOTE: recipe libunistring-native-0.9.10-r0: task do_fetch: Started
NOTE: recipe libxau-native-1_1.0.9-r0: task do_fetch: Started
NOTE: recipe libxdmcp-native-1_1.1.3-r0: task do_fetch: Started
NOTE: recipe libxft-native-1_2.3.3-r0: task do_fetch: Started
NOTE: recipe fribidi-native-1.0.9-r0: task do_fetch: Started
NOTE: recipe libpthread-stubs-native-0.4-r0: task do_fetch: Started
NOTE: recipe libsm-native-1_1.2.3-r0: task do_fetch: Started
NOTE: recipe nettle-native-3.5.1-r0: task do_fetch: Started
NOTE: recipe xtrans-native-1_1.4.0-r0: task do_fetch: Started
NOTE: recipe libidn2-native-2.3.0-r0: task do_fetch: Started
NOTE: recipe harfbuzz-native-2.6.4-r0: task do_fetch: Started
NOTE: recipe at-spi2-core-native-2.34.0-r0: task do_fetch: Started
NOTE: recipe libxcb-native-1.13.1-r0: task do_fetch: Started
NOTE: recipe libsm-native-1_1.2.3-r0: task do_fetch: Succeeded
NOTE: Running task 17 of 841 (virtual:native:/home/pokybuild/yocto-worker/a-full/build/meta/recipes-support/libcap/libcap_2.32.bb:do_fetch)
NOTE: recipe libcap-native-2.32-r0: task do_fetch: Started
NOTE: recipe fribidi-native-1.0.9-r0: task do_fetch: Succeeded
NOTE: Running task 18 of 841 (virtual:native:/home/pokybuild/yocto-worker/a-full/build/meta/recipes-support/libgpg-error/libgpg-error_1.37.bb:do_fetch)
NOTE: recipe libgpg-error-native-1.37-r0: task do_fetch: Started
NOTE: recipe libpthread-stubs-native-0.4-r0: task do_fetch: Succeeded
NOTE: Running task 19 of 841 (/home/pokybuild/yocto-worker/a-full/build/meta/recipes-core/glibc/cross-localedef-native_2.31.bb:do_fetch)
NOTE: recipe cross-localedef-native-2.31+gitAUTOINC+6fdf971c9d_cd9f958c4c-r0: task do_fetch: Started
NOTE: recipe libxdmcp-native-1_1.1.3-r0: task do_fetch: Succeeded
NOTE: Running task 20 of 841 (virtual:native:/home/pokybuild/yocto-worker/a-full/build/meta/recipes-devtools/libedit/libedit_20191231-3.1.bb:do_fetch)
NOTE: recipe libedit-native-20191231-3.1-r0: task do_fetch: Started
NOTE: recipe at-spi2-core-native-2.34.0-r0: task do_fetch: Succeeded
NOTE: Running task 21 of 841 (virtual:native:/home/pokybuild/yocto-worker/a-full/build/meta/recipes-support/libgcrypt/libgcrypt_1.8.5.bb:do_fetch)
NOTE: recipe libxft-native-1_2.3.3-r0: task do_fetch: Succeeded
NOTE: Running task 22 of 841 (virtual:native:/home/pokybuild/yocto-worker/a-full/build/meta/recipes-support/libassuan/libassuan_2.5.3.bb:do_fetch)
NOTE: recipe libice-native-1_1.0.10-r0: task do_fetch: Succeeded
NOTE: Running task 23 of 841 (virtual:native:/home/pokybuild/yocto-worker/a-full/build/meta/recipes-support/gnutls/gnutls_3.6.14.bb:do_fetch)
NOTE: recipe libgcrypt-native-1.8.5-r0: task do_fetch: Started
NOTE: recipe libassuan-native-2.5.3-r0: task do_fetch: Started
NOTE: recipe gnutls-native-3.6.14-r0: task do_fetch: Started
NOTE: recipe xtrans-native-1_1.4.0-r0: task do_fetch: Succeeded
NOTE: Running task 24 of 841 (virtual:native:/home/pokybuild/yocto-worker/a-full/build/meta/recipes-support/libksba/libksba_1.3.5.bb:do_fetch)
NOTE: recipe libksba-native-1.3.5-r0: task do_fetch: Started
NOTE: recipe xcb-proto-native-1.13-r0: task do_fetch: Succeeded
NOTE: Running task 25 of 841 (virtual:native:/home/pokybuild/yocto-worker/a-full/build/meta/recipes-support/npth/npth_1.6.bb:do_fetch)
NOTE: recipe npth-native-1.6-r0: task do_fetch: Started
NOTE: recipe libxtst-native-1_1.2.3-r0: task do_fetch: Succeeded
NOTE: Running task 26 of 841 (virtual:native:/home/pokybuild/yocto-worker/a-full/build/meta/recipes-kernel/dtc/dtc_1.6.0.bb:do_fetch)
NOTE: recipe dtc-native-1.6.0-r0: task do_fetch: Started
NOTE: recipe libxau-native-1_1.0.9-r0: task do_fetch: Succeeded
NOTE: Running task 27 of 841 (virtual:native:/home/pokybuild/yocto-worker/a-full/build/meta/recipes-graphics/xorg-lib/pixman_0.38.4.bb:do_fetch)
NOTE: recipe pixman-native-1_0.38.4-r0: task do_fetch: Started
NOTE: recipe libxcb-native-1.13.1-r0: task do_fetch: Succeeded
NOTE: Running task 28 of 841 (virtual:native:/home/pokybuild/yocto-worker/a-full/build/meta/recipes-multimedia/alsa/alsa-lib_1.2.1.2.bb:do_fetch)
NOTE: recipe alsa-lib-native-1.2.1.2-r0: task do_fetch: Started
NOTE: recipe libidn2-native-2.3.0-r0: task do_fetch: Succeeded
NOTE: Running task 29 of 841 (virtual:native:/home/pokybuild/yocto-worker/a-full/build/meta/recipes-graphics/libsdl2/libsdl2_2.0.12.bb:do_fetch)
NOTE: recipe libsdl2-native-2.0.12-r0: task do_fetch: Started
NOTE: recipe nettle-native-3.5.1-r0: task do_fetch: Succeeded
NOTE: Running task 30 of 841 (virtual:native:/home/pokybuild/yocto-worker/a-full/build/meta/recipes-support/libyaml/libyaml_0.2.2.bb:do_fetch)
NOTE: recipe libyaml-native-0.2.2-r0: task do_fetch: Started
NOTE: recipe libcap-native-2.32-r0: task do_fetch: Succeeded
NOTE: Running task 31 of 841 (virtual:native:/home/pokybuild/yocto-worker/a-full/build/meta/recipes-graphics/xorg-lib/libfontenc_1.1.4.bb:do_fetch)
NOTE: recipe libfontenc-native-1_1.1.4-r0: task do_fetch: Started
NOTE: recipe libedit-native-20191231-3.1-r0: task do_fetch: Succeeded
NOTE: Running task 32 of 841 (virtual:native:/home/pokybuild/yocto-worker/a-full/build/meta/recipes-graphics/freetype/freetype_2.10.1.bb:do_fetch)
NOTE: recipe freetype-native-2.10.1-r0: task do_fetch: Started
NOTE: recipe npth-native-1.6-r0: task do_fetch: Succeeded
NOTE: Running task 33 of 841 (virtual:native:/home/pokybuild/yocto-worker/a-full/build/meta/recipes-support/lzop/lzop_1.04.bb:do_fetch)
NOTE: recipe lzop-native-1.04-r0: task do_fetch: Started
NOTE: recipe libgpg-error-native-1.37-r0: task do_fetch: Succeeded
NOTE: Running task 34 of 841 (virtual:native:/home/pokybuild/yocto-worker/a-full/build/meta/recipes-support/libpcre/libpcre_8.44.bb:do_fetch)
NOTE: recipe libpcre-native-8.44-r0: task do_fetch: Started
NOTE: recipe pixman-native-1_0.38.4-r0: task do_fetch: Succeeded
NOTE: Running task 35 of 841 (virtual:native:/home/pokybuild/yocto-worker/a-full/build/meta/recipes-graphics/xorg-util/makedepend_1.0.6.bb:do_fetch)
NOTE: recipe makedepend-native-1_1.0.6-r0: task do_fetch: Started
NOTE: recipe libunistring-native-0.9.10-r0: task do_fetch: Succeeded
NOTE: Running task 36 of 841 (virtual:native:/home/pokybuild/yocto-worker/a-full/build/meta/recipes-devtools/chrpath/chrpath_0.16.bb:do_fetch)
NOTE: recipe chrpath-native-0.16-r0: task do_fetch: Started
NOTE: recipe libassuan-native-2.5.3-r0: task do_fetch: Succeeded
NOTE: Running task 37 of 841 (virtual:native:/home/pokybuild/yocto-worker/a-full/build/meta/recipes-devtools/autoconf-archive/autoconf-archive_2019.01.06.bb:do_fetch)
NOTE: recipe autoconf-archive-native-2019.01.06-r0: task do_fetch: Started
NOTE: recipe libksba-native-1.3.5-r0: task do_fetch: Succeeded
NOTE: Running task 38 of 841 (virtual:native:/home/pokybuild/yocto-worker/a-full/build/meta/recipes-support/lz4/lz4_1.9.2.bb:do_fetch)
NOTE: recipe lz4-native-1_1.9.2-r0: task do_fetch: Started
NOTE: recipe libgcrypt-native-1.8.5-r0: task do_fetch: Succeeded
NOTE: Running task 39 of 841 (virtual:native:/home/pokybuild/yocto-worker/a-full/build/meta/recipes-support/libcap-ng/libcap-ng_0.7.10.bb:do_fetch)
NOTE: recipe libcap-ng-native-0.7.10-r0: task do_fetch: Started
NOTE: recipe alsa-lib-native-1.2.1.2-r0: task do_fetch: Succeeded
NOTE: Running task 40 of 841 (virtual:native:/home/pokybuild/yocto-worker/a-full/build/meta/recipes-support/libpcre/libpcre2_10.34.bb:do_fetch)
NOTE: recipe libpcre2-native-10.34-r0: task do_fetch: Started
NOTE: recipe libfontenc-native-1_1.1.4-r0: task do_fetch: Succeeded
NOTE: Running task 41 of 841 (virtual:native:/home/pokybuild/yocto-worker/a-full/build/meta/recipes-support/attr/acl_2.2.53.bb:do_fetch)
NOTE: recipe acl-native-2.2.53-r0: task do_fetch: Started
NOTE: recipe libyaml-native-0.2.2-r0: task do_fetch: Succeeded
NOTE: Running task 42 of 841 (virtual:native:/home/pokybuild/yocto-worker/a-full/build/meta/recipes-support/lzo/lzo_2.10.bb:do_fetch)
NOTE: recipe lzo-native-2.10-r0: task do_fetch: Started
NOTE: recipe dtc-native-1.6.0-r0: task do_fetch: Succeeded
NOTE: Running task 43 of 841 (virtual:native:/home/pokybuild/yocto-worker/a-full/build/meta/recipes-support/libcroco/libcroco_0.6.13.bb:do_fetch)
NOTE: recipe libcroco-native-0.6.13-r0: task do_fetch: Started
NOTE: recipe chrpath-native-0.16-r0: task do_fetch: Succeeded
NOTE: Running task 44 of 841 (virtual:native:/home/pokybuild/yocto-worker/a-full/build/meta/recipes-support/atk/atk_2.34.1.bb:do_fetch)
NOTE: recipe autoconf-archive-native-2019.01.06-r0: task do_fetch: Succeeded
NOTE: Running task 45 of 841 (virtual:native:/home/pokybuild/yocto-worker/a-full/build/meta/recipes-support/atk/at-spi2-atk_2.34.1.bb:do_fetch)
NOTE: recipe at-spi2-atk-native-2.34.1-r0: task do_fetch: Started
NOTE: recipe atk-native-2.34.1-r0: task do_fetch: Started
NOTE: recipe lzop-native-1.04-r0: task do_fetch: Succeeded
NOTE: Running task 46 of 841 (virtual:native:/home/pokybuild/yocto-worker/a-full/build/meta/recipes-graphics/xorg-lib/libxcomposite_0.4.5.bb:do_fetch)
NOTE: recipe libxcomposite-native-1_0.4.5-r0: task do_fetch: Started
NOTE: recipe harfbuzz-native-2.6.4-r0: task do_fetch: Succeeded
NOTE: Running task 47 of 841 (virtual:native:/home/pokybuild/yocto-worker/a-full/build/meta/recipes-graphics/pango/pango_1.44.7.bb:do_fetch)
NOTE: recipe pango-native-1.44.7-r0: task do_fetch: Started
NOTE: recipe freetype-native-2.10.1-r0: task do_fetch: Succeeded
NOTE: Running task 48 of 841 (virtual:native:/home/pokybuild/yocto-worker/a-full/build/meta/recipes-graphics/xorg-lib/libxdamage_1.1.5.bb:do_fetch)
NOTE: recipe libxdamage-native-1_1.1.5-r0: task do_fetch: Started
NOTE: recipe makedepend-native-1_1.0.6-r0: task do_fetch: Succeeded
NOTE: Running task 49 of 841 (virtual:native:/home/pokybuild/yocto-worker/a-full/build/meta/recipes-graphics/xorg-lib/libxrandr_1.5.2.bb:do_fetch)
NOTE: recipe libxrandr-native-1_1.5.2-r0: task do_fetch: Started
NOTE: recipe libpcre-native-8.44-r0: task do_fetch: Succeeded
NOTE: Running task 50 of 841 (virtual:native:/home/pokybuild/yocto-worker/a-full/build/meta/recipes-multimedia/libpng/libpng_1.6.37.bb:do_fetch)
NOTE: recipe libpng-native-1.6.37-r0: task do_fetch: Started
NOTE: recipe libsdl2-native-2.0.12-r0: task do_fetch: Succeeded
NOTE: Running task 51 of 841 (virtual:native:/home/pokybuild/yocto-worker/a-full/build/meta/recipes-graphics/xorg-lib/libxext_1.3.4.bb:do_fetch)
NOTE: recipe libxext-native-1_1.3.4-r0: task do_fetch: Started
NOTE: recipe libcap-ng-native-0.7.10-r0: task do_fetch: Succeeded
NOTE: Running task 52 of 841 (virtual:native:/home/pokybuild/yocto-worker/a-full/build/meta/recipes-graphics/xorg-lib/libxfixes_5.0.3.bb:do_fetch)
NOTE: recipe libxfixes-native-1_5.0.3-r0: task do_fetch: Started
NOTE: recipe libcroco-native-0.6.13-r0: task do_fetch: Succeeded
NOTE: Running task 53 of 841 (virtual:native:/home/pokybuild/yocto-worker/a-full/build/meta/recipes-graphics/xorg-lib/libxcursor_1.2.0.bb:do_fetch)
NOTE: recipe libxcursor-native-1_1.2.0-r0: task do_fetch: Started
NOTE: recipe lzo-native-2.10-r0: task do_fetch: Succeeded
NOTE: Running task 54 of 841 (virtual:native:/home/pokybuild/yocto-worker/a-full/build/meta/recipes-graphics/xorg-lib/libxi_1.7.10.bb:do_fetch)
NOTE: recipe libxi-native-1_1.7.10-r0: task do_fetch: Started
NOTE: recipe at-spi2-atk-native-2.34.1-r0: task do_fetch: Succeeded
NOTE: Running task 55 of 841 (virtual:native:/home/pokybuild/yocto-worker/a-full/build/meta/recipes-graphics/fontconfig/fontconfig_2.13.1.bb:do_fetch)
NOTE: recipe fontconfig-native-2.13.1-r0: task do_fetch: Started
NOTE: recipe libxcomposite-native-1_0.4.5-r0: task do_fetch: Succeeded
NOTE: Running task 56 of 841 (virtual:native:/home/pokybuild/yocto-worker/a-full/build/meta/recipes-graphics/xorg-lib/libxrender_0.9.10.bb:do_fetch)
NOTE: recipe libxrender-native-1_0.9.10-r0: task do_fetch: Started
NOTE: recipe atk-native-2.34.1-r0: task do_fetch: Succeeded
NOTE: Running task 57 of 841 (virtual:native:/home/pokybuild/yocto-worker/a-full/build/meta/recipes-graphics/jpeg/libjpeg-turbo_2.0.4.bb:do_fetch)
NOTE: recipe libjpeg-turbo-native-1_2.0.4-r0: task do_fetch: Started
NOTE: recipe libxrandr-native-1_1.5.2-r0: task do_fetch: Succeeded
NOTE: Running task 58 of 841 (virtual:native:/home/pokybuild/yocto-worker/a-full/build/meta/recipes-graphics/cairo/cairo_1.16.0.bb:do_fetch)
NOTE: recipe cairo-native-1.16.0-r0: task do_fetch: Started
NOTE: recipe acl-native-2.2.53-r0: task do_fetch: Succeeded
NOTE: Running task 59 of 841 (virtual:native:/home/pokybuild/yocto-worker/a-full/build/meta/recipes-graphics/xorg-lib/libx11_1.6.9.bb:do_fetch)
NOTE: recipe libx11-native-1_1.6.9-r0: task do_fetch: Started
NOTE: recipe pango-native-1.44.7-r0: task do_fetch: Succeeded
NOTE: Running task 60 of 841 (virtual:native:/home/pokybuild/yocto-worker/a-full/build/meta/recipes-graphics/xorg-proto/xorgproto_2019.2.bb:do_fetch)
NOTE: recipe xorgproto-native-2019.2-r0: task do_fetch: Started
NOTE: recipe libxdamage-native-1_1.1.5-r0: task do_fetch: Succeeded
NOTE: Running task 61 of 841 (virtual:native:/home/pokybuild/yocto-worker/a-full/build/meta/recipes-support/gmp/gmp_6.2.0.bb:do_fetch)
NOTE: recipe gmp-native-6.2.0-r0: task do_fetch: Started
NOTE: recipe libpcre2-native-10.34-r0: task do_fetch: Succeeded
NOTE: Running task 62 of 841 (virtual:native:/home/pokybuild/yocto-worker/a-full/build/meta/recipes-support/libmpc/libmpc_1.1.0.bb:do_fetch)
NOTE: recipe libmpc-native-1.1.0-r0: task do_fetch: Started
NOTE: recipe libxext-native-1_1.3.4-r0: task do_fetch: Succeeded
NOTE: Running task 63 of 841 (virtual:native:/home/pokybuild/yocto-worker/a-full/build/meta/recipes-support/mpfr/mpfr_4.0.2.bb:do_fetch)
NOTE: recipe mpfr-native-4.0.2-r0: task do_fetch: Started
NOTE: recipe libxfixes-native-1_5.0.3-r0: task do_fetch: Succeeded
NOTE: Running task 64 of 841 (virtual:native:/home/pokybuild/yocto-worker/a-full/build/meta/recipes-devtools/make/make_4.3.bb:do_fetch)
NOTE: recipe make-native-4.3-r0: task do_fetch: Started
NOTE: recipe libxcursor-native-1_1.2.0-r0: task do_fetch: Succeeded
NOTE: Running noexec task 65 of 841 (/home/pokybuild/yocto-worker/a-full/build/meta/recipes-devtools/gcc/libgcc-initial_9.3.bb:do_fetch)
NOTE: Running task 66 of 841 (virtual:native:/home/pokybuild/yocto-worker/a-full/build/meta/recipes-extended/libnsl/libnsl2_git.bb:do_fetch)
NOTE: recipe libnsl2-native-1.2.0+gitAUTOINC+4a062cf418-r0: task do_fetch: Started
NOTE: recipe libpng-native-1.6.37-r0: task do_fetch: Succeeded
NOTE: Running task 67 of 841 (virtual:native:/home/pokybuild/yocto-worker/a-full/build/meta/recipes-core/readline/readline_8.0.bb:do_fetch)
NOTE: recipe readline-native-8.0-r0: task do_fetch: Started
NOTE: recipe libxi-native-1_1.7.10-r0: task do_fetch: Succeeded
NOTE: Running task 68 of 841 (virtual:native:/home/pokybuild/yocto-worker/a-full/build/meta/recipes-support/libffi/libffi_3.3.bb:do_fetch)
NOTE: recipe libffi-native-3.3-r0: task do_fetch: Started
NOTE: recipe gnutls-native-3.6.14-r0: task do_fetch: Succeeded
NOTE: Running task 69 of 841 (virtual:native:/home/pokybuild/yocto-worker/a-full/build/meta/recipes-extended/libtirpc/libtirpc_1.2.6.bb:do_fetch)
NOTE: recipe libtirpc-native-1.2.6-r0: task do_fetch: Started
NOTE: recipe libxrender-native-1_0.9.10-r0: task do_fetch: Succeeded
NOTE: Running task 70 of 841 (virtual:native:/home/pokybuild/yocto-worker/a-full/build/meta/recipes-support/gdbm/gdbm_1.18.1.bb:do_fetch)
NOTE: recipe gdbm-native-1.18.1-r0: task do_fetch: Started
NOTE: recipe xorgproto-native-2019.2-r0: task do_fetch: Succeeded
NOTE: Running task 71 of 841 (virtual:native:/home/pokybuild/yocto-worker/a-full/build/meta/recipes-support/popt/popt_1.16.bb:do_fetch)
NOTE: recipe popt-native-1.16-r3: task do_fetch: Started
NOTE: recipe libmpc-native-1.1.0-r0: task do_fetch: Succeeded
NOTE: Running task 72 of 841 (virtual:native:/home/pokybuild/yocto-worker/a-full/build/meta/recipes-devtools/elfutils/elfutils_0.178.bb:do_fetch)
NOTE: recipe elfutils-native-0.178-r0: task do_fetch: Started
NOTE: recipe libx11-native-1_1.6.9-r0: task do_fetch: Succeeded
NOTE: Running task 73 of 841 (virtual:native:/home/pokybuild/yocto-worker/a-full/build/meta/recipes-core/dbus/dbus_1.12.16.bb:do_fetch)
NOTE: recipe dbus-native-1.12.16-r0: task do_fetch: Started
NOTE: recipe gmp-native-6.2.0-r0: task do_fetch: Succeeded
NOTE: Running task 74 of 841 (virtual:native:/home/pokybuild/yocto-worker/a-full/build/meta/recipes-extended/libarchive/libarchive_3.4.2.bb:do_fetch)
NOTE: recipe libarchive-native-3.4.2-r0: task do_fetch: Started
NOTE: recipe fontconfig-native-2.13.1-r0: task do_fetch: Succeeded
NOTE: Running task 75 of 841 (virtual:native:/home/pokybuild/yocto-worker/a-full/build/meta/recipes-support/db/db_5.3.28.bb:do_fetch)
NOTE: recipe db-native-1_5.3.28-r1: task do_fetch: Started
NOTE: recipe mpfr-native-4.0.2-r0: task do_fetch: Succeeded
NOTE: Running task 76 of 841 (virtual:native:/home/pokybuild/yocto-worker/a-full/build/meta/recipes-support/curl/curl_7.69.1.bb:do_fetch)
NOTE: recipe curl-native-7.69.1-r0: task do_fetch: Started
NOTE: recipe libnsl2-native-1.2.0+gitAUTOINC+4a062cf418-r0: task do_fetch: Succeeded
NOTE: Running task 77 of 841 (virtual:native:/home/pokybuild/yocto-worker/a-full/build/meta/recipes-core/expat/expat_2.2.9.bb:do_fetch)
NOTE: recipe expat-native-2.2.9-r0: task do_fetch: Started
NOTE: recipe lz4-native-1_1.9.2-r0: task do_fetch: Succeeded
NOTE: Running task 78 of 841 (/home/pokybuild/yocto-worker/a-full/build/meta/recipes-core/gettext/gettext-minimal-native_0.20.1.bb:do_fetch)
NOTE: recipe gettext-minimal-native-0.20.1-r0: task do_fetch: Started
NOTE: recipe gettext-minimal-native-0.20.1-r0: task do_fetch: Succeeded
NOTE: Running task 79 of 841 (virtual:native:/home/pokybuild/yocto-worker/a-full/build/meta/recipes-support/sqlite/sqlite3_3.31.1.bb:do_fetch)
NOTE: recipe sqlite3-native-3_3.31.1-r0: task do_fetch: Started
NOTE: recipe make-native-4.3-r0: task do_fetch: Succeeded
NOTE: Running task 80 of 841 (virtual:native:/home/pokybuild/yocto-worker/a-full/build/meta/recipes-support/attr/attr_2.4.48.bb:do_fetch)
NOTE: recipe attr-native-2.4.48-r0: task do_fetch: Started
NOTE: recipe libffi-native-3.3-r0: task do_fetch: Succeeded
NOTE: Running task 81 of 841 (virtual:native:/home/pokybuild/yocto-worker/a-full/build/meta/recipes-support/pinentry/pinentry_1.1.0.bb:do_fetch)
NOTE: recipe pinentry-native-1.1.0-r0: task do_fetch: Started
NOTE: recipe libtirpc-native-1.2.6-r0: task do_fetch: Succeeded
NOTE: Running task 82 of 841 (virtual:native:/home/pokybuild/yocto-worker/a-full/build/meta/recipes-devtools/python/python3-pip_20.0.2.bb:do_fetch)
NOTE: recipe python3-pip-native-20.0.2-r0: task do_fetch: Started
NOTE: recipe gdbm-native-1.18.1-r0: task do_fetch: Succeeded
NOTE: Running task 83 of 841 (/home/pokybuild/yocto-worker/a-full/build/meta/recipes-bsp/u-boot/u-boot_2020.01.bb:do_fetch)
NOTE: recipe u-boot-1_2020.01-r0: task do_fetch: Started
NOTE: recipe readline-native-8.0-r0: task do_fetch: Succeeded
NOTE: Running task 84 of 841 (/home/pokybuild/yocto-worker/a-full/build/meta/recipes-devtools/pseudo/pseudo_git.bb:do_fetch)
NOTE: recipe pseudo-1.9.0+gitAUTOINC+cca0d7f15b-r0: task do_fetch: Started
NOTE: recipe popt-native-1.16-r3: task do_fetch: Succeeded
NOTE: Running task 85 of 841 (/home/pokybuild/yocto-worker/a-full/build/meta/recipes-devtools/pkgconfig/pkgconfig_git.bb:do_fetch)
NOTE: recipe pkgconfig-0.29.2+gitAUTOINC+edf8e6f0ea-r0: task do_fetch: Started
NOTE: recipe expat-native-2.2.9-r0: task do_fetch: Succeeded
NOTE: Running task 86 of 841 (/home/pokybuild/yocto-worker/a-full/build/meta/recipes-devtools/make/make_4.3.bb:do_fetch)
NOTE: recipe make-4.3-r0: task do_fetch: Started
NOTE: recipe make-4.3-r0: task do_fetch: Succeeded
NOTE: Running task 87 of 841 (virtual:native:/home/pokybuild/yocto-worker/a-full/build/meta/recipes-extended/perl/libxml-namespacesupport-perl_1.12.bb:do_fetch)
NOTE: recipe libxml-namespacesupport-perl-native-1.12-r0: task do_fetch: Started
NOTE: recipe dbus-native-1.12.16-r0: task do_fetch: Succeeded
NOTE: Running task 88 of 841 (virtual:native:/home/pokybuild/yocto-worker/a-full/build/meta/recipes-extended/bc/bc_1.07.1.bb:do_fetch)
NOTE: recipe bc-native-1.07.1-r0: task do_fetch: Started
NOTE: recipe attr-native-2.4.48-r0: task do_fetch: Succeeded
NOTE: Running task 89 of 841 (virtual:native:/home/pokybuild/yocto-worker/a-full/build/meta/recipes-extended/zip/zip_3.0.bb:do_fetch)
NOTE: recipe zip-native-3.0-r2: task do_fetch: Started
NOTE: recipe pinentry-native-1.1.0-r0: task do_fetch: Succeeded
NOTE: Running task 90 of 841 (virtual:native:/home/pokybuild/yocto-worker/a-full/build/meta/recipes-extended/cwautomacros/cwautomacros_20110201.bb:do_fetch)
NOTE: recipe cwautomacros-native-20110201-r0: task do_fetch: Started
NOTE: recipe python3-pip-native-20.0.2-r0: task do_fetch: Succeeded
NOTE: Running task 91 of 841 (virtual:native:/home/pokybuild/yocto-worker/a-full/build/meta/recipes-devtools/unfs3/unfs3_git.bb:do_fetch)
NOTE: recipe unfs3-native-0.9.22+AUTOINC+c12a5c69a8-r0: task do_fetch: Started
NOTE: recipe pseudo-1.9.0+gitAUTOINC+cca0d7f15b-r0: task do_fetch: Succeeded
NOTE: Running task 92 of 841 (/home/pokybuild/yocto-worker/a-full/build/meta/recipes-devtools/gdb/gdb-cross_9.1.bb:do_fetch)
NOTE: recipe libarchive-native-3.4.2-r0: task do_fetch: Succeeded
NOTE: Running task 93 of 841 (virtual:native:/home/pokybuild/yocto-worker/a-full/build/meta/recipes-support/gnutls/libtasn1_4.16.0.bb:do_fetch)
NOTE: recipe gdb-cross-i686-9.1-r0: task do_fetch: Started
NOTE: recipe libtasn1-native-4.16.0-r0: task do_fetch: Started
NOTE: recipe curl-native-7.69.1-r0: task do_fetch: Succeeded
NOTE: Running task 94 of 841 (virtual:native:/home/pokybuild/yocto-worker/a-full/build/meta/recipes-devtools/unifdef/unifdef_2.12.bb:do_fetch)
NOTE: recipe unifdef-native-2.12-r0: task do_fetch: Started
NOTE: recipe sqlite3-native-3_3.31.1-r0: task do_fetch: Succeeded
NOTE: Running task 95 of 841 (virtual:native:/home/pokybuild/yocto-worker/a-full/build/meta/recipes-devtools/rsync/rsync_3.1.3.bb:do_fetch)
NOTE: recipe rsync-native-3.1.3-r0: task do_fetch: Started
NOTE: recipe libxml-namespacesupport-perl-native-1.12-r0: task do_fetch: Succeeded
NOTE: Running task 96 of 841 (virtual:native:/home/pokybuild/yocto-worker/a-full/build/meta/recipes-devtools/llvm/llvm_git.bb:do_fetch)
NOTE: recipe llvm-native-9.0.1-r0: task do_fetch: Started
NOTE: recipe libjpeg-turbo-native-1_2.0.4-r0: task do_fetch: Succeeded
NOTE: Running task 97 of 841 (virtual:native:/home/pokybuild/yocto-worker/a-full/build/meta/recipes-core/coreutils/coreutils_8.31.bb:do_fetch)
NOTE: recipe coreutils-native-8.31-r0: task do_fetch: Started
NOTE: recipe bc-native-1.07.1-r0: task do_fetch: Succeeded
NOTE: Running task 98 of 841 (virtual:native:/home/pokybuild/yocto-worker/a-full/build/meta/recipes-support/gnupg/gnupg_2.2.20.bb:do_fetch)
NOTE: recipe elfutils-native-0.178-r0: task do_fetch: Succeeded
NOTE: Running task 99 of 841 (/home/pokybuild/yocto-worker/a-full/build/meta/recipes-extended/timezone/tzcode-native.bb:do_fetch)
NOTE: recipe tzcode-native-2020d-r0: task do_fetch: Started
NOTE: recipe gnupg-native-2.2.20-r0: task do_fetch: Started
NOTE: recipe zip-native-3.0-r2: task do_fetch: Succeeded
NOTE: Running task 100 of 841 (virtual:native:/home/pokybuild/yocto-worker/a-full/build/meta/recipes-devtools/file/file_5.38.bb:do_fetch)
NOTE: recipe file-native-5.38-r0: task do_fetch: Started
NOTE: recipe unifdef-native-2.12-r0: task do_fetch: Succeeded
NOTE: Running task 101 of 841 (virtual:native:/home/pokybuild/yocto-worker/a-full/build/meta/recipes-support/debianutils/debianutils_4.9.1.bb:do_fetch)
NOTE: recipe debianutils-native-4.9.1-r0: task do_fetch: Started
NOTE: recipe unfs3-native-0.9.22+AUTOINC+c12a5c69a8-r0: task do_fetch: Succeeded
NOTE: Running task 102 of 841 (virtual:native:/home/pokybuild/yocto-worker/a-full/build/meta/recipes-connectivity/openssl/openssl_1.1.1g.bb:do_fetch)
NOTE: recipe openssl-native-1.1.1g-r0: task do_fetch: Started
NOTE: recipe libtasn1-native-4.16.0-r0: task do_fetch: Succeeded
NOTE: Running task 103 of 841 (virtual:native:/home/pokybuild/yocto-worker/a-full/build/meta/recipes-gnome/gnome/gconf_3.2.6.bb:do_fetch)
NOTE: recipe gconf-native-3.2.6-r0: task do_fetch: Started
NOTE: recipe cwautomacros-native-20110201-r0: task do_fetch: Succeeded
NOTE: Running task 104 of 841 (virtual:native:/home/pokybuild/yocto-worker/a-full/build/meta/recipes-core/ovmf/ovmf_git.bb:do_fetch)
NOTE: recipe ovmf-native-edk2-stable201911-r0: task do_fetch: Started
NOTE: recipe rsync-native-3.1.3-r0: task do_fetch: Succeeded
NOTE: Running task 105 of 841 (virtual:native:/home/pokybuild/yocto-worker/a-full/build/meta/recipes-extended/acpica/acpica_20200430.bb:do_fetch)
NOTE: recipe acpica-native-20200430-r0: task do_fetch: Started
NOTE: recipe pkgconfig-0.29.2+gitAUTOINC+edf8e6f0ea-r0: task do_fetch: Succeeded
NOTE: Running task 106 of 841 (/home/pokybuild/yocto-worker/a-full/build/meta/recipes-devtools/qemu/qemu-system-native_4.2.0.bb:do_fetch)
NOTE: recipe qemu-system-native-4.2.0-r0: task do_fetch: Started
NOTE: recipe coreutils-native-8.31-r0: task do_fetch: Succeeded
NOTE: Running task 107 of 841 (/home/pokybuild/yocto-worker/a-full/build/meta/recipes-devtools/python/python3-scons-native_3.1.2.bb:do_fetch)
NOTE: recipe python3-scons-native-3.1.2-r0: task do_fetch: Started
NOTE: recipe debianutils-native-4.9.1-r0: task do_fetch: Succeeded
NOTE: Running task 108 of 841 (virtual:native:/home/pokybuild/yocto-worker/a-full/build/meta/recipes-devtools/python-numpy/python3-numpy_1.17.4.bb:do_fetch)
NOTE: recipe python3-numpy-native-1.17.4-r0: task do_fetch: Started
NOTE: recipe gnupg-native-2.2.20-r0: task do_fetch: Succeeded
NOTE: Running task 109 of 841 (virtual:native:/home/pokybuild/yocto-worker/a-full/build/meta/recipes-devtools/python/python3-six_1.14.0.bb:do_fetch)
NOTE: recipe python3-six-native-1.14.0-r0: task do_fetch: Started
NOTE: recipe gconf-native-3.2.6-r0: task do_fetch: Succeeded
NOTE: Running task 110 of 841 (virtual:native:/home/pokybuild/yocto-worker/a-full/build/meta/recipes-devtools/python/python3-mako_1.1.1.bb:do_fetch)
NOTE: recipe python3-mako-native-1.1.1-r0: task do_fetch: Started
NOTE: recipe acpica-native-20200430-r0: task do_fetch: Succeeded
NOTE: Running task 111 of 841 (virtual:native:/home/pokybuild/yocto-worker/a-full/build/meta/recipes-extended/rpcsvc-proto/rpcsvc-proto.bb:do_fetch)
NOTE: recipe rpcsvc-proto-native-1.4+gitAUTOINC+9bc3b5b785-r0: task do_fetch: Started
NOTE: recipe python3-numpy-native-1.17.4-r0: task do_fetch: Succeeded
NOTE: Running task 112 of 841 (virtual:native:/home/pokybuild/yocto-worker/a-full/build/meta/recipes-extended/asciidoc/asciidoc_8.6.9.bb:do_fetch)
NOTE: recipe asciidoc-native-8.6.9+py3-gitAUTOINC+618f6e6f6b-r0: task do_fetch: Started
NOTE: recipe python3-six-native-1.14.0-r0: task do_fetch: Succeeded
NOTE: Running task 113 of 841 (virtual:native:/home/pokybuild/yocto-worker/a-full/build/meta/recipes-graphics/xorg-font/font-util_1.3.2.bb:do_fetch)
NOTE: recipe font-util-native-1.3.2-r0: task do_fetch: Started
NOTE: recipe tzcode-native-2020d-r0: task do_fetch: Succeeded
NOTE: Running task 114 of 841 (virtual:native:/home/pokybuild/yocto-worker/a-full/build/meta/recipes-support/icu/icu_66.1.bb:do_fetch)
NOTE: recipe icu-native-66.1-r0: task do_fetch: Started
NOTE: recipe rpcsvc-proto-native-1.4+gitAUTOINC+9bc3b5b785-r0: task do_fetch: Succeeded
NOTE: Running task 115 of 841 (virtual:native:/home/pokybuild/yocto-worker/a-full/build/meta/recipes-extended/groff/groff_1.22.4.bb:do_fetch)
NOTE: recipe openssl-native-1.1.1g-r0: task do_fetch: Succeeded
NOTE: Running task 116 of 841 (virtual:native:/home/pokybuild/yocto-worker/a-full/build/meta/recipes-devtools/orc/orc_0.4.31.bb:do_fetch)
NOTE: recipe groff-native-1.22.4-r0: task do_fetch: Started
NOTE: recipe orc-native-0.4.31-r0: task do_fetch: Started
NOTE: recipe python3-mako-native-1.1.1-r0: task do_fetch: Succeeded
NOTE: Running task 117 of 841 (virtual:native:/home/pokybuild/yocto-worker/a-full/build/meta/recipes-graphics/wayland/wayland_1.18.0.bb:do_fetch)
NOTE: recipe wayland-native-1.18.0-r0: task do_fetch: Started
NOTE: recipe python3-scons-native-3.1.2-r0: task do_fetch: Succeeded
NOTE: Running task 118 of 841 (/home/pokybuild/yocto-worker/a-full/build/meta/recipes-graphics/libsdl2/libsdl2_2.0.12.bb:do_fetch)
NOTE: recipe libsdl2-2.0.12-r0: task do_fetch: Started
NOTE: recipe libsdl2-2.0.12-r0: task do_fetch: Succeeded
NOTE: Running task 119 of 841 (virtual:native:/home/pokybuild/yocto-worker/a-full/build/meta/recipes-extended/cracklib/cracklib_2.9.5.bb:do_fetch)
NOTE: recipe cracklib-native-2.9.5-r0: task do_fetch: Started
NOTE: recipe db-native-1_5.3.28-r1: task do_fetch: Succeeded
NOTE: Running task 120 of 841 (virtual:native:/home/pokybuild/yocto-worker/a-full/build/meta/recipes-devtools/ruby/ruby_2.7.1.bb:do_fetch)
NOTE: recipe ruby-native-2.7.1-r0: task do_fetch: Started
NOTE: recipe font-util-native-1.3.2-r0: task do_fetch: Succeeded
NOTE: Running task 121 of 841 (virtual:native:/home/pokybuild/yocto-worker/a-full/build/meta/recipes-devtools/desktop-file-utils/desktop-file-utils_0.24.bb:do_fetch)
NOTE: recipe desktop-file-utils-native-0.24-r0: task do_fetch: Started
NOTE: recipe gdb-cross-i686-9.1-r0: task do_fetch: Succeeded
NOTE: Running task 122 of 841 (virtual:native:/home/pokybuild/yocto-worker/a-full/build/meta/recipes-extended/lzip/lzip_1.21.bb:do_fetch)
NOTE: recipe lzip-native-1.21-r0: task do_fetch: Started
NOTE: recipe orc-native-0.4.31-r0: task do_fetch: Succeeded
NOTE: Running task 123 of 841 (/home/pokybuild/yocto-worker/a-full/build/meta/recipes-support/boost/bjam-native_1.72.0.bb:do_fetch)
NOTE: recipe bjam-native-1.72.0-r0: task do_fetch: Started
NOTE: recipe wayland-native-1.18.0-r0: task do_fetch: Succeeded
NOTE: Running task 124 of 841 (virtual:native:/home/pokybuild/yocto-worker/a-full/build/meta/recipes-extended/bzip2/bzip2_1.0.8.bb:do_fetch)
NOTE: recipe cracklib-native-2.9.5-r0: task do_fetch: Succeeded
NOTE: Running task 125 of 841 (/home/pokybuild/yocto-worker/a-full/build/meta/recipes-devtools/go/go-runtime_1.14.bb:do_fetch)
NOTE: recipe go-runtime-1.14.7-r0: task do_fetch: Started
NOTE: recipe bzip2-native-1.0.8-r0: task do_fetch: Started
NOTE: recipe groff-native-1.22.4-r0: task do_fetch: Succeeded
NOTE: Running task 126 of 841 (virtual:native:/home/pokybuild/yocto-worker/a-full/build/meta/recipes-extended/texinfo/texinfo_6.7.bb:do_fetch)
NOTE: recipe texinfo-native-6.7-r0: task do_fetch: Started
NOTE: recipe desktop-file-utils-native-0.24-r0: task do_fetch: Succeeded
NOTE: Running task 127 of 841 (virtual:native:/home/pokybuild/yocto-worker/a-full/build/meta/recipes-devtools/tcltk/tcl_8.6.10.bb:do_fetch)
NOTE: recipe tcl-native-8.6.10-r0: task do_fetch: Started
NOTE: recipe lzip-native-1.21-r0: task do_fetch: Succeeded
NOTE: Running task 128 of 841 (/home/pokybuild/yocto-worker/a-full/build/meta/recipes-kernel/kern-tools/kern-tools-native_git.bb:do_fetch)
NOTE: recipe kern-tools-native-0.2+gitAUTOINC+c66833e1ca-r12: task do_fetch: Started
NOTE: recipe asciidoc-native-8.6.9+py3-gitAUTOINC+618f6e6f6b-r0: task do_fetch: Succeeded
NOTE: Running task 129 of 841 (virtual:native:/home/pokybuild/yocto-worker/a-full/build/meta/recipes-core/ncurses/ncurses_6.2.bb:do_fetch)
NOTE: recipe ncurses-native-6.2-r0: task do_fetch: Started
NOTE: recipe file-native-5.38-r0: task do_fetch: Succeeded
NOTE: Running task 130 of 841 (virtual:native:/home/pokybuild/yocto-worker/a-full/build/meta/recipes-support/re2c/re2c_1.0.1.bb:do_fetch)
NOTE: recipe re2c-native-1.0.1-r0: task do_fetch: Started
NOTE: recipe kern-tools-native-0.2+gitAUTOINC+c66833e1ca-r12: task do_fetch: Succeeded
NOTE: Running task 131 of 841 (/home/pokybuild/yocto-worker/a-full/build/meta/recipes-devtools/go/go-cross_1.14.bb:do_fetch)
NOTE: recipe go-cross-core2-32-1.14.7-r0: task do_fetch: Started
NOTE: recipe cairo-native-1.16.0-r0: task do_fetch: Succeeded
NOTE: Running task 132 of 841 (/home/pokybuild/yocto-worker/a-full/build/meta/recipes-devtools/go/go-native_1.14.bb:do_fetch)
NOTE: recipe go-native-1.14.7-r0: task do_fetch: Started
NOTE: recipe texinfo-native-6.7-r0: task do_fetch: Succeeded
NOTE: Running task 133 of 841 (virtual:native:/home/pokybuild/yocto-worker/a-full/build/meta/recipes-devtools/python/python3-pbr_5.4.4.bb:do_fetch)
NOTE: recipe python3-pbr-native-5.4.4-r0: task do_fetch: Started
NOTE: recipe tcl-native-8.6.10-r0: task do_fetch: Succeeded
NOTE: Running task 134 of 841 (virtual:native:/home/pokybuild/yocto-worker/a-full/build/meta/recipes-devtools/nasm/nasm_2.15.03.bb:do_fetch)
NOTE: recipe nasm-native-2.15.03-r0: task do_fetch: Started
NOTE: recipe bzip2-native-1.0.8-r0: task do_fetch: Succeeded
NOTE: Running task 135 of 841 (virtual:native:/home/pokybuild/yocto-worker/a-full/build/meta/recipes-devtools/binutils/binutils_2.34.bb:do_fetch)
NOTE: recipe binutils-native-2.34-r0: task do_fetch: Started
NOTE: recipe ruby-native-2.7.1-r0: task do_fetch: Succeeded
NOTE: Running task 136 of 841 (virtual:native:/home/pokybuild/yocto-worker/a-full/build/meta/recipes-devtools/expect/expect_5.45.4.bb:do_fetch)
NOTE: recipe expect-native-5.45.4-r0: task do_fetch: Started
NOTE: recipe re2c-native-1.0.1-r0: task do_fetch: Succeeded
NOTE: Running task 137 of 841 (virtual:native:/home/pokybuild/yocto-worker/a-full/build/meta/recipes-core/zlib/zlib_1.2.11.bb:do_fetch)
NOTE: recipe zlib-native-1.2.11-r0: task do_fetch: Started
NOTE: recipe go-runtime-1.14.7-r0: task do_fetch: Succeeded
NOTE: Running task 138 of 841 (/home/pokybuild/yocto-worker/a-full/build/meta/recipes-kernel/kmod/kmod-native_git.bb:do_fetch)
NOTE: recipe go-cross-core2-32-1.14.7-r0: task do_fetch: Succeeded
NOTE: Running task 139 of 841 (virtual:native:/home/pokybuild/yocto-worker/a-full/build/meta/recipes-extended/gperf/gperf_3.1.bb:do_fetch)
NOTE: recipe kmod-native-26-r0: task do_fetch: Started
NOTE: recipe gperf-native-3.1-r0: task do_fetch: Started
NOTE: recipe python3-pbr-native-5.4.4-r0: task do_fetch: Succeeded
NOTE: Running task 140 of 841 (virtual:native:/home/pokybuild/yocto-worker/a-full/build/meta/recipes-graphics/xorg-app/mkfontscale_1.2.1.bb:do_fetch)
NOTE: recipe mkfontscale-native-1.2.1-r0: task do_fetch: Started
NOTE: recipe nasm-native-2.15.03-r0: task do_fetch: Succeeded
NOTE: Running task 141 of 841 (virtual:native:/home/pokybuild/yocto-worker/a-full/build/meta/recipes-devtools/xmlto/xmlto_0.0.28.bb:do_fetch)
NOTE: recipe xmlto-native-0.0.28-r0: task do_fetch: Started
NOTE: recipe expect-native-5.45.4-r0: task do_fetch: Succeeded
NOTE: Running task 142 of 841 (virtual:native:/home/pokybuild/yocto-worker/a-full/build/meta/recipes-extended/ghostscript/ghostscript_9.52.bb:do_fetch)
NOTE: recipe ghostscript-native-9.52-r0: task do_fetch: Started
NOTE: recipe ncurses-native-6.2-r0: task do_fetch: Succeeded
NOTE: Running task 143 of 841 (virtual:native:/home/pokybuild/yocto-worker/a-full/build/meta/recipes-support/itstool/itstool_2.0.6.bb:do_fetch)
NOTE: recipe itstool-native-2.0.6-r0: task do_fetch: Started
NOTE: recipe zlib-native-1.2.11-r0: task do_fetch: Succeeded
NOTE: Running task 144 of 841 (virtual:native:/home/pokybuild/yocto-worker/a-full/build/meta/recipes-support/shared-mime-info/shared-mime-info_git.bb:do_fetch)
NOTE: recipe shared-mime-info-native-1.15-r0: task do_fetch: Started
NOTE: recipe gperf-native-3.1-r0: task do_fetch: Succeeded
NOTE: Running task 145 of 841 (virtual:native:/home/pokybuild/yocto-worker/a-full/build/meta/recipes-devtools/intltool/intltool_0.51.0.bb:do_fetch)
NOTE: recipe intltool-native-0.51.0-r0: task do_fetch: Started
NOTE: recipe mkfontscale-native-1.2.1-r0: task do_fetch: Succeeded
NOTE: Running task 146 of 841 (virtual:native:/home/pokybuild/yocto-worker/a-full/build/meta/recipes-graphics/xorg-util/util-macros_1.19.2.bb:do_fetch)
NOTE: recipe util-macros-native-1_1.19.2-r0: task do_fetch: Started
NOTE: recipe xmlto-native-0.0.28-r0: task do_fetch: Succeeded
NOTE: Running task 147 of 841 (virtual:native:/home/pokybuild/yocto-worker/a-full/build/meta/recipes-devtools/swig/swig_3.0.12.bb:do_fetch)
NOTE: recipe swig-native-3.0.12-r0: task do_fetch: Started
NOTE: recipe itstool-native-2.0.6-r0: task do_fetch: Succeeded
NOTE: Running task 148 of 841 (virtual:native:/home/pokybuild/yocto-worker/a-full/build/meta/recipes-devtools/docbook-xml/docbook-xml-dtd4_4.5.bb:do_fetch)
NOTE: recipe docbook-xml-dtd4-native-4.5-r0: task do_fetch: Started
NOTE: recipe intltool-native-0.51.0-r0: task do_fetch: Succeeded
NOTE: Running task 149 of 841 (virtual:native:/home/pokybuild/yocto-worker/a-full/build/meta/recipes-support/libxslt/libxslt_1.1.34.bb:do_fetch)
NOTE: recipe libxslt-native-1.1.34-r0: task do_fetch: Started
NOTE: recipe util-macros-native-1_1.19.2-r0: task do_fetch: Succeeded
NOTE: Running task 150 of 841 (virtual:native:/home/pokybuild/yocto-worker/a-full/build/meta/recipes-core/libxml/libxml2_2.9.10.bb:do_fetch)
NOTE: recipe libxml2-native-2.9.10-r0: task do_fetch: Started
NOTE: recipe docbook-xml-dtd4-native-4.5-r0: task do_fetch: Succeeded
NOTE: Running task 151 of 841 (virtual:native:/home/pokybuild/yocto-worker/a-full/build/meta/recipes-devtools/docbook-xml/docbook-xsl-stylesheets_1.79.1.bb:do_fetch)
NOTE: recipe docbook-xsl-stylesheets-native-1.79.1-r0: task do_fetch: Started
NOTE: recipe go-native-1.14.7-r0: task do_fetch: Succeeded
NOTE: Running task 152 of 841 (/home/pokybuild/yocto-worker/a-full/build/meta/recipes-kernel/linux/linux-yocto_5.4.bb:do_fetch)
NOTE: recipe linux-yocto-5.4.69+gitAUTOINC+7f765dcb29_cfcdd63145-r0: task do_fetch: Started
NOTE: recipe swig-native-3.0.12-r0: task do_fetch: Succeeded
NOTE: Running task 153 of 841 (virtual:native:/home/pokybuild/yocto-worker/a-full/build/meta/recipes-devtools/perl/libxml-parser-perl_2.46.bb:do_fetch)
NOTE: recipe libxml-parser-perl-native-2.46-r0: task do_fetch: Started
NOTE: recipe libxslt-native-1.1.34-r0: task do_fetch: Succeeded
NOTE: Running task 154 of 841 (/home/pokybuild/yocto-worker/a-full/build/meta/recipes-devtools/gcc/gcc-source_9.3.bb:do_fetch)
NOTE: recipe gcc-source-9.3.0-9.3.0-r0: task do_fetch: Started
NOTE: recipe libxml-parser-perl-native-2.46-r0: task do_fetch: Succeeded
NOTE: Running task 155 of 841 (virtual:native:/home/pokybuild/yocto-worker/a-full/build/meta/recipes-devtools/vala/vala_0.46.6.bb:do_fetch)
NOTE: recipe vala-native-0.46.6-r0: task do_fetch: Started
NOTE: recipe kmod-native-26-r0: task do_fetch: Succeeded
NOTE: Running task 156 of 841 (virtual:native:/home/pokybuild/yocto-worker/a-full/build/meta/recipes-core/glib-2.0/glib-2.0_2.62.6.bb:do_fetch)
NOTE: recipe glib-2.0-native-1_2.62.6-r0: task do_fetch: Started
NOTE: recipe libxml2-native-2.9.10-r0: task do_fetch: Succeeded
NOTE: Running task 157 of 841 (/home/pokybuild/yocto-worker/a-full/build/meta/recipes-core/libxcrypt/libxcrypt_4.4.15.bb:do_fetch)
NOTE: recipe libxcrypt-4.4.15-r0: task do_fetch: Started
NOTE: recipe qemu-system-native-4.2.0-r0: task do_fetch: Succeeded
NOTE: Running task 158 of 841 (/home/pokybuild/yocto-worker/a-full/build/meta/recipes-graphics/mesa/mesa_20.0.2.bb:do_fetch)
NOTE: recipe mesa-2_20.0.2-r0: task do_fetch: Started
NOTE: recipe vala-native-0.46.6-r0: task do_fetch: Succeeded
NOTE: Running task 159 of 841 (virtual:native:/home/pokybuild/yocto-worker/a-full/build/meta/recipes-devtools/prelink/prelink_git.bb:do_fetch)
NOTE: recipe prelink-native-1.0+gitAUTOINC+f9975537db-r0: task do_fetch: Started
NOTE: recipe docbook-xsl-stylesheets-native-1.79.1-r0: task do_fetch: Succeeded
NOTE: Running task 160 of 841 (virtual:native:/home/pokybuild/yocto-worker/a-full/build/meta/recipes-devtools/meson/meson_0.53.2.bb:do_fetch)
NOTE: recipe meson-native-0.53.2-r0: task do_fetch: Started
NOTE: recipe glib-2.0-native-1_2.62.6-r0: task do_fetch: Succeeded
NOTE: Running task 161 of 841 (virtual:native:/home/pokybuild/yocto-worker/a-full/build/meta/recipes-gnome/gobject-introspection/gobject-introspection_1.62.0.bb:do_fetch)
NOTE: recipe gobject-introspection-native-1.62.0-r0: task do_fetch: Started
NOTE: recipe ghostscript-native-9.52-r0: task do_fetch: Succeeded
NOTE: Running task 162 of 841 (virtual:native:/home/pokybuild/yocto-worker/a-full/build/meta/recipes-core/dbus/dbus-glib_0.110.bb:do_fetch)
NOTE: recipe dbus-glib-native-0.110-r0: task do_fetch: Started
WARNING: mesa-2_20.0.2-r0 do_fetch: Failed to fetch URL https://mesa.freedesktop.org/archive/mesa-20.0.2.tar.xz, attempting MIRRORS if available
NOTE: recipe shared-mime-info-native-1.15-r0: task do_fetch: Succeeded
NOTE: Running task 163 of 841 (virtual:native:/home/pokybuild/yocto-worker/a-full/build/meta/recipes-devtools/perl/perl_5.30.1.bb:do_fetch)
NOTE: recipe perl-native-5.30.1-r0: task do_fetch: Started
NOTE: recipe libxcrypt-4.4.15-r0: task do_fetch: Succeeded
NOTE: Running task 164 of 841 (virtual:native:/home/pokybuild/yocto-worker/a-full/build/meta/recipes-devtools/e2fsprogs/e2fsprogs_1.45.4.bb:do_fetch)
NOTE: recipe e2fsprogs-native-1.45.4-r0: task do_fetch: Started
NOTE: recipe icu-native-66.1-r0: task do_fetch: Succeeded
NOTE: Running task 165 of 841 (virtual:native:/home/pokybuild/yocto-worker/a-full/build/meta/recipes-devtools/squashfs-tools/squashfs-tools_git.bb:do_fetch)
NOTE: recipe squashfs-tools-native-4.4-r0: task do_fetch: Started
NOTE: recipe dbus-glib-native-0.110-r0: task do_fetch: Succeeded
NOTE: Running task 166 of 841 (virtual:native:/home/pokybuild/yocto-worker/a-full/build/meta/recipes-devtools/dosfstools/dosfstools_4.1.bb:do_fetch)
NOTE: recipe dosfstools-native-4.1-r0: task do_fetch: Started
WARNING: prelink-native-1.0+gitAUTOINC+f9975537db-r0 do_fetch: Failed to fetch URL git://git.yoctoproject.org/prelink-cross.git;branch=cross_prelink_staging, attempting MIRRORS if available
WARNING: meson-native-0.53.2-r0 do_fetch: Failed to fetch URL https://github.com/mesonbuild/meson/releases/download/0.53.2/meson-0.53.2.tar.gz, attempting MIRRORS if available
NOTE: recipe gobject-introspection-native-1.62.0-r0: task do_fetch: Succeeded
NOTE: Running task 167 of 841 (virtual:native:/home/pokybuild/yocto-worker/a-full/build/meta/recipes-core/util-linux/util-linux_2.35.1.bb:do_fetch)
NOTE: recipe util-linux-native-2.35.1-r0: task do_fetch: Started
NOTE: recipe dosfstools-native-4.1-r0: task do_fetch: Succeeded
NOTE: Running task 168 of 841 (virtual:native:/home/pokybuild/yocto-worker/a-full/build/meta/recipes-devtools/fdisk/gptfdisk_1.0.4.bb:do_fetch)
NOTE: recipe gptfdisk-native-1.0.4-r0: task do_fetch: Started
WARNING: squashfs-tools-native-4.4-r0 do_fetch: Failed to fetch URL git://github.com/plougher/squashfs-tools.git;protocol=https, attempting MIRRORS if available
NOTE: recipe bjam-native-1.72.0-r0: task do_fetch: Succeeded
NOTE: Running task 169 of 841 (virtual:native:/home/pokybuild/yocto-worker/a-full/build/meta/recipes-devtools/btrfs-tools/btrfs-tools_5.4.1.bb:do_fetch)
NOTE: recipe btrfs-tools-native-5.4.1-r0: task do_fetch: Started
NOTE: recipe meson-native-0.53.2-r0: task do_fetch: Succeeded
NOTE: Running task 170 of 841 (virtual:native:/home/pokybuild/yocto-worker/a-full/build/meta/recipes-extended/parted/parted_3.3.bb:do_fetch)
NOTE: recipe parted-native-3.3-r0: task do_fetch: Started
NOTE: recipe util-linux-native-2.35.1-r0: task do_fetch: Succeeded
NOTE: Running task 171 of 841 (/home/pokybuild/yocto-worker/a-full/build/meta/recipes-devtools/cdrtools/cdrtools-native_3.01.bb:do_fetch)
NOTE: recipe cdrtools-native-3.01-r0: task do_fetch: Started
NOTE: recipe prelink-native-1.0+gitAUTOINC+f9975537db-r0: task do_fetch: Succeeded
NOTE: Running task 172 of 841 (virtual:native:/home/pokybuild/yocto-worker/a-full/build/meta/recipes-devtools/mtools/mtools_4.0.23.bb:do_fetch)
NOTE: recipe mtools-native-4.0.23-r0: task do_fetch: Started
NOTE: recipe parted-native-3.3-r0: task do_fetch: Succeeded
NOTE: Running task 173 of 841 (virtual:native:/home/pokybuild/yocto-worker/a-full/build/meta/recipes-support/bmap-tools/bmap-tools_3.5.bb:do_fetch)
NOTE: recipe bmap-tools-native-3.5+gitAUTOINC+db7087b883-r0: task do_fetch: Started
NOTE: recipe mesa-2_20.0.2-r0: task do_fetch: Succeeded
NOTE: Running task 174 of 841 (virtual:native:/home/pokybuild/yocto-worker/a-full/build/meta/recipes-devtools/syslinux/syslinux_6.04-pre2.bb:do_fetch)
NOTE: recipe syslinux-native-6.04-pre2-r0: task do_fetch: Started
NOTE: recipe gptfdisk-native-1.0.4-r0: task do_fetch: Succeeded
NOTE: Running task 175 of 841 (virtual:native:/home/pokybuild/yocto-worker/a-full/build/meta/recipes-bsp/grub/grub-efi_2.04.bb:do_fetch)
NOTE: recipe grub-efi-native-2.04-r0: task do_fetch: Started
NOTE: recipe mtools-native-4.0.23-r0: task do_fetch: Succeeded
NOTE: Running task 176 of 841 (virtual:native:/home/pokybuild/yocto-worker/a-full/build/meta/recipes-gnome/librsvg/librsvg_2.40.21.bb:do_fetch)
NOTE: recipe librsvg-native-2.40.21-r0: task do_fetch: Started
NOTE: recipe cdrtools-native-3.01-r0: task do_fetch: Succeeded
NOTE: recipe bmap-tools-native-3.5+gitAUTOINC+db7087b883-r0: task do_fetch: Succeeded
NOTE: Running task 177 of 841 (virtual:native:/home/pokybuild/yocto-worker/a-full/build/meta/recipes-gnome/gdk-pixbuf/gdk-pixbuf_2.40.0.bb:do_fetch)
NOTE: Running task 178 of 841 (virtual:native:/home/pokybuild/yocto-worker/a-full/build/meta/recipes-gnome/gtk+/gtk+3_3.24.14.bb:do_fetch)
NOTE: recipe gdk-pixbuf-native-2.40.0-r0: task do_fetch: Started
NOTE: recipe gtk+3-native-3.24.14-r0: task do_fetch: Started
NOTE: recipe squashfs-tools-native-4.4-r0: task do_fetch: Succeeded
NOTE: Running task 179 of 841 (/home/pokybuild/yocto-worker/a-full/build/meta/recipes-devtools/dpkg/dpkg_1.19.7.bb:do_fetch)
NOTE: recipe dpkg-1.19.7-r0: task do_fetch: Started
NOTE: recipe perl-native-5.30.1-r0: task do_fetch: Succeeded
NOTE: Running task 180 of 841 (/home/pokybuild/yocto-worker/a-full/build/meta/recipes-devtools/opkg-utils/opkg-utils_0.4.2.bb:do_fetch)
NOTE: recipe opkg-utils-0.4.2-r0: task do_fetch: Started
NOTE: recipe e2fsprogs-native-1.45.4-r0: task do_fetch: Succeeded
NOTE: Running task 181 of 841 (/home/pokybuild/yocto-worker/a-full/build/meta/recipes-devtools/m4/m4-native_1.4.18.bb:do_fetch)
NOTE: recipe m4-native-1.4.18-r0: task do_fetch: Started
NOTE: recipe syslinux-native-6.04-pre2-r0: task do_fetch: Succeeded
NOTE: Running task 182 of 841 (virtual:native:/home/pokybuild/yocto-worker/a-full/build/meta/recipes-devtools/flex/flex_2.6.4.bb:do_fetch)
NOTE: recipe flex-native-2.6.4-r0: task do_fetch: Started
NOTE: recipe gdk-pixbuf-native-2.40.0-r0: task do_fetch: Succeeded
NOTE: Running task 183 of 841 (/home/pokybuild/yocto-worker/a-full/build/meta/recipes-devtools/cmake/cmake-native_3.16.5.bb:do_fetch)
NOTE: recipe cmake-native-3.16.5-r0: task do_fetch: Started
WARNING: librsvg-native-2.40.21-r0 do_fetch: Failed to fetch URL https://ftp.gnome.org/pub/GNOME/sources/librsvg/2.40/librsvg-2.40.21.tar.xz;name=archive, attempting MIRRORS if available
NOTE: recipe grub-efi-native-2.04-r0: task do_fetch: Succeeded
NOTE: Running task 184 of 841 (virtual:native:/home/pokybuild/yocto-worker/a-full/build/meta/recipes-devtools/ninja/ninja_1.10.0.bb:do_fetch)
NOTE: recipe ninja-native-1.10.0-r0: task do_fetch: Started
NOTE: recipe opkg-utils-0.4.2-r0: task do_fetch: Succeeded
NOTE: Running task 185 of 841 (/home/pokybuild/yocto-worker/a-full/build/meta/recipes-graphics/xorg-xserver/xserver-xorg_1.20.8.bb:do_fetch)
NOTE: recipe xserver-xorg-2_1.20.8-r0: task do_fetch: Started
NOTE: recipe m4-native-1.4.18-r0: task do_fetch: Succeeded
NOTE: Running task 186 of 841 (virtual:native:/home/pokybuild/yocto-worker/a-full/build/meta/recipes-gnome/gtk-doc/gtk-doc_1.32.bb:do_fetch)
NOTE: recipe gtk-doc-native-1.32-r0: task do_fetch: Started
NOTE: recipe dpkg-1.19.7-r0: task do_fetch: Succeeded
NOTE: Running task 187 of 841 (virtual:native:/home/pokybuild/yocto-worker/a-full/build/meta/recipes-devtools/bison/bison_3.5.4.bb:do_fetch)
NOTE: recipe bison-native-3.5.4-r0: task do_fetch: Started
NOTE: recipe librsvg-native-2.40.21-r0: task do_fetch: Succeeded
NOTE: Running task 188 of 841 (/home/pokybuild/yocto-worker/a-full/build/meta/recipes-core/gettext/gettext_0.20.1.bb:do_fetch)
NOTE: recipe gettext-0.20.1-r0: task do_fetch: Started
NOTE: recipe btrfs-tools-native-5.4.1-r0: task do_fetch: Succeeded
NOTE: Running task 189 of 841 (/home/pokybuild/yocto-worker/a-full/build/meta/recipes-graphics/xorg-lib/libx11_1.6.9.bb:do_fetch)
NOTE: recipe libx11-1_1.6.9-r0: task do_fetch: Started
NOTE: recipe libx11-1_1.6.9-r0: task do_fetch: Succeeded
NOTE: Running task 190 of 841 (virtual:native:/home/pokybuild/yocto-worker/a-full/build/meta/recipes-extended/shadow/shadow_4.8.1.bb:do_fetch)
NOTE: recipe shadow-native-4.8.1-r0: task do_fetch: Started
NOTE: recipe flex-native-2.6.4-r0: task do_fetch: Succeeded
NOTE: Running task 191 of 841 (virtual:native:/home/pokybuild/yocto-worker/a-full/build/meta/recipes-core/gettext/gettext_0.20.1.bb:do_fetch)
NOTE: recipe gettext-native-0.20.1-r0: task do_fetch: Started
NOTE: recipe gtk+3-native-3.24.14-r0: task do_fetch: Succeeded
NOTE: Running task 192 of 841 (/home/pokybuild/yocto-worker/a-full/build/meta/recipes-extended/texinfo-dummy-native/texinfo-dummy-native.bb:do_fetch)
NOTE: recipe texinfo-dummy-native-1.0-r0: task do_fetch: Started
NOTE: recipe texinfo-dummy-native-1.0-r0: task do_fetch: Succeeded
NOTE: Running task 193 of 841 (virtual:native:/home/pokybuild/yocto-worker/a-full/build/meta/recipes-devtools/pkgconfig/pkgconfig_git.bb:do_fetch)
NOTE: recipe pkgconfig-native-0.29.2+gitAUTOINC+edf8e6f0ea-r0: task do_fetch: Started
NOTE: recipe pkgconfig-native-0.29.2+gitAUTOINC+edf8e6f0ea-r0: task do_fetch: Succeeded
NOTE: Running task 194 of 841 (virtual:native:/home/pokybuild/yocto-worker/a-full/build/meta/recipes-devtools/gnu-config/gnu-config_git.bb:do_fetch)
NOTE: recipe gnu-config-native-20200117+gitAUTOINC+5256817ace-r0: task do_fetch: Started
NOTE: recipe gtk-doc-native-1.32-r0: task do_fetch: Succeeded
NOTE: Running task 195 of 841 (/home/pokybuild/yocto-worker/a-full/build/meta/recipes-devtools/libtool/libtool-native_2.4.6.bb:do_fetch)
NOTE: recipe libtool-native-2.4.6-r0: task do_fetch: Started
NOTE: recipe shadow-native-4.8.1-r0: task do_fetch: Succeeded
NOTE: Running task 196 of 841 (virtual:native:/home/pokybuild/yocto-worker/a-full/build/meta/recipes-devtools/automake/automake_1.16.1.bb:do_fetch)
NOTE: recipe automake-native-1.16.1-r0: task do_fetch: Started
NOTE: recipe cmake-native-3.16.5-r0: task do_fetch: Succeeded
NOTE: Running task 197 of 841 (virtual:native:/home/pokybuild/yocto-worker/a-full/build/meta/recipes-devtools/autoconf/autoconf_2.69.bb:do_fetch)
NOTE: recipe autoconf-native-2.69-r11: task do_fetch: Started
NOTE: recipe xserver-xorg-2_1.20.8-r0: task do_fetch: Succeeded
NOTE: Running task 198 of 841 (/home/pokybuild/yocto-worker/a-full/build/meta/recipes-extended/libtirpc/libtirpc_1.2.6.bb:do_fetch)
NOTE: recipe libtirpc-1.2.6-r0: task do_fetch: Started
NOTE: recipe libtirpc-1.2.6-r0: task do_fetch: Succeeded
NOTE: Running task 199 of 841 (virtual:native:/home/pokybuild/yocto-worker/a-full/build/meta/recipes-core/update-rc.d/update-rc.d_0.8.bb:do_fetch)
NOTE: recipe update-rc.d-native-0.8-r0: task do_fetch: Started
NOTE: recipe ninja-native-1.10.0-r0: task do_fetch: Succeeded
NOTE: Running noexec task 200 of 841 (/home/pokybuild/yocto-worker/a-full/build/meta/recipes-devtools/gcc/gcc-cross_9.3.bb:do_fetch)
NOTE: Running task 201 of 841 (virtual:native:/home/pokybuild/yocto-worker/a-full/build/meta/recipes-devtools/python/python3-setuptools_45.2.0.bb:do_fetch)
NOTE: recipe python3-setuptools-native-45.2.0-r0: task do_fetch: Started
NOTE: recipe bison-native-3.5.4-r0: task do_fetch: Succeeded
NOTE: Running noexec task 202 of 841 (/home/pokybuild/yocto-worker/a-full/build/meta/recipes-devtools/gcc/gcc-runtime_9.3.bb:do_fetch)
NOTE: Running task 203 of 841 (/home/pokybuild/yocto-worker/a-full/build/meta/recipes-core/glibc/glibc_2.31.bb:do_fetch)
NOTE: recipe glibc-2.31+gitAUTOINC+6fdf971c9d-r0: task do_fetch: Started
NOTE: recipe automake-native-1.16.1-r0: task do_fetch: Succeeded
NOTE: Running task 204 of 841 (virtual:native:/home/pokybuild/yocto-worker/a-full/build/meta/recipes-devtools/python/python3_3.8.2.bb:do_fetch)
NOTE: recipe python3-native-3.8.2-r0: task do_fetch: Started
NOTE: recipe update-rc.d-native-0.8-r0: task do_fetch: Succeeded
NOTE: Running task 205 of 841 (virtual:native:/home/pokybuild/yocto-worker/a-full/build/meta/recipes-extended/xz/xz_5.2.4.bb:do_fetch)
NOTE: recipe xz-native-5.2.4-r0: task do_fetch: Started
NOTE: recipe autoconf-native-2.69-r11: task do_fetch: Succeeded
NOTE: Running task 206 of 841 (virtual:native:/home/pokybuild/yocto-worker/a-full/build/meta/recipes-devtools/opkg-utils/opkg-utils_0.4.2.bb:do_fetch)
NOTE: recipe opkg-utils-native-0.4.2-r0: task do_fetch: Started
NOTE: recipe opkg-utils-native-0.4.2-r0: task do_fetch: Succeeded
NOTE: Running task 207 of 841 (virtual:native:/home/pokybuild/yocto-worker/a-full/build/meta/recipes-devtools/dpkg/dpkg_1.19.7.bb:do_fetch)
NOTE: recipe dpkg-native-1.19.7-r0: task do_fetch: Started
NOTE: recipe dpkg-native-1.19.7-r0: task do_fetch: Succeeded
NOTE: Running task 208 of 841 (virtual:native:/home/pokybuild/yocto-worker/a-full/build/meta/recipes-devtools/dwarfsrcfiles/dwarfsrcfiles.bb:do_fetch)
NOTE: recipe dwarfsrcfiles-native-1.0-r0: task do_fetch: Started
NOTE: recipe dwarfsrcfiles-native-1.0-r0: task do_fetch: Succeeded
NOTE: Running task 209 of 841 (virtual:native:/home/pokybuild/yocto-worker/a-full/build/meta/recipes-devtools/rpm/rpm_4.14.2.1.bb:do_fetch)
NOTE: recipe rpm-native-1_4.14.2.1-r0: task do_fetch: Started
NOTE: recipe gnu-config-native-20200117+gitAUTOINC+5256817ace-r0: task do_fetch: Succeeded
NOTE: Running task 210 of 841 (/home/pokybuild/yocto-worker/a-full/build/meta/recipes-devtools/qemu/qemu-helper-native_1.0.bb:do_fetch)
NOTE: recipe qemu-helper-native-1.0-r1: task do_fetch: Started
NOTE: recipe qemu-helper-native-1.0-r1: task do_fetch: Succeeded
NOTE: Running task 211 of 841 (/home/pokybuild/yocto-worker/a-full/build/meta/recipes-devtools/qemu/qemu-native_4.2.0.bb:do_fetch)
NOTE: recipe qemu-native-4.2.0-r0: task do_fetch: Started
NOTE: recipe qemu-native-4.2.0-r0: task do_fetch: Succeeded
NOTE: Running task 212 of 841 (virtual:native:/home/pokybuild/yocto-worker/a-full/build/meta/recipes-extended/unzip/unzip_6.0.bb:do_fetch)
NOTE: recipe unzip-native-1_6.0-r5: task do_fetch: Started
NOTE: recipe gcc-source-9.3.0-9.3.0-r0: task do_fetch: Succeeded
NOTE: Running task 213 of 841 (virtual:native:/home/pokybuild/yocto-worker/a-full/build/meta/recipes-devtools/pseudo/pseudo_git.bb:do_fetch)
NOTE: recipe pseudo-native-1.9.0+gitAUTOINC+cca0d7f15b-r0: task do_fetch: Started
NOTE: recipe pseudo-native-1.9.0+gitAUTOINC+cca0d7f15b-r0: task do_fetch: Succeeded
NOTE: Running task 214 of 841 (/home/pokybuild/yocto-worker/a-full/build/meta/recipes-devtools/binutils/binutils-cross_2.34.bb:do_fetch)
NOTE: recipe binutils-cross-i686-2.34-r0: task do_fetch: Started
NOTE: recipe libtool-native-2.4.6-r0: task do_fetch: Succeeded
NOTE: Running task 215 of 841 (virtual:native:/home/pokybuild/yocto-worker/a-full/build/meta/recipes-devtools/patch/patch_2.7.6.bb:do_fetch)
NOTE: recipe patch-native-2.7.6-r0: task do_fetch: Started
NOTE: recipe gettext-0.20.1-r0: task do_fetch: Succeeded
NOTE: Running task 216 of 841 (/home/pokybuild/yocto-worker/a-full/build/meta/recipes-devtools/quilt/quilt-native_0.66.bb:do_fetch)
NOTE: recipe gettext-native-0.20.1-r0: task do_fetch: Succeeded
NOTE: Running task 217 of 841 (/home/pokybuild/yocto-worker/a-full/build/meta/recipes-devtools/dejagnu/dejagnu_1.6.2.bb:do_fetch)
NOTE: recipe quilt-native-0.66-r0: task do_fetch: Started
NOTE: recipe dejagnu-1.6.2-r0: task do_fetch: Started
NOTE: recipe unzip-native-1_6.0-r5: task do_fetch: Succeeded
NOTE: Running task 218 of 841 (/home/pokybuild/yocto-worker/a-full/build/meta/recipes-graphics/xorg-lib/xcb-util_0.4.0.bb:do_fetch)
NOTE: recipe xcb-util-0.4.0-r0: task do_fetch: Started
WARNING: python3-setuptools-native-45.2.0-r0 do_fetch: Failed to fetch URL https://files.pythonhosted.org/packages/source/s/setuptools/setuptools-45.2.0.zip, attempting MIRRORS if available
NOTE: recipe dejagnu-1.6.2-r0: task do_fetch: Succeeded
NOTE: Running task 219 of 841 (/home/pokybuild/yocto-worker/a-full/build/meta/recipes-extended/libmnl/libmnl_1.0.4.bb:do_fetch)
NOTE: recipe libmnl-1.0.4-r0: task do_fetch: Started
NOTE: recipe xz-native-5.2.4-r0: task do_fetch: Succeeded
NOTE: Running task 220 of 841 (/home/pokybuild/yocto-worker/a-full/build/meta/recipes-extended/libidn/libidn2_2.3.0.bb:do_fetch)
NOTE: recipe libidn2-2.3.0-r0: task do_fetch: Started
NOTE: recipe libidn2-2.3.0-r0: task do_fetch: Succeeded
NOTE: Running task 221 of 841 (/home/pokybuild/yocto-worker/a-full/build/meta/recipes-graphics/vulkan/vulkan-demos_git.bb:do_fetch)
NOTE: recipe vulkan-demos-git-r0: task do_fetch: Started
NOTE: recipe xcb-util-0.4.0-r0: task do_fetch: Succeeded
NOTE: Running task 222 of 841 (/home/pokybuild/yocto-worker/a-full/build/meta/recipes-devtools/mmc/mmc-utils_git.bb:do_fetch)
NOTE: recipe mmc-utils-0.1+gitAUTOINC+73d6c59af8-r0: task do_fetch: Started
NOTE: recipe quilt-native-0.66-r0: task do_fetch: Succeeded
NOTE: Running task 223 of 841 (/home/pokybuild/yocto-worker/a-full/build/meta/recipes-support/debianutils/debianutils_4.9.1.bb:do_fetch)
NOTE: recipe debianutils-4.9.1-r0: task do_fetch: Started
NOTE: recipe debianutils-4.9.1-r0: task do_fetch: Succeeded
NOTE: Running task 224 of 841 (/home/pokybuild/yocto-worker/a-full/build/build-st/meta-selftest/recipes-test/selftest-ed/selftest-ed_1.14.1.bb:do_fetch)
NOTE: recipe selftest-ed-1.14.1-r0: task do_fetch: Started
NOTE: recipe patch-native-2.7.6-r0: task do_fetch: Succeeded
NOTE: Running task 225 of 841 (/home/pokybuild/yocto-worker/a-full/build/meta/recipes-connectivity/nfs-utils/nfs-utils_2.4.3.bb:do_fetch)
NOTE: recipe nfs-utils-2.4.3-r0: task do_fetch: Started
NOTE: recipe libmnl-1.0.4-r0: task do_fetch: Succeeded
NOTE: Running task 226 of 841 (/home/pokybuild/yocto-worker/a-full/build/meta/recipes-graphics/xorg-lib/libxfixes_5.0.3.bb:do_fetch)
NOTE: recipe libxfixes-1_5.0.3-r0: task do_fetch: Started
NOTE: recipe libxfixes-1_5.0.3-r0: task do_fetch: Succeeded
NOTE: Running task 227 of 841 (/home/pokybuild/yocto-worker/a-full/build/meta/recipes-extended/perl/libxml-namespacesupport-perl_1.12.bb:do_fetch)
NOTE: recipe libxml-namespacesupport-perl-1.12-r0: task do_fetch: Started
NOTE: recipe libxml-namespacesupport-perl-1.12-r0: task do_fetch: Succeeded
NOTE: Running task 228 of 841 (/home/pokybuild/yocto-worker/a-full/build/meta/recipes-connectivity/ppp-dialin/ppp-dialin_0.1.bb:do_fetch)
NOTE: recipe ppp-dialin-0.1-r8: task do_fetch: Started
NOTE: recipe ppp-dialin-0.1-r8: task do_fetch: Succeeded
NOTE: Running task 229 of 841 (/home/pokybuild/yocto-worker/a-full/build/meta/recipes-devtools/python/python3-pycairo_1.19.0.bb:do_fetch)
NOTE: recipe python3-pycairo-1.19.0-r0: task do_fetch: Started
ERROR: python3-setuptools-native-45.2.0-r0 do_fetch: The URL: 'https://files.pythonhosted.org/packages/source/s/setuptools/setuptools-45.2.0.zip' is not trusted and cannot be used
ERROR: python3-setuptools-native-45.2.0-r0 do_fetch: Fetcher failure for URL: 'https://files.pythonhosted.org/packages/source/s/setuptools/setuptools-45.2.0.zip'. Unable to fetch URL from any source.
ERROR: Logfile of failure stored in: /home/pokybuild/yocto-worker/a-full/build/build-st/tmp/work/x86_64-linux/python3-setuptools-native/45.2.0-r0/temp/log.do_fetch.48297
NOTE: recipe python3-setuptools-native-45.2.0-r0: task do_fetch: Failed
ERROR: Task (virtual:native:/home/pokybuild/yocto-worker/a-full/build/meta/recipes-devtools/python/python3-setuptools_45.2.0.bb:do_fetch) failed with exit code '1'
NOTE: Running task 230 of 841 (/home/pokybuild/yocto-worker/a-full/build/meta/recipes-core/meta/meta-ide-support.bb:do_fetch)
NOTE: recipe meta-ide-support-1.0-r3: task do_fetch: Started
NOTE: recipe meta-ide-support-1.0-r3: task do_fetch: Succeeded
NOTE: recipe python3-native-3.8.2-r0: task do_fetch: Succeeded
WARNING: ovmf-native-edk2-stable201911-r0 do_fetch: Failed to fetch URL gitsm://github.com/tianocore/edk2.git;branch=master;protocol=git, attempting MIRRORS if available
ERROR: ovmf-native-edk2-stable201911-r0 do_fetch: The URL: 'gitsm://github.com/tianocore/edk2.git;branch=master;protocol=git' is not trusted and cannot be used
ERROR: ovmf-native-edk2-stable201911-r0 do_fetch: Fetcher failure for URL: 'gitsm://github.com/tianocore/edk2.git;branch=master;protocol=git'. Unable to fetch URL from any source.
ERROR: Logfile of failure stored in: /home/pokybuild/yocto-worker/a-full/build/build-st/tmp/work/x86_64-linux/ovmf-native/edk2-stable201911-r0/temp/log.do_fetch.45779
NOTE: recipe ovmf-native-edk2-stable201911-r0: task do_fetch: Failed
ERROR: Task (virtual:native:/home/pokybuild/yocto-worker/a-full/build/meta/recipes-core/ovmf/ovmf_git.bb:do_fetch) failed with exit code '1'
NOTE: recipe selftest-ed-1.14.1-r0: task do_fetch: Succeeded
NOTE: recipe mmc-utils-0.1+gitAUTOINC+73d6c59af8-r0: task do_fetch: Succeeded
NOTE: recipe nfs-utils-2.4.3-r0: task do_fetch: Succeeded
NOTE: recipe python3-pycairo-1.19.0-r0: task do_fetch: Succeeded
WARNING: llvm-native-9.0.1-r0 do_fetch: Failed to fetch URL git://github.com/llvm/llvm-project.git;branch=release/9.x, attempting MIRRORS if available
ERROR: llvm-native-9.0.1-r0 do_fetch: The URL: 'git://github.com/llvm/llvm-project.git;branch=release/9.x' is not trusted and cannot be used
ERROR: llvm-native-9.0.1-r0 do_fetch: Fetcher failure for URL: 'git://github.com/llvm/llvm-project.git;branch=release/9.x'. Unable to fetch URL from any source.
ERROR: Logfile of failure stored in: /home/pokybuild/yocto-worker/a-full/build/build-st/tmp/work/x86_64-linux/llvm-native/9.0.1-r0/temp/log.do_fetch.45656
NOTE: recipe llvm-native-9.0.1-r0: task do_fetch: Failed
ERROR: Task (virtual:native:/home/pokybuild/yocto-worker/a-full/build/meta/recipes-devtools/llvm/llvm_git.bb:do_fetch) failed with exit code '1'
NOTE: recipe u-boot-1_2020.01-r0: task do_fetch: Succeeded
NOTE: recipe rpm-native-1_4.14.2.1-r0: task do_fetch: Succeeded
WARNING: linux-yocto-5.4.69+gitAUTOINC+7f765dcb29_cfcdd63145-r0 do_fetch: Failed to fetch URL git://git.yoctoproject.org/linux-yocto.git;name=machine;branch=v5.4/standard/base;, attempting MIRRORS if available
NOTE: recipe glibc-2.31+gitAUTOINC+6fdf971c9d-r0: task do_fetch: Succeeded
NOTE: recipe cross-localedef-native-2.31+gitAUTOINC+6fdf971c9d_cd9f958c4c-r0: task do_fetch: Succeeded
NOTE: recipe binutils-native-2.34-r0: task do_fetch: Succeeded
NOTE: recipe binutils-cross-i686-2.34-r0: task do_fetch: Succeeded
NOTE: recipe vulkan-demos-git-r0: task do_fetch: Succeeded
NOTE: recipe linux-yocto-5.4.69+gitAUTOINC+7f765dcb29_cfcdd63145-r0: task do_fetch: Succeeded
NOTE: Tasks Summary: Attempted 230 tasks of which 0 didn't need to be rerun and 3 failed.
NOTE: The errors for this build are stored in /home/pokybuild/yocto-worker/a-full/build/build-st/tmp/log/error-report/error_report_20201203072644.txt
You can send the errors to a reports server by running:
send-error-report /home/pokybuild/yocto-worker/a-full/build/build-st/tmp/log/error-report/error_report_20201203072644.txt [-s server]
NOTE: The contents of these logs will be posted in public if you use the above command with the default server. Please ensure you remove any identifying or proprietary information when prompted before sending.
Summary: 3 tasks failed:
virtual:native:/home/pokybuild/yocto-worker/a-full/build/meta/recipes-devtools/python/python3-setuptools_45.2.0.bb:do_fetch
virtual:native:/home/pokybuild/yocto-worker/a-full/build/meta/recipes-core/ovmf/ovmf_git.bb:do_fetch
virtual:native:/home/pokybuild/yocto-worker/a-full/build/meta/recipes-devtools/llvm/llvm_git.bb:do_fetch
Summary: There were 9 WARNING messages shown.
Summary: There were 6 ERROR messages shown, returning a non-zero exit code.
----------------------------------------------------------------------
2020-12-03 08:05:49,386 - oe-selftest - INFO - Ran 1 test in 2357.278s
2020-12-03 08:05:49,386 - oe-selftest - INFO - FAILED
2020-12-03 08:05:49,386 - oe-selftest - INFO - (failures=1)
2020-12-03 08:05:53,468 - oe-selftest - INFO - RESULTS:
2020-12-03 08:05:53,469 - oe-selftest - INFO - RESULTS - buildoptions.SourceMirroring.test_yocto_source_mirror: FAILED (2356.13s)
2020-12-03 08:05:53,470 - oe-selftest - INFO - SUMMARY:
2020-12-03 08:05:53,470 - oe-selftest - INFO - oe-selftest () - Ran 1 test in 2357.283s
2020-12-03 08:05:53,470 - oe-selftest - INFO - oe-selftest - FAIL - Required tests failed (successes=0, skipped=0, failures=1, errors=0)