DEBUG: Executing python function autotools_aclocals
DEBUG: SITE files ['endian-big', 'bit-32', 'mips-common', 'common-linux', 'common-glibc', 'mips-linux', 'common']
DEBUG: Python function autotools_aclocals finished
DEBUG: Executing shell function do_compile
NOTE: make -j 10
make all-am
make[1]: Entering directory 'TOPDIR/build/tmp/work/mips32r2-yoe-linux/gnome-desktop-testing/2021.1-r0/build'
mips-yoe-linux-clang -target mips-yoe-linux -mabi=32 -mhard-float -march=mips32r2 -mbig-endian -Qunused-arguments -fstack-protector-strong -O2 -D_FORTIFY_SOURCE=2 -Wformat -Wformat-security -Werror=format-security --sysroot=TOPDIR/build/tmp/work/mips32r2-yoe-linux/gnome-desktop-testing/2021.1-r0/recipe-sysroot -DHAVE_CONFIG_H -I. -I../git -DDATADIR='"/usr/share"' -DLIBEXECDIR='"/usr/libexec"' -Wall -Werror=strict-prototypes -Werror=missing-prototypes -Werror=implicit-function-declaration -Werror=pointer-arith -Werror=init-self -Werror=format=2 -Werror=format-security -Werror=missing-include-dirs -Werror=aggregate-return -Werror=switch-default -Wswitch-enum -Wsign-compare -Werror=declaration-after-statement -pthread -ITOPDIR/build/tmp/work/mips32r2-yoe-linux/gnome-desktop-testing/2021.1-r0/recipe-sysroot/usr/include/gio-unix-2.0 -ITOPDIR/build/tmp/work/mips32r2-yoe-linux/gnome-desktop-testing/2021.1-r0/recipe-sysroot/usr/include/libmount -ITOPDIR/build/tmp/work/mips32r2-yoe-linux/gnome-desktop-testing/2021.1-r0/recipe-sysroot/usr/include/blkid -ITOPDIR/build/tmp/work/mips32r2-yoe-linux/gnome-desktop-testing/2021.1-r0/recipe-sysroot/usr/include/glib-2.0 -ITOPDIR/build/tmp/work/mips32r2-yoe-linux/gnome-desktop-testing/2021.1-r0/recipe-sysroot/usr/lib/glib-2.0/include -DGLIB_VERSION_MIN_REQUIRED=GLIB_VERSION_2_50 -DGLIB_VERSION_MAX_ALLOWED=GLIB_VERSION_2_50 -O2 -pipe -g -feliminate-unused-debug-types -fmacro-prefix-map=TOPDIR/build/tmp/work/mips32r2-yoe-linux/gnome-desktop-testing/2021.1-r0=/usr/src/debug/gnome-desktop-testing/2021.1-r0 -fdebug-prefix-map=TOPDIR/build/tmp/work/mips32r2-yoe-linux/gnome-desktop-testing/2021.1-r0=/usr/src/debug/gnome-desktop-testing/2021.1-r0 -fdebug-prefix-map=TOPDIR/build/tmp/work/mips32r2-yoe-linux/gnome-desktop-testing/2021.1-r0/recipe-sysroot= -fdebug-prefix-map=TOPDIR/build/tmp/work/mips32r2-yoe-linux/gnome-desktop-testing/2021.1-r0/recipe-sysroot-native= -c -o gnome_desktop_testing_runner-gnome-desktop-testing-runner.o `test -f 'src/gnome-desktop-testing-runner.c' || echo '../git/'`src/gnome-desktop-testing-runner.c
../git/src/gnome-desktop-testing-runner.c:94:31: error: format string is not a string literal [-Werror,-Wformat-nonliteral]
message = g_strdup_vprintf (format, ap);
^~~~~~
1 error generated.
Makefile:771: recipe for target 'gnome_desktop_testing_runner-gnome-desktop-testing-runner.o' failed
make[1]: *** [gnome_desktop_testing_runner-gnome-desktop-testing-runner.o] Error 1
make[1]: Leaving directory 'TOPDIR/build/tmp/work/mips32r2-yoe-linux/gnome-desktop-testing/2021.1-r0/build'
Makefile:436: recipe for target 'all' failed
make: *** [all] Error 2
ERROR: oe_runmake failed
WARNING: TOPDIR/build/tmp/work/mips32r2-yoe-linux/gnome-desktop-testing/2021.1-r0/temp/run.do_compile.26921:185 exit 1 from 'exit 1'
WARNING: Backtrace (BB generated script):
#1: bbfatal_log, TOPDIR/build/tmp/work/mips32r2-yoe-linux/gnome-desktop-testing/2021.1-r0/temp/run.do_compile.26921, line 185
#2: die, TOPDIR/build/tmp/work/mips32r2-yoe-linux/gnome-desktop-testing/2021.1-r0/temp/run.do_compile.26921, line 169
#3: oe_runmake, TOPDIR/build/tmp/work/mips32r2-yoe-linux/gnome-desktop-testing/2021.1-r0/temp/run.do_compile.26921, line 164
#4: autotools_do_compile, TOPDIR/build/tmp/work/mips32r2-yoe-linux/gnome-desktop-testing/2021.1-r0/temp/run.do_compile.26921, line 159
#5: do_compile, TOPDIR/build/tmp/work/mips32r2-yoe-linux/gnome-desktop-testing/2021.1-r0/temp/run.do_compile.26921, line 154
#6: main, TOPDIR/build/tmp/work/mips32r2-yoe-linux/gnome-desktop-testing/2021.1-r0/temp/run.do_compile.26921, line 198
ERROR: Execution of 'TOPDIR/build/tmp/work/mips32r2-yoe-linux/gnome-desktop-testing/2021.1-r0/temp/run.do_compile.26921' failed with exit code 1:
make all-am
make[1]: Entering directory 'TOPDIR/build/tmp/work/mips32r2-yoe-linux/gnome-desktop-testing/2021.1-r0/build'
mips-yoe-linux-clang -target mips-yoe-linux -mabi=32 -mhard-float -march=mips32r2 -mbig-endian -Qunused-arguments -fstack-protector-strong -O2 -D_FORTIFY_SOURCE=2 -Wformat -Wformat-security -Werror=format-security --sysroot=TOPDIR/build/tmp/work/mips32r2-yoe-linux/gnome-desktop-testing/2021.1-r0/recipe-sysroot -DHAVE_CONFIG_H -I. -I../git -DDATADIR='"/usr/share"' -DLIBEXECDIR='"/usr/libexec"' -Wall -Werror=strict-prototypes -Werror=missing-prototypes -Werror=implicit-function-declaration -Werror=pointer-arith -Werror=init-self -Werror=format=2 -Werror=format-security -Werror=missing-include-dirs -Werror=aggregate-return -Werror=switch-default -Wswitch-enum -Wsign-compare -Werror=declaration-after-statement -pthread -ITOPDIR/build/tmp/work/mips32r2-yoe-linux/gnome-desktop-testing/2021.1-r0/recipe-sysroot/usr/include/gio-unix-2.0 -ITOPDIR/build/tmp/work/mips32r2-yoe-linux/gnome-desktop-testing/2021.1-r0/recipe-sysroot/usr/include/libmount -ITOPDIR/build/tmp/work/mips32r2-yoe-linux/gnome-desktop-testing/2021.1-r0/recipe-sysroot/usr/include/blkid -ITOPDIR/build/tmp/work/mips32r2-yoe-linux/gnome-desktop-testing/2021.1-r0/recipe-sysroot/usr/include/glib-2.0 -ITOPDIR/build/tmp/work/mips32r2-yoe-linux/gnome-desktop-testing/2021.1-r0/recipe-sysroot/usr/lib/glib-2.0/include -DGLIB_VERSION_MIN_REQUIRED=GLIB_VERSION_2_50 -DGLIB_VERSION_MAX_ALLOWED=GLIB_VERSION_2_50 -O2 -pipe -g -feliminate-unused-debug-types -fmacro-prefix-map=TOPDIR/build/tmp/work/mips32r2-yoe-linux/gnome-desktop-testing/2021.1-r0=/usr/src/debug/gnome-desktop-testing/2021.1-r0 -fdebug-prefix-map=TOPDIR/build/tmp/work/mips32r2-yoe-linux/gnome-desktop-testing/2021.1-r0=/usr/src/debug/gnome-desktop-testing/2021.1-r0 -fdebug-prefix-map=TOPDIR/build/tmp/work/mips32r2-yoe-linux/gnome-desktop-testing/2021.1-r0/recipe-sysroot= -fdebug-prefix-map=TOPDIR/build/tmp/work/mips32r2-yoe-linux/gnome-desktop-testing/2021.1-r0/recipe-sysroot-native= -c -o gnome_desktop_testing_runner-gnome-desktop-testing-runner.o `test -f 'src/gnome-desktop-testing-runner.c' || echo '../git/'`src/gnome-desktop-testing-runner.c
../git/src/gnome-desktop-testing-runner.c:94:31: error: format string is not a string literal [-Werror,-Wformat-nonliteral]
message = g_strdup_vprintf (format, ap);
^~~~~~
1 error generated.
Makefile:771: recipe for target 'gnome_desktop_testing_runner-gnome-desktop-testing-runner.o' failed
make[1]: *** [gnome_desktop_testing_runner-gnome-desktop-testing-runner.o] Error 1
make[1]: Leaving directory 'TOPDIR/build/tmp/work/mips32r2-yoe-linux/gnome-desktop-testing/2021.1-r0/build'
Makefile:436: recipe for target 'all' failed
make: *** [all] Error 2
WARNING: TOPDIR/build/tmp/work/mips32r2-yoe-linux/gnome-desktop-testing/2021.1-r0/temp/run.do_compile.26921:185 exit 1 from 'exit 1'
WARNING: Backtrace (BB generated script):
#1: bbfatal_log, TOPDIR/build/tmp/work/mips32r2-yoe-linux/gnome-desktop-testing/2021.1-r0/temp/run.do_compile.26921, line 185
#2: die, TOPDIR/build/tmp/work/mips32r2-yoe-linux/gnome-desktop-testing/2021.1-r0/temp/run.do_compile.26921, line 169
#3: oe_runmake, TOPDIR/build/tmp/work/mips32r2-yoe-linux/gnome-desktop-testing/2021.1-r0/temp/run.do_compile.26921, line 164
#4: autotools_do_compile, TOPDIR/build/tmp/work/mips32r2-yoe-linux/gnome-desktop-testing/2021.1-r0/temp/run.do_compile.26921, line 159
#5: do_compile, TOPDIR/build/tmp/work/mips32r2-yoe-linux/gnome-desktop-testing/2021.1-r0/temp/run.do_compile.26921, line 154
#6: main, TOPDIR/build/tmp/work/mips32r2-yoe-linux/gnome-desktop-testing/2021.1-r0/temp/run.do_compile.26921, line 198
Backtrace (metadata-relative locations):
#1: bbfatal_log, TOPDIR/sources/openembedded-core/meta/classes/logging.bbclass, line 72
#2: die, TOPDIR/sources/openembedded-core/meta/classes/base.bbclass, line 56
#3: oe_runmake, TOPDIR/sources/openembedded-core/meta/classes/base.bbclass, line 65
#4: autotools_do_compile, TOPDIR/sources/openembedded-core/meta/classes/autotools.bbclass, line 235
#5: do_compile, autogenerated, line 2