DEBUG: Executing shell function do_compile
NOTE: cmake --build TOPDIR/build/tmp/work/core2-32-yoe-linux/apitrace/10.0-r0/build --target all --
[1/175] Building CXX object thirdparty/snappy/CMakeFiles/snappy_bundled.dir/snappy-sinksource.cc.o
[2/175] Building CXX object thirdparty/snappy/CMakeFiles/snappy_bundled.dir/snappy-c.cc.o
[3/175] Building C object thirdparty/brotli/CMakeFiles/brotli_enc.dir/c/enc/cluster.c.o
[4/175] Building C object thirdparty/brotli/CMakeFiles/brotli_enc.dir/c/enc/bit_cost.c.o
[5/175] Building CXX object thirdparty/snappy/CMakeFiles/snappy_bundled.dir/snappy-stubs-internal.cc.o
[6/175] Building C object thirdparty/brotli/CMakeFiles/brotli_enc.dir/c/enc/dictionary_hash.c.o
[7/175] Building C object thirdparty/brotli/CMakeFiles/brotli_enc.dir/c/enc/backward_references_hq.c.o
[8/175] Building C object thirdparty/brotli/CMakeFiles/brotli_enc.dir/c/enc/entropy_encode.c.o
[9/175] Building C object thirdparty/brotli/CMakeFiles/brotli_enc.dir/c/enc/brotli_bit_stream.c.o
[10/175] Building C object thirdparty/brotli/CMakeFiles/brotli_enc.dir/c/enc/literal_cost.c.o
[11/175] Building C object thirdparty/brotli/CMakeFiles/brotli_enc.dir/c/enc/memory.c.o
[12/175] Building C object thirdparty/brotli/CMakeFiles/brotli_enc.dir/c/enc/block_splitter.c.o
[13/175] Building C object thirdparty/brotli/CMakeFiles/brotli_enc.dir/c/enc/histogram.c.o
[14/175] Building C object thirdparty/brotli/CMakeFiles/brotli_enc.dir/c/enc/utf8_util.c.o
[15/175] Building CXX object thirdparty/snappy/CMakeFiles/snappy_bundled.dir/snappy.cc.o
[16/175] Building C object thirdparty/brotli/CMakeFiles/brotli_dec.dir/c/dec/bit_reader.c.o
[17/175] Building C object thirdparty/brotli/CMakeFiles/brotli_enc.dir/c/enc/encoder_dict.c.o
[18/175] Linking CXX static library thirdparty/snappy/libsnappy_bundled.a
[19/175] Building C object thirdparty/brotli/CMakeFiles/brotli_enc.dir/c/enc/compress_fragment.c.o
[20/175] Building C object thirdparty/brotli/CMakeFiles/brotli_enc.dir/c/enc/static_dict.c.o
[21/175] Building C object thirdparty/brotli/CMakeFiles/brotli_dec.dir/c/dec/huffman.c.o
[22/175] Building C object thirdparty/brotli/CMakeFiles/brotli_dec.dir/c/dec/state.c.o
[23/175] Building C object thirdparty/crc32c/CMakeFiles/crc32c.dir/crc32c.c.o
[24/175] Building C object thirdparty/brotli/CMakeFiles/brotli_common.dir/c/common/transform.c.o
[25/175] Building C object thirdparty/brotli/CMakeFiles/brotli_enc.dir/c/enc/metablock.c.o
[26/175] Linking C static library thirdparty/crc32c/libcrc32c.a
[27/175] Building C object thirdparty/libbacktrace/CMakeFiles/stest.dir/stest.c.o
[28/175] Building C object thirdparty/libbacktrace/CMakeFiles/btest.dir/btest.c.o
TOPDIR/build/tmp/work/core2-32-yoe-linux/apitrace/10.0-r0/git/thirdparty/libbacktrace/btest.c:51:51: warning: unknown attribute 'noclone' ignored [-Wunknown-attributes]
static int test1 (void) __attribute__ ((noinline, noclone, unused));
^~~~~~~
TOPDIR/build/tmp/work/core2-32-yoe-linux/apitrace/10.0-r0/git/thirdparty/libbacktrace/btest.c:52:47: warning: unknown attribute 'noclone' ignored [-Wunknown-attributes]
static int f2 (int) __attribute__ ((noinline, noclone));
^~~~~~~
TOPDIR/build/tmp/work/core2-32-yoe-linux/apitrace/10.0-r0/git/thirdparty/libbacktrace/btest.c:53:52: warning: unknown attribute 'noclone' ignored [-Wunknown-attributes]
static int f3 (int, int) __attribute__ ((noinline, noclone));
^~~~~~~
TOPDIR/build/tmp/work/core2-32-yoe-linux/apitrace/10.0-r0/git/thirdparty/libbacktrace/btest.c:165:51: warning: unknown attribute 'noclone' ignored [-Wunknown-attributes]
static int test3 (void) __attribute__ ((noinline, noclone, unused));
^~~~~~~
TOPDIR/build/tmp/work/core2-32-yoe-linux/apitrace/10.0-r0/git/thirdparty/libbacktrace/btest.c:166:48: warning: unknown attribute 'noclone' ignored [-Wunknown-attributes]
static int f22 (int) __attribute__ ((noinline, noclone));
^~~~~~~
TOPDIR/build/tmp/work/core2-32-yoe-linux/apitrace/10.0-r0/git/thirdparty/libbacktrace/btest.c:167:53: warning: unknown attribute 'noclone' ignored [-Wunknown-attributes]
static int f23 (int, int) __attribute__ ((noinline, noclone));
^~~~~~~
6 warnings generated.
[29/175] Building C object thirdparty/libbacktrace/CMakeFiles/backtrace.dir/simple.c.o
[30/175] Building C object thirdparty/libbacktrace/CMakeFiles/backtrace.dir/backtrace.c.o
[31/175] Building C object thirdparty/libbacktrace/CMakeFiles/backtrace.dir/unknown.c.o
[32/175] Building C object thirdparty/brotli/CMakeFiles/brotli_common.dir/c/common/dictionary.c.o
[33/175] Building C object thirdparty/libbacktrace/CMakeFiles/backtrace.dir/mmapio.c.o
[34/175] Building C object thirdparty/libbacktrace/CMakeFiles/backtrace.dir/atomic.c.o
[35/175] Linking C static library thirdparty/brotli/libbrotli_common.a
[36/175] Building C object thirdparty/libbacktrace/CMakeFiles/backtrace.dir/fileline.c.o
[37/175] Building C object thirdparty/libbacktrace/CMakeFiles/backtrace.dir/mmap.c.o
[38/175] Building C object thirdparty/libbacktrace/CMakeFiles/backtrace.dir/print.c.o
[39/175] Building C object thirdparty/libbacktrace/CMakeFiles/backtrace.dir/state.c.o
[40/175] Building C object thirdparty/libbacktrace/CMakeFiles/backtrace.dir/posix.c.o
[41/175] Building C object thirdparty/libbacktrace/CMakeFiles/backtrace.dir/sort.c.o
[42/175] Building C object thirdparty/libbacktrace/CMakeFiles/backtrace.dir/testlib.c.o
[43/175] Building C object thirdparty/md5/CMakeFiles/md5_bundled.dir/md5.c.o
[44/175] Linking C static library thirdparty/libbacktrace/libbacktrace.a
[45/175] Linking C static library thirdparty/md5/libmd5_bundled.a
[46/175] Building C object thirdparty/brotli/CMakeFiles/brotli_enc.dir/c/enc/encode.c.o
[47/175] Linking C executable stest
[48/175] Linking C executable btest
[49/175] Building CXX object lib/os/CMakeFiles/os.dir/os_crtdbg.cpp.o
[50/175] Building C object thirdparty/brotli/CMakeFiles/brotli_enc.dir/c/enc/compress_fragment_two_pass.c.o
[51/175] Building C object thirdparty/brotli/CMakeFiles/brotli_dec.dir/c/dec/decode.c.o
[52/175] Linking C static library thirdparty/brotli/libbrotli_dec.a
[53/175] Building CXX object lib/guids/CMakeFiles/guids.dir/guids.cpp.o
[54/175] Linking CXX static library lib/guids/libguids.a
[55/175] Building CXX object lib/highlight/CMakeFiles/highlight.dir/highlight.cpp.o
[56/175] Linking CXX static library lib/highlight/libhighlight.a
[57/175] Building CXX object lib/os/CMakeFiles/os.dir/os_posix.cpp.o
[58/175] Building C object thirdparty/brotli/CMakeFiles/brotli_enc.dir/c/enc/backward_references.c.o
[59/175] Building CXX object lib/os/CMakeFiles/os.dir/os_backtrace.cpp.o
[60/175] Linking C static library thirdparty/brotli/libbrotli_enc.a
[61/175] Linking CXX static library lib/os/libos.a
[62/175] Building CXX object lib/image/CMakeFiles/image.dir/image_md5.cpp.o
[63/175] Building CXX object lib/image/CMakeFiles/image.dir/image_png.cpp.o
[64/175] Building CXX object lib/image/CMakeFiles/image.dir/image_bmp.cpp.o
[65/175] Building CXX object lib/image/CMakeFiles/image.dir/image_pnm.cpp.o
[66/175] Building CXX object lib/os/CMakeFiles/os_thread_test.dir/os_thread_test.cpp.o
[67/175] Building CXX object lib/image/CMakeFiles/image.dir/image_raw.cpp.o
[68/175] Linking CXX static library lib/image/libimage.a
[69/175] Building CXX object lib/trace/CMakeFiles/common.dir/trace_fast_callset.cpp.o
[70/175] Building CXX object lib/trace/CMakeFiles/common.dir/trace_file.cpp.o
[71/175] Building CXX object lib/trace/CMakeFiles/common.dir/trace_callset.cpp.o
[72/175] Building CXX object lib/trace/CMakeFiles/trace_parser_flags_test.dir/trace_parser_flags_test.cpp.o
[73/175] Building CXX object lib/trace/CMakeFiles/common.dir/trace_dump.cpp.o
[74/175] Building CXX object lib/trace/CMakeFiles/common.dir/trace_file_brotli.cpp.o
[75/175] Building CXX object lib/trace/CMakeFiles/common.dir/trace_model.cpp.o
[76/175] Building CXX object lib/trace/CMakeFiles/common.dir/trace_file_zlib.cpp.o
[77/175] Building CXX object lib/trace/CMakeFiles/common.dir/trace_file_read.cpp.o
[78/175] Building CXX object lib/trace/CMakeFiles/common.dir/trace_file_snappy.cpp.o
[79/175] Building CXX object lib/trace/CMakeFiles/common.dir/trace_parser_loop.cpp.o
[80/175] Building CXX object lib/trace/CMakeFiles/common.dir/trace_writer_model.cpp.o
[81/175] Building CXX object lib/trace/CMakeFiles/common.dir/trace_writer.cpp.o
[82/175] Building CXX object lib/trace/CMakeFiles/common.dir/trace_option.cpp.o
[83/175] Building CXX object wrappers/CMakeFiles/trace.dir/assert.cpp.o
[84/175] Building CXX object lib/trace/CMakeFiles/common.dir/trace_writer_local.cpp.o
[85/175] Generating glproc.hpp, glproc.cpp
[86/175] Building CXX object lib/trace/CMakeFiles/common.dir/trace_ostream_zlib.cpp.o
[87/175] Building CXX object lib/trace/CMakeFiles/common.dir/trace_ostream_snappy.cpp.o
[88/175] Building CXX object dispatch/CMakeFiles/glproc_egl.dir/glproc_egl.cpp.o
[89/175] Building CXX object lib/trace/CMakeFiles/common.dir/trace_profiler.cpp.o
[90/175] Building CXX object wrappers/CMakeFiles/trace.dir/memtrace.cpp.o
[91/175] Building CXX object retrace/CMakeFiles/retrace_common.dir/json.cpp.o
[92/175] Building CXX object lib/trace/CMakeFiles/common.dir/trace_parser.cpp.o
[93/175] Building CXX object helpers/CMakeFiles/glhelpers.dir/eglsize.cpp.o
[94/175] Building CXX object helpers/CMakeFiles/glhelpers.dir/glfeatures.cpp.o
[95/175] Building CXX object wrappers/CMakeFiles/gltrace_common.dir/glcaps.cpp.o
[96/175] Building CXX object wrappers/CMakeFiles/gltrace_common.dir/gltrace_state.cpp.o
[97/175] Building CXX object wrappers/CMakeFiles/gltrace_common.dir/config.cpp.o
[98/175] Building CXX object wrappers/CMakeFiles/gltrace_common.dir/gltrace_unpack_compressed.cpp.o
[99/175] Building CXX object lib/guids/CMakeFiles/guids_test.dir/guids_test.cpp.o
[100/175] Building CXX object lib/trace/CMakeFiles/common.dir/trace_parser_flags.cpp.o
[101/175] Linking CXX static library lib/trace/libcommon.a
[102/175] Building CXX object wrappers/CMakeFiles/gltrace_common.dir/gltrace_arrays.cpp.o
[103/175] Linking CXX static library wrappers/libtrace.a
[104/175] Building CXX object CMakeFiles/gtest.dir/thirdparty/gtest/src/gtest-all.cc.o
[105/175] Building CXX object retrace/CMakeFiles/retrace_common.dir/state_writer.cpp.o
[106/175] Linking CXX static library libgtest.a
[107/175] Building CXX object retrace/CMakeFiles/retrace_common.dir/process_name.cpp.o
[108/175] Linking CXX executable os_thread_test
[109/175] Linking CXX executable guids_test
[110/175] Building CXX object retrace/CMakeFiles/retrace_common.dir/ws.cpp.o
[111/175] Linking CXX executable trace_parser_flags_test
[112/175] Building CXX object wrappers/CMakeFiles/gltrace_common.dir/glmemshadow.cpp.o
[113/175] Building CXX object retrace/CMakeFiles/retrace_common.dir/retrace_stdc.cpp.o
[114/175] Building CXX object retrace/CMakeFiles/retrace_common.dir/state_writer_json.cpp.o
[115/175] Building CXX object retrace/CMakeFiles/retrace_common.dir/state_writer_ubjson.cpp.o
[116/175] Building CXX object retrace/CMakeFiles/retrace_common.dir/retrace.cpp.o
[117/175] Building CXX object cli/CMakeFiles/apitrace.dir/cli_diff.cpp.o
[118/175] Building CXX object cli/CMakeFiles/apitrace.dir/cli_diff_state.cpp.o
[119/175] Building CXX object cli/CMakeFiles/apitrace.dir/cli_pager.cpp.o
[120/175] Building CXX object cli/CMakeFiles/apitrace.dir/cli_main.cpp.o
[121/175] Building CXX object cli/CMakeFiles/apitrace.dir/cli_diff_images.cpp.o
[122/175] Building CXX object retrace/CMakeFiles/retrace_common.dir/retrace_swizzle.cpp.o
[123/175] Building CXX object cli/CMakeFiles/apitrace.dir/cli_leaks.cpp.o
[124/175] Building CXX object cli/CMakeFiles/apitrace.dir/cli_dump_images.cpp.o
[125/175] Building CXX object cli/CMakeFiles/apitrace.dir/cli_repack.cpp.o
[126/175] Building CXX object cli/CMakeFiles/apitrace.dir/cli_gltrim.cpp.o
[127/175] Building CXX object cli/CMakeFiles/apitrace.dir/cli_pickle.cpp.o
[128/175] Building CXX object cli/CMakeFiles/apitrace.dir/cli_trace.cpp.o
[129/175] Building CXX object cli/CMakeFiles/apitrace.dir/cli_retrace.cpp.o
[130/175] Building CXX object cli/CMakeFiles/apitrace.dir/cli_sed.cpp.o
[131/175] Building CXX object cli/CMakeFiles/apitrace.dir/cli_resources.cpp.o
[132/175] Building CXX object cli/CMakeFiles/apitrace.dir/cli_info.cpp.o
[133/175] Building CXX object cli/CMakeFiles/apitrace.dir/cli_trim.cpp.o
[134/175] Building CXX object retrace/CMakeFiles/retrace_common.dir/retrace_main.cpp.o
[135/175] Building CXX object cli/CMakeFiles/apitrace.dir/cli_dump.cpp.o
[136/175] Linking CXX static library retrace/libretrace_common.a
[137/175] Linking CXX executable apitrace
[138/175] Building CXX object dispatch/CMakeFiles/glproc.dir/glproc.cpp.o
[139/175] Linking CXX static library dispatch/libglproc.a
[140/175] Linking CXX static library dispatch/libglproc_egl.a
[141/175] Linking CXX static library helpers/libglhelpers.a
[142/175] Linking CXX static library wrappers/libgltrace_common.a
[143/175] Generating glretrace_gl.cpp
warning: unsupported glPointSizePointerAPPLE call
warning: unsupported glVertexArrayRangeAPPLE call
warning: unsupported glFlushVertexArrayRangeAPPLE call
warning: unsupported glMapVertexAttrib1dAPPLE call
warning: unsupported glMapVertexAttrib1fAPPLE call
warning: unsupported glMapVertexAttrib2dAPPLE call
warning: unsupported glMapVertexAttrib2fAPPLE call
warning: unsupported glMatrixIndexPointerARB call
warning: unsupported glWeightPointerARB call
warning: unsupported glElementPointerATI call
warning: unsupported glTangentPointerEXT call
warning: unsupported glBinormalPointerEXT call
warning: unsupported glMultiTexCoordPointerEXT call
warning: unsupported glSetInvariantEXT call
warning: unsupported glSetLocalConstantEXT call
warning: unsupported glVariantbvEXT call
warning: unsupported glVariantsvEXT call
warning: unsupported glVariantivEXT call
warning: unsupported glVariantfvEXT call
warning: unsupported glVariantdvEXT call
warning: unsupported glVariantubvEXT call
warning: unsupported glVariantusvEXT call
warning: unsupported glVariantuivEXT call
warning: unsupported glVariantPointerEXT call
warning: unsupported glVertexWeightPointerEXT call
warning: unsupported glColorPointerListIBM call
warning: unsupported glSecondaryColorPointerListIBM call
warning: unsupported glEdgeFlagPointerListIBM call
warning: unsupported glFogCoordPointerListIBM call
warning: unsupported glIndexPointerListIBM call
warning: unsupported glNormalPointerListIBM call
warning: unsupported glTexCoordPointerListIBM call
warning: unsupported glVertexPointerListIBM call
warning: unsupported glVertexPointervINTEL call
warning: unsupported glNormalPointervINTEL call
warning: unsupported glColorPointervINTEL call
warning: unsupported glTexCoordPointervINTEL call
warning: unsupported glObjectPtrLabel call
warning: unsupported glObjectPtrLabelKHR call
warning: unsupported glMapControlPointsNV call
warning: unsupported glMapParameterivNV call
warning: unsupported glMapParameterfvNV call
warning: unsupported glPixelDataRangeNV call
warning: unsupported glVDPAUInitNV call
warning: unsupported glVDPAURegisterVideoSurfaceNV call
warning: unsupported glVDPAURegisterOutputSurfaceNV call
warning: unsupported glVertexArrayRangeNV call
warning: unsupported glMatrixIndexPointerOES call
warning: unsupported glWeightPointerOES call
warning: unsupported glPointSizePointerOES call
warning: unsupported glTexImage4DSGIS call
warning: unsupported glTexSubImage4DSGIS call
warning: unsupported glIglooInterfaceSGIX call
warning: unsupported glInstrumentsBufferSGIX call
warning: unsupported glDeformationMap3dSGIX call
warning: unsupported glDeformationMap3fSGIX call
warning: unsupported glReplacementCodeuivSUN call
warning: unsupported glReplacementCodeusvSUN call
warning: unsupported glReplacementCodeubvSUN call
warning: unsupported glReplacementCodePointerSUN call
[144/175] Generating glstate_params.cpp
[145/175] Generating egltrace.cpp
[146/175] Building CXX object retrace/CMakeFiles/glretrace_common.dir/glretrace_wgl_font_bitmaps.cpp.o
[147/175] Building CXX object wrappers/CMakeFiles/egltrace.dir/dlsym.cpp.o
[148/175] Building CXX object retrace/CMakeFiles/glretrace_common.dir/glretrace_egl.cpp.o
[149/175] Building CXX object retrace/CMakeFiles/glretrace_common.dir/glretrace_ws.cpp.o
[150/175] Building CXX object retrace/CMakeFiles/glretrace_common.dir/glretrace_glx.cpp.o
[151/175] Building CXX object retrace/CMakeFiles/glretrace_common.dir/glretrace_cgl.cpp.o
[152/175] Building CXX object retrace/CMakeFiles/glretrace_common.dir/glretrace_wgl.cpp.o
[153/175] Building CXX object retrace/CMakeFiles/glretrace_common.dir/glstate.cpp.o
[154/175] Building CXX object retrace/CMakeFiles/glretrace_common.dir/glws.cpp.o
[155/175] Building CXX object retrace/CMakeFiles/glretrace_common.dir/glretrace_main.cpp.o
[156/175] Building CXX object retrace/CMakeFiles/glretrace_common.dir/glretrace_wgl_font_outlines.cpp.o
[157/175] Building CXX object retrace/CMakeFiles/glretrace_common.dir/glstate_formats.cpp.o
[158/175] Building CXX object retrace/CMakeFiles/glretrace_common.dir/glstate_images.cpp.o
[159/175] Building CXX object retrace/CMakeFiles/glretrace_common.dir/glstate_shaders.cpp.o
[160/175] Building CXX object retrace/CMakeFiles/glretrace_common.dir/metric_helper.cpp.o
[161/175] Building CXX object retrace/CMakeFiles/glretrace_common.dir/metric_writer.cpp.o
[162/175] Building CXX object retrace/CMakeFiles/glretrace_common.dir/metric_backend_intel_perfquery.cpp.o
[163/175] Building CXX object retrace/CMakeFiles/glretrace_common.dir/metric_backend_amd_perfmon.cpp.o
[164/175] Building CXX object frametrim/CMakeFiles/gltrim.dir/ft_matrixstate.cpp.o
[165/175] Building CXX object retrace/CMakeFiles/glretrace_common.dir/metric_backend_opengl.cpp.o
[166/175] Building CXX object frametrim/CMakeFiles/gltrim.dir/ft_tracecall.cpp.o
[167/175] Building CXX object frametrim/CMakeFiles/gltrim.dir/ft_dependecyobject.cpp.o
[168/175] Building CXX object frametrim/CMakeFiles/gltrim.dir/ft_main.cpp.o
TOPDIR/build/tmp/work/core2-32-yoe-linux/apitrace/10.0-r0/git/frametrim/ft_main.cpp:140:14: warning: variable 'ncalls' set but not used [-Wunused-but-set-variable]
unsigned ncalls = 0;
^
TOPDIR/build/tmp/work/core2-32-yoe-linux/apitrace/10.0-r0/git/frametrim/ft_main.cpp:141:14: warning: variable 'ncalls2' set but not used [-Wunused-but-set-variable]
unsigned ncalls2 = 0;
^
2 warnings generated.
[169/175] Building CXX object retrace/CMakeFiles/glretrace_common.dir/glstate_params.cpp.o
[170/175] Building CXX object frametrim/CMakeFiles/gltrim.dir/ft_frametrimmer.cpp.o
[171/175] Building CXX object wrappers/CMakeFiles/egltrace.dir/egltrace.cpp.o
wrappers/egltrace.cpp:167:1: warning: unused function '_fakeStringMarker' [-Wunused-function]
_fakeStringMarker(const std::string &s) {
^
1 warning generated.
[172/175] Linking CXX shared library wrappers/egltrace.so
FAILED: wrappers/egltrace.so
: && TOPDIR/build/tmp/work/core2-32-yoe-linux/apitrace/10.0-r0/recipe-sysroot-native/usr/bin/i686-yoe-linux/i686-yoe-linux-clang++ -fPIC -target i686-yoe-linux -m32 -march=core2 -mtune=core2 -msse3 -mfpmath=sse -mlittle-endian -Qunused-arguments --sysroot=TOPDIR/build/tmp/work/core2-32-yoe-linux/apitrace/10.0-r0/recipe-sysroot -O2 -pipe -g -feliminate-unused-debug-types -fmacro-prefix-map=TOPDIR/build/tmp/work/core2-32-yoe-linux/apitrace/10.0-r0=/usr/src/debug/apitrace/10.0-r0 -fdebug-prefix-map=TOPDIR/build/tmp/work/core2-32-yoe-linux/apitrace/10.0-r0=/usr/src/debug/apitrace/10.0-r0 -fdebug-prefix-map=TOPDIR/build/tmp/work/core2-32-yoe-linux/apitrace/10.0-r0/recipe-sysroot= -fdebug-prefix-map=TOPDIR/build/tmp/work/core2-32-yoe-linux/apitrace/10.0-r0/recipe-sysroot-native= -fvisibility-inlines-hidden -target i686-yoe-linux -m32 -march=core2 -mtune=core2 -msse3 -mfpmath=sse -mlittle-endian -Qunused-arguments --sysroot=TOPDIR/build/tmp/work/core2-32-yoe-linux/apitrace/10.0-r0/recipe-sysroot -fvisibility=hidden -Wall -Wno-sign-compare -fno-strict-aliasing -fno-rtti -fno-exceptions -fmessage-length=0 -fno-omit-frame-pointer -Wl,-O1 -Wl,--hash-style=gnu -Wl,--as-needed -Wl,-z,relro,-z,now -Wl,-Bsymbolic -Wl,-Bsymbolic-functions -Wl,-z,defs -Wl,--version-script=TOPDIR/build/tmp/work/core2-32-yoe-linux/apitrace/10.0-r0/git/wrappers/egltrace.version -shared -Wl,-soname,egltrace.so -o wrappers/egltrace.so wrappers/CMakeFiles/egltrace.dir/egltrace.cpp.o wrappers/CMakeFiles/egltrace.dir/dlsym.cpp.o wrappers/libgltrace_common.a dispatch/libglproc_egl.a -ldl helpers/libglhelpers.a wrappers/libtrace.a lib/trace/libcommon.a lib/highlight/libhighlight.a lib/os/libos.a -ldl thirdparty/libbacktrace/libbacktrace.a thirdparty/brotli/libbrotli_dec.a thirdparty/brotli/libbrotli_common.a lib/guids/libguids.a thirdparty/crc32c/libcrc32c.a thirdparty/snappy/libsnappy_bundled.a dispatch/libglproc.a && :
TOPDIR/build/tmp/work/core2-32-yoe-linux/apitrace/10.0-r0/recipe-sysroot-native/usr/bin/i686-yoe-linux/i686-yoe-linux-ld: TOPDIR/build/tmp/work/core2-32-yoe-linux/apitrace/10.0-r0/recipe-sysroot-native/usr/bin/i686-yoe-linux/i686-yoe-linux-ld: DWARF error: invalid or unhandled FORM value: 0x23
wrappers/CMakeFiles/egltrace.dir/dlsym.cpp.o: in function `dlsym':
dlsym.cpp:(.text+0x2f): undefined reference to `__libc_dlopen_mode'
TOPDIR/build/tmp/work/core2-32-yoe-linux/apitrace/10.0-r0/recipe-sysroot-native/usr/bin/i686-yoe-linux/i686-yoe-linux-ld: dlsym.cpp:(.text+0x45): undefined reference to `__libc_dlsym'
TOPDIR/build/tmp/work/core2-32-yoe-linux/apitrace/10.0-r0/recipe-sysroot-native/usr/bin/i686-yoe-linux/i686-yoe-linux-ld: wrappers/CMakeFiles/egltrace.dir/dlsym.cpp.o: in function `dlopen':
dlsym.cpp:(.text+0x122): undefined reference to `__libc_dlopen_mode'
TOPDIR/build/tmp/work/core2-32-yoe-linux/apitrace/10.0-r0/recipe-sysroot-native/usr/bin/i686-yoe-linux/i686-yoe-linux-ld: dlsym.cpp:(.text+0x13c): undefined reference to `__libc_dlsym'
TOPDIR/build/tmp/work/core2-32-yoe-linux/apitrace/10.0-r0/recipe-sysroot-native/usr/bin/i686-yoe-linux/i686-yoe-linux-ld: dlsym.cpp:(.text+0x1eb): undefined reference to `__libc_dlopen_mode'
TOPDIR/build/tmp/work/core2-32-yoe-linux/apitrace/10.0-r0/recipe-sysroot-native/usr/bin/i686-yoe-linux/i686-yoe-linux-ld: dlsym.cpp:(.text+0x201): undefined reference to `__libc_dlsym'
TOPDIR/build/tmp/work/core2-32-yoe-linux/apitrace/10.0-r0/recipe-sysroot-native/usr/bin/i686-yoe-linux/i686-yoe-linux-ld: dlsym.cpp:(.text+0x2bf): undefined reference to `__libc_dlopen_mode'
TOPDIR/build/tmp/work/core2-32-yoe-linux/apitrace/10.0-r0/recipe-sysroot-native/usr/bin/i686-yoe-linux/i686-yoe-linux-ld: dlsym.cpp:(.text+0x2d9): undefined reference to `__libc_dlsym'
TOPDIR/build/tmp/work/core2-32-yoe-linux/apitrace/10.0-r0/recipe-sysroot-native/usr/bin/i686-yoe-linux/i686-yoe-linux-ld: dlsym.cpp:(.text+0x414): undefined reference to `__libc_dlopen_mode'
TOPDIR/build/tmp/work/core2-32-yoe-linux/apitrace/10.0-r0/recipe-sysroot-native/usr/bin/i686-yoe-linux/i686-yoe-linux-ld: dlsym.cpp:(.text+0x42a): undefined reference to `__libc_dlsym'
clang-13: error: linker command failed with exit code 1 (use -v to see invocation)
[173/175] Building CXX object retrace/CMakeFiles/glretrace_common.dir/glretrace_gl.cpp.o
ninja: build stopped: subcommand failed.
WARNING: TOPDIR/build/tmp/work/core2-32-yoe-linux/apitrace/10.0-r0/temp/run.do_compile.13462:156 exit 1 from 'eval ${DESTDIR:+DESTDIR=${DESTDIR} } cmake --build 'TOPDIR/build/tmp/work/core2-32-yoe-linux/apitrace/10.0-r0/build' "$@" -- ${EXTRA_OECMAKE_BUILD}'
WARNING: Backtrace (BB generated script):
#1: cmake_runcmake_build, TOPDIR/build/tmp/work/core2-32-yoe-linux/apitrace/10.0-r0/temp/run.do_compile.13462, line 156
#2: cmake_do_compile, TOPDIR/build/tmp/work/core2-32-yoe-linux/apitrace/10.0-r0/temp/run.do_compile.13462, line 150
#3: do_compile, TOPDIR/build/tmp/work/core2-32-yoe-linux/apitrace/10.0-r0/temp/run.do_compile.13462, line 145
#4: main, TOPDIR/build/tmp/work/core2-32-yoe-linux/apitrace/10.0-r0/temp/run.do_compile.13462, line 169
ERROR: Execution of 'TOPDIR/build/tmp/work/core2-32-yoe-linux/apitrace/10.0-r0/temp/run.do_compile.13462' failed with exit code 1:
[1/175] Building CXX object thirdparty/snappy/CMakeFiles/snappy_bundled.dir/snappy-sinksource.cc.o
[2/175] Building CXX object thirdparty/snappy/CMakeFiles/snappy_bundled.dir/snappy-c.cc.o
[3/175] Building C object thirdparty/brotli/CMakeFiles/brotli_enc.dir/c/enc/cluster.c.o
[4/175] Building C object thirdparty/brotli/CMakeFiles/brotli_enc.dir/c/enc/bit_cost.c.o
[5/175] Building CXX object thirdparty/snappy/CMakeFiles/snappy_bundled.dir/snappy-stubs-internal.cc.o
[6/175] Building C object thirdparty/brotli/CMakeFiles/brotli_enc.dir/c/enc/dictionary_hash.c.o
[7/175] Building C object thirdparty/brotli/CMakeFiles/brotli_enc.dir/c/enc/backward_references_hq.c.o
[8/175] Building C object thirdparty/brotli/CMakeFiles/brotli_enc.dir/c/enc/entropy_encode.c.o
[9/175] Building C object thirdparty/brotli/CMakeFiles/brotli_enc.dir/c/enc/brotli_bit_stream.c.o
[10/175] Building C object thirdparty/brotli/CMakeFiles/brotli_enc.dir/c/enc/literal_cost.c.o
[11/175] Building C object thirdparty/brotli/CMakeFiles/brotli_enc.dir/c/enc/memory.c.o
[12/175] Building C object thirdparty/brotli/CMakeFiles/brotli_enc.dir/c/enc/block_splitter.c.o
[13/175] Building C object thirdparty/brotli/CMakeFiles/brotli_enc.dir/c/enc/histogram.c.o
[14/175] Building C object thirdparty/brotli/CMakeFiles/brotli_enc.dir/c/enc/utf8_util.c.o
[15/175] Building CXX object thirdparty/snappy/CMakeFiles/snappy_bundled.dir/snappy.cc.o
[16/175] Building C object thirdparty/brotli/CMakeFiles/brotli_dec.dir/c/dec/bit_reader.c.o
[17/175] Building C object thirdparty/brotli/CMakeFiles/brotli_enc.dir/c/enc/encoder_dict.c.o
[18/175] Linking CXX static library thirdparty/snappy/libsnappy_bundled.a
[19/175] Building C object thirdparty/brotli/CMakeFiles/brotli_enc.dir/c/enc/compress_fragment.c.o
[20/175] Building C object thirdparty/brotli/CMakeFiles/brotli_enc.dir/c/enc/static_dict.c.o
[21/175] Building C object thirdparty/brotli/CMakeFiles/brotli_dec.dir/c/dec/huffman.c.o
[22/175] Building C object thirdparty/brotli/CMakeFiles/brotli_dec.dir/c/dec/state.c.o
[23/175] Building C object thirdparty/crc32c/CMakeFiles/crc32c.dir/crc32c.c.o
[24/175] Building C object thirdparty/brotli/CMakeFiles/brotli_common.dir/c/common/transform.c.o
[25/175] Building C object thirdparty/brotli/CMakeFiles/brotli_enc.dir/c/enc/metablock.c.o
[26/175] Linking C static library thirdparty/crc32c/libcrc32c.a
[27/175] Building C object thirdparty/libbacktrace/CMakeFiles/stest.dir/stest.c.o
[28/175] Building C object thirdparty/libbacktrace/CMakeFiles/btest.dir/btest.c.o
TOPDIR/build/tmp/work/core2-32-yoe-linux/apitrace/10.0-r0/git/thirdparty/libbacktrace/btest.c:51:51: warning: unknown attribute 'noclone' ignored [-Wunknown-attributes]
static int test1 (void) __attribute__ ((noinline, noclone, unused));
^~~~~~~
TOPDIR/build/tmp/work/core2-32-yoe-linux/apitrace/10.0-r0/git/thirdparty/libbacktrace/btest.c:52:47: warning: unknown attribute 'noclone' ignored [-Wunknown-attributes]
static int f2 (int) __attribute__ ((noinline, noclone));
^~~~~~~
TOPDIR/build/tmp/work/core2-32-yoe-linux/apitrace/10.0-r0/git/thirdparty/libbacktrace/btest.c:53:52: warning: unknown attribute 'noclone' ignored [-Wunknown-attributes]
static int f3 (int, int) __attribute__ ((noinline, noclone));
^~~~~~~
TOPDIR/build/tmp/work/core2-32-yoe-linux/apitrace/10.0-r0/git/thirdparty/libbacktrace/btest.c:165:51: warning: unknown attribute 'noclone' ignored [-Wunknown-attributes]
static int test3 (void) __attribute__ ((noinline, noclone, unused));
^~~~~~~
TOPDIR/build/tmp/work/core2-32-yoe-linux/apitrace/10.0-r0/git/thirdparty/libbacktrace/btest.c:166:48: warning: unknown attribute 'noclone' ignored [-Wunknown-attributes]
static int f22 (int) __attribute__ ((noinline, noclone));
^~~~~~~
TOPDIR/build/tmp/work/core2-32-yoe-linux/apitrace/10.0-r0/git/thirdparty/libbacktrace/btest.c:167:53: warning: unknown attribute 'noclone' ignored [-Wunknown-attributes]
static int f23 (int, int) __attribute__ ((noinline, noclone));
^~~~~~~
6 warnings generated.
[29/175] Building C object thirdparty/libbacktrace/CMakeFiles/backtrace.dir/simple.c.o
[30/175] Building C object thirdparty/libbacktrace/CMakeFiles/backtrace.dir/backtrace.c.o
[31/175] Building C object thirdparty/libbacktrace/CMakeFiles/backtrace.dir/unknown.c.o
[32/175] Building C object thirdparty/brotli/CMakeFiles/brotli_common.dir/c/common/dictionary.c.o
[33/175] Building C object thirdparty/libbacktrace/CMakeFiles/backtrace.dir/mmapio.c.o
[34/175] Building C object thirdparty/libbacktrace/CMakeFiles/backtrace.dir/atomic.c.o
[35/175] Linking C static library thirdparty/brotli/libbrotli_common.a
[36/175] Building C object thirdparty/libbacktrace/CMakeFiles/backtrace.dir/fileline.c.o
[37/175] Building C object thirdparty/libbacktrace/CMakeFiles/backtrace.dir/mmap.c.o
[38/175] Building C object thirdparty/libbacktrace/CMakeFiles/backtrace.dir/print.c.o
[39/175] Building C object thirdparty/libbacktrace/CMakeFiles/backtrace.dir/state.c.o
[40/175] Building C object thirdparty/libbacktrace/CMakeFiles/backtrace.dir/posix.c.o
[41/175] Building C object thirdparty/libbacktrace/CMakeFiles/backtrace.dir/sort.c.o
[42/175] Building C object thirdparty/libbacktrace/CMakeFiles/backtrace.dir/testlib.c.o
[43/175] Building C object thirdparty/md5/CMakeFiles/md5_bundled.dir/md5.c.o
[44/175] Linking C static library thirdparty/libbacktrace/libbacktrace.a
[45/175] Linking C static library thirdparty/md5/libmd5_bundled.a
[46/175] Building C object thirdparty/brotli/CMakeFiles/brotli_enc.dir/c/enc/encode.c.o
[47/175] Linking C executable stest
[48/175] Linking C executable btest
[49/175] Building CXX object lib/os/CMakeFiles/os.dir/os_crtdbg.cpp.o
[50/175] Building C object thirdparty/brotli/CMakeFiles/brotli_enc.dir/c/enc/compress_fragment_two_pass.c.o
[51/175] Building C object thirdparty/brotli/CMakeFiles/brotli_dec.dir/c/dec/decode.c.o
[52/175] Linking C static library thirdparty/brotli/libbrotli_dec.a
[53/175] Building CXX object lib/guids/CMakeFiles/guids.dir/guids.cpp.o
[54/175] Linking CXX static library lib/guids/libguids.a
[55/175] Building CXX object lib/highlight/CMakeFiles/highlight.dir/highlight.cpp.o
[56/175] Linking CXX static library lib/highlight/libhighlight.a
[57/175] Building CXX object lib/os/CMakeFiles/os.dir/os_posix.cpp.o
[58/175] Building C object thirdparty/brotli/CMakeFiles/brotli_enc.dir/c/enc/backward_references.c.o
[59/175] Building CXX object lib/os/CMakeFiles/os.dir/os_backtrace.cpp.o
[60/175] Linking C static library thirdparty/brotli/libbrotli_enc.a
[61/175] Linking CXX static library lib/os/libos.a
[62/175] Building CXX object lib/image/CMakeFiles/image.dir/image_md5.cpp.o
[63/175] Building CXX object lib/image/CMakeFiles/image.dir/image_png.cpp.o
[64/175] Building CXX object lib/image/CMakeFiles/image.dir/image_bmp.cpp.o
[65/175] Building CXX object lib/image/CMakeFiles/image.dir/image_pnm.cpp.o
[66/175] Building CXX object lib/os/CMakeFiles/os_thread_test.dir/os_thread_test.cpp.o
[67/175] Building CXX object lib/image/CMakeFiles/image.dir/image_raw.cpp.o
[68/175] Linking CXX static library lib/image/libimage.a
[69/175] Building CXX object lib/trace/CMakeFiles/common.dir/trace_fast_callset.cpp.o
[70/175] Building CXX object lib/trace/CMakeFiles/common.dir/trace_file.cpp.o
[71/175] Building CXX object lib/trace/CMakeFiles/common.dir/trace_callset.cpp.o
[72/175] Building CXX object lib/trace/CMakeFiles/trace_parser_flags_test.dir/trace_parser_flags_test.cpp.o
[73/175] Building CXX object lib/trace/CMakeFiles/common.dir/trace_dump.cpp.o
[74/175] Building CXX object lib/trace/CMakeFiles/common.dir/trace_file_brotli.cpp.o
[75/175] Building CXX object lib/trace/CMakeFiles/common.dir/trace_model.cpp.o
[76/175] Building CXX object lib/trace/CMakeFiles/common.dir/trace_file_zlib.cpp.o
[77/175] Building CXX object lib/trace/CMakeFiles/common.dir/trace_file_read.cpp.o
[78/175] Building CXX object lib/trace/CMakeFiles/common.dir/trace_file_snappy.cpp.o
[79/175] Building CXX object lib/trace/CMakeFiles/common.dir/trace_parser_loop.cpp.o
[80/175] Building CXX object lib/trace/CMakeFiles/common.dir/trace_writer_model.cpp.o
[81/175] Building CXX object lib/trace/CMakeFiles/common.dir/trace_writer.cpp.o
[82/175] Building CXX object lib/trace/CMakeFiles/common.dir/trace_option.cpp.o
[83/175] Building CXX object wrappers/CMakeFiles/trace.dir/assert.cpp.o
[84/175] Building CXX object lib/trace/CMakeFiles/common.dir/trace_writer_local.cpp.o
[85/175] Generating glproc.hpp, glproc.cpp
[86/175] Building CXX object lib/trace/CMakeFiles/common.dir/trace_ostream_zlib.cpp.o
[87/175] Building CXX object lib/trace/CMakeFiles/common.dir/trace_ostream_snappy.cpp.o
[88/175] Building CXX object dispatch/CMakeFiles/glproc_egl.dir/glproc_egl.cpp.o
[89/175] Building CXX object lib/trace/CMakeFiles/common.dir/trace_profiler.cpp.o
[90/175] Building CXX object wrappers/CMakeFiles/trace.dir/memtrace.cpp.o
[91/175] Building CXX object retrace/CMakeFiles/retrace_common.dir/json.cpp.o
[92/175] Building CXX object lib/trace/CMakeFiles/common.dir/trace_parser.cpp.o
[93/175] Building CXX object helpers/CMakeFiles/glhelpers.dir/eglsize.cpp.o
[94/175] Building CXX object helpers/CMakeFiles/glhelpers.dir/glfeatures.cpp.o
[95/175] Building CXX object wrappers/CMakeFiles/gltrace_common.dir/glcaps.cpp.o
[96/175] Building CXX object wrappers/CMakeFiles/gltrace_common.dir/gltrace_state.cpp.o
[97/175] Building CXX object wrappers/CMakeFiles/gltrace_common.dir/config.cpp.o
[98/175] Building CXX object wrappers/CMakeFiles/gltrace_common.dir/gltrace_unpack_compressed.cpp.o
[99/175] Building CXX object lib/guids/CMakeFiles/guids_test.dir/guids_test.cpp.o
[100/175] Building CXX object lib/trace/CMakeFiles/common.dir/trace_parser_flags.cpp.o
[101/175] Linking CXX static library lib/trace/libcommon.a
[102/175] Building CXX object wrappers/CMakeFiles/gltrace_common.dir/gltrace_arrays.cpp.o
[103/175] Linking CXX static library wrappers/libtrace.a
[104/175] Building CXX object CMakeFiles/gtest.dir/thirdparty/gtest/src/gtest-all.cc.o
[105/175] Building CXX object retrace/CMakeFiles/retrace_common.dir/state_writer.cpp.o
[106/175] Linking CXX static library libgtest.a
[107/175] Building CXX object retrace/CMakeFiles/retrace_common.dir/process_name.cpp.o
[108/175] Linking CXX executable os_thread_test
[109/175] Linking CXX executable guids_test
[110/175] Building CXX object retrace/CMakeFiles/retrace_common.dir/ws.cpp.o
[111/175] Linking CXX executable trace_parser_flags_test
[112/175] Building CXX object wrappers/CMakeFiles/gltrace_common.dir/glmemshadow.cpp.o
[113/175] Building CXX object retrace/CMakeFiles/retrace_common.dir/retrace_stdc.cpp.o
[114/175] Building CXX object retrace/CMakeFiles/retrace_common.dir/state_writer_json.cpp.o
[115/175] Building CXX object retrace/CMakeFiles/retrace_common.dir/state_writer_ubjson.cpp.o
[116/175] Building CXX object retrace/CMakeFiles/retrace_common.dir/retrace.cpp.o
[117/175] Building CXX object cli/CMakeFiles/apitrace.dir/cli_diff.cpp.o
[118/175] Building CXX object cli/CMakeFiles/apitrace.dir/cli_diff_state.cpp.o
[119/175] Building CXX object cli/CMakeFiles/apitrace.dir/cli_pager.cpp.o
[120/175] Building CXX object cli/CMakeFiles/apitrace.dir/cli_main.cpp.o
[121/175] Building CXX object cli/CMakeFiles/apitrace.dir/cli_diff_images.cpp.o
[122/175] Building CXX object retrace/CMakeFiles/retrace_common.dir/retrace_swizzle.cpp.o
[123/175] Building CXX object cli/CMakeFiles/apitrace.dir/cli_leaks.cpp.o
[124/175] Building CXX object cli/CMakeFiles/apitrace.dir/cli_dump_images.cpp.o
[125/175] Building CXX object cli/CMakeFiles/apitrace.dir/cli_repack.cpp.o
[126/175] Building CXX object cli/CMakeFiles/apitrace.dir/cli_gltrim.cpp.o
[127/175] Building CXX object cli/CMakeFiles/apitrace.dir/cli_pickle.cpp.o
[128/175] Building CXX object cli/CMakeFiles/apitrace.dir/cli_trace.cpp.o
[129/175] Building CXX object cli/CMakeFiles/apitrace.dir/cli_retrace.cpp.o
[130/175] Building CXX object cli/CMakeFiles/apitrace.dir/cli_sed.cpp.o
[131/175] Building CXX object cli/CMakeFiles/apitrace.dir/cli_resources.cpp.o
[132/175] Building CXX object cli/CMakeFiles/apitrace.dir/cli_info.cpp.o
[133/175] Building CXX object cli/CMakeFiles/apitrace.dir/cli_trim.cpp.o
[134/175] Building CXX object retrace/CMakeFiles/retrace_common.dir/retrace_main.cpp.o
[135/175] Building CXX object cli/CMakeFiles/apitrace.dir/cli_dump.cpp.o
[136/175] Linking CXX static library retrace/libretrace_common.a
[137/175] Linking CXX executable apitrace
[138/175] Building CXX object dispatch/CMakeFiles/glproc.dir/glproc.cpp.o
[139/175] Linking CXX static library dispatch/libglproc.a
[140/175] Linking CXX static library dispatch/libglproc_egl.a
[141/175] Linking CXX static library helpers/libglhelpers.a
[142/175] Linking CXX static library wrappers/libgltrace_common.a
[143/175] Generating glretrace_gl.cpp
warning: unsupported glPointSizePointerAPPLE call
warning: unsupported glVertexArrayRangeAPPLE call
warning: unsupported glFlushVertexArrayRangeAPPLE call
warning: unsupported glMapVertexAttrib1dAPPLE call
warning: unsupported glMapVertexAttrib1fAPPLE call
warning: unsupported glMapVertexAttrib2dAPPLE call
warning: unsupported glMapVertexAttrib2fAPPLE call
warning: unsupported glMatrixIndexPointerARB call
warning: unsupported glWeightPointerARB call
warning: unsupported glElementPointerATI call
warning: unsupported glTangentPointerEXT call
warning: unsupported glBinormalPointerEXT call
warning: unsupported glMultiTexCoordPointerEXT call
warning: unsupported glSetInvariantEXT call
warning: unsupported glSetLocalConstantEXT call
warning: unsupported glVariantbvEXT call
warning: unsupported glVariantsvEXT call
warning: unsupported glVariantivEXT call
warning: unsupported glVariantfvEXT call
warning: unsupported glVariantdvEXT call
warning: unsupported glVariantubvEXT call
warning: unsupported glVariantusvEXT call
warning: unsupported glVariantuivEXT call
warning: unsupported glVariantPointerEXT call
warning: unsupported glVertexWeightPointerEXT call
warning: unsupported glColorPointerListIBM call
warning: unsupported glSecondaryColorPointerListIBM call
warning: unsupported glEdgeFlagPointerListIBM call
warning: unsupported glFogCoordPointerListIBM call
warning: unsupported glIndexPointerListIBM call
warning: unsupported glNormalPointerListIBM call
warning: unsupported glTexCoordPointerListIBM call
warning: unsupported glVertexPointerListIBM call
warning: unsupported glVertexPointervINTEL call
warning: unsupported glNormalPointervINTEL call
warning: unsupported glColorPointervINTEL call
warning: unsupported glTexCoordPointervINTEL call
warning: unsupported glObjectPtrLabel call
warning: unsupported glObjectPtrLabelKHR call
warning: unsupported glMapControlPointsNV call
warning: unsupported glMapParameterivNV call
warning: unsupported glMapParameterfvNV call
warning: unsupported glPixelDataRangeNV call
warning: unsupported glVDPAUInitNV call
warning: unsupported glVDPAURegisterVideoSurfaceNV call
warning: unsupported glVDPAURegisterOutputSurfaceNV call
warning: unsupported glVertexArrayRangeNV call
warning: unsupported glMatrixIndexPointerOES call
warning: unsupported glWeightPointerOES call
warning: unsupported glPointSizePointerOES call
warning: unsupported glTexImage4DSGIS call
warning: unsupported glTexSubImage4DSGIS call
warning: unsupported glIglooInterfaceSGIX call
warning: unsupported glInstrumentsBufferSGIX call
warning: unsupported glDeformationMap3dSGIX call
warning: unsupported glDeformationMap3fSGIX call
warning: unsupported glReplacementCodeuivSUN call
warning: unsupported glReplacementCodeusvSUN call
warning: unsupported glReplacementCodeubvSUN call
warning: unsupported glReplacementCodePointerSUN call
[144/175] Generating glstate_params.cpp
[145/175] Generating egltrace.cpp
[146/175] Building CXX object retrace/CMakeFiles/glretrace_common.dir/glretrace_wgl_font_bitmaps.cpp.o
[147/175] Building CXX object wrappers/CMakeFiles/egltrace.dir/dlsym.cpp.o
[148/175] Building CXX object retrace/CMakeFiles/glretrace_common.dir/glretrace_egl.cpp.o
[149/175] Building CXX object retrace/CMakeFiles/glretrace_common.dir/glretrace_ws.cpp.o
[150/175] Building CXX object retrace/CMakeFiles/glretrace_common.dir/glretrace_glx.cpp.o
[151/175] Building CXX object retrace/CMakeFiles/glretrace_common.dir/glretrace_cgl.cpp.o
[152/175] Building CXX object retrace/CMakeFiles/glretrace_common.dir/glretrace_wgl.cpp.o
[153/175] Building CXX object retrace/CMakeFiles/glretrace_common.dir/glstate.cpp.o
[154/175] Building CXX object retrace/CMakeFiles/glretrace_common.dir/glws.cpp.o
[155/175] Building CXX object retrace/CMakeFiles/glretrace_common.dir/glretrace_main.cpp.o
[156/175] Building CXX object retrace/CMakeFiles/glretrace_common.dir/glretrace_wgl_font_outlines.cpp.o
[157/175] Building CXX object retrace/CMakeFiles/glretrace_common.dir/glstate_formats.cpp.o
[158/175] Building CXX object retrace/CMakeFiles/glretrace_common.dir/glstate_images.cpp.o
[159/175] Building CXX object retrace/CMakeFiles/glretrace_common.dir/glstate_shaders.cpp.o
[160/175] Building CXX object retrace/CMakeFiles/glretrace_common.dir/metric_helper.cpp.o
[161/175] Building CXX object retrace/CMakeFiles/glretrace_common.dir/metric_writer.cpp.o
[162/175] Building CXX object retrace/CMakeFiles/glretrace_common.dir/metric_backend_intel_perfquery.cpp.o
[163/175] Building CXX object retrace/CMakeFiles/glretrace_common.dir/metric_backend_amd_perfmon.cpp.o
[164/175] Building CXX object frametrim/CMakeFiles/gltrim.dir/ft_matrixstate.cpp.o
[165/175] Building CXX object retrace/CMakeFiles/glretrace_common.dir/metric_backend_opengl.cpp.o
[166/175] Building CXX object frametrim/CMakeFiles/gltrim.dir/ft_tracecall.cpp.o
[167/175] Building CXX object frametrim/CMakeFiles/gltrim.dir/ft_dependecyobject.cpp.o
[168/175] Building CXX object frametrim/CMakeFiles/gltrim.dir/ft_main.cpp.o
TOPDIR/build/tmp/work/core2-32-yoe-linux/apitrace/10.0-r0/git/frametrim/ft_main.cpp:140:14: warning: variable 'ncalls' set but not used [-Wunused-but-set-variable]
unsigned ncalls = 0;
^
TOPDIR/build/tmp/work/core2-32-yoe-linux/apitrace/10.0-r0/git/frametrim/ft_main.cpp:141:14: warning: variable 'ncalls2' set but not used [-Wunused-but-set-variable]
unsigned ncalls2 = 0;
^
2 warnings generated.
[169/175] Building CXX object retrace/CMakeFiles/glretrace_common.dir/glstate_params.cpp.o
[170/175] Building CXX object frametrim/CMakeFiles/gltrim.dir/ft_frametrimmer.cpp.o
[171/175] Building CXX object wrappers/CMakeFiles/egltrace.dir/egltrace.cpp.o
wrappers/egltrace.cpp:167:1: warning: unused function '_fakeStringMarker' [-Wunused-function]
_fakeStringMarker(const std::string &s) {
^
1 warning generated.
[172/175] Linking CXX shared library wrappers/egltrace.so
FAILED: wrappers/egltrace.so
: && TOPDIR/build/tmp/work/core2-32-yoe-linux/apitrace/10.0-r0/recipe-sysroot-native/usr/bin/i686-yoe-linux/i686-yoe-linux-clang++ -fPIC -target i686-yoe-linux -m32 -march=core2 -mtune=core2 -msse3 -mfpmath=sse -mlittle-endian -Qunused-arguments --sysroot=TOPDIR/build/tmp/work/core2-32-yoe-linux/apitrace/10.0-r0/recipe-sysroot -O2 -pipe -g -feliminate-unused-debug-types -fmacro-prefix-map=TOPDIR/build/tmp/work/core2-32-yoe-linux/apitrace/10.0-r0=/usr/src/debug/apitrace/10.0-r0 -fdebug-prefix-map=TOPDIR/build/tmp/work/core2-32-yoe-linux/apitrace/10.0-r0=/usr/src/debug/apitrace/10.0-r0 -fdebug-prefix-map=TOPDIR/build/tmp/work/core2-32-yoe-linux/apitrace/10.0-r0/recipe-sysroot= -fdebug-prefix-map=TOPDIR/build/tmp/work/core2-32-yoe-linux/apitrace/10.0-r0/recipe-sysroot-native= -fvisibility-inlines-hidden -target i686-yoe-linux -m32 -march=core2 -mtune=core2 -msse3 -mfpmath=sse -mlittle-endian -Qunused-arguments --sysroot=TOPDIR/build/tmp/work/core2-32-yoe-linux/apitrace/10.0-r0/recipe-sysroot -fvisibility=hidden -Wall -Wno-sign-compare -fno-strict-aliasing -fno-rtti -fno-exceptions -fmessage-length=0 -fno-omit-frame-pointer -Wl,-O1 -Wl,--hash-style=gnu -Wl,--as-needed -Wl,-z,relro,-z,now -Wl,-Bsymbolic -Wl,-Bsymbolic-functions -Wl,-z,defs -Wl,--version-script=TOPDIR/build/tmp/work/core2-32-yoe-linux/apitrace/10.0-r0/git/wrappers/egltrace.version -shared -Wl,-soname,egltrace.so -o wrappers/egltrace.so wrappers/CMakeFiles/egltrace.dir/egltrace.cpp.o wrappers/CMakeFiles/egltrace.dir/dlsym.cpp.o wrappers/libgltrace_common.a dispatch/libglproc_egl.a -ldl helpers/libglhelpers.a wrappers/libtrace.a lib/trace/libcommon.a lib/highlight/libhighlight.a lib/os/libos.a -ldl thirdparty/libbacktrace/libbacktrace.a thirdparty/brotli/libbrotli_dec.a thirdparty/brotli/libbrotli_common.a lib/guids/libguids.a thirdparty/crc32c/libcrc32c.a thirdparty/snappy/libsnappy_bundled.a dispatch/libglproc.a && :
TOPDIR/build/tmp/work/core2-32-yoe-linux/apitrace/10.0-r0/recipe-sysroot-native/usr/bin/i686-yoe-linux/i686-yoe-linux-ld: TOPDIR/build/tmp/work/core2-32-yoe-linux/apitrace/10.0-r0/recipe-sysroot-native/usr/bin/i686-yoe-linux/i686-yoe-linux-ld: DWARF error: invalid or unhandled FORM value: 0x23
wrappers/CMakeFiles/egltrace.dir/dlsym.cpp.o: in function `dlsym':
dlsym.cpp:(.text+0x2f): undefined reference to `__libc_dlopen_mode'
TOPDIR/build/tmp/work/core2-32-yoe-linux/apitrace/10.0-r0/recipe-sysroot-native/usr/bin/i686-yoe-linux/i686-yoe-linux-ld: dlsym.cpp:(.text+0x45): undefined reference to `__libc_dlsym'
TOPDIR/build/tmp/work/core2-32-yoe-linux/apitrace/10.0-r0/recipe-sysroot-native/usr/bin/i686-yoe-linux/i686-yoe-linux-ld: wrappers/CMakeFiles/egltrace.dir/dlsym.cpp.o: in function `dlopen':
dlsym.cpp:(.text+0x122): undefined reference to `__libc_dlopen_mode'
TOPDIR/build/tmp/work/core2-32-yoe-linux/apitrace/10.0-r0/recipe-sysroot-native/usr/bin/i686-yoe-linux/i686-yoe-linux-ld: dlsym.cpp:(.text+0x13c): undefined reference to `__libc_dlsym'
TOPDIR/build/tmp/work/core2-32-yoe-linux/apitrace/10.0-r0/recipe-sysroot-native/usr/bin/i686-yoe-linux/i686-yoe-linux-ld: dlsym.cpp:(.text+0x1eb): undefined reference to `__libc_dlopen_mode'
TOPDIR/build/tmp/work/core2-32-yoe-linux/apitrace/10.0-r0/recipe-sysroot-native/usr/bin/i686-yoe-linux/i686-yoe-linux-ld: dlsym.cpp:(.text+0x201): undefined reference to `__libc_dlsym'
TOPDIR/build/tmp/work/core2-32-yoe-linux/apitrace/10.0-r0/recipe-sysroot-native/usr/bin/i686-yoe-linux/i686-yoe-linux-ld: dlsym.cpp:(.text+0x2bf): undefined reference to `__libc_dlopen_mode'
TOPDIR/build/tmp/work/core2-32-yoe-linux/apitrace/10.0-r0/recipe-sysroot-native/usr/bin/i686-yoe-linux/i686-yoe-linux-ld: dlsym.cpp:(.text+0x2d9): undefined reference to `__libc_dlsym'
TOPDIR/build/tmp/work/core2-32-yoe-linux/apitrace/10.0-r0/recipe-sysroot-native/usr/bin/i686-yoe-linux/i686-yoe-linux-ld: dlsym.cpp:(.text+0x414): undefined reference to `__libc_dlopen_mode'
TOPDIR/build/tmp/work/core2-32-yoe-linux/apitrace/10.0-r0/recipe-sysroot-native/usr/bin/i686-yoe-linux/i686-yoe-linux-ld: dlsym.cpp:(.text+0x42a): undefined reference to `__libc_dlsym'
clang-13: error: linker command failed with exit code 1 (use -v to see invocation)
[173/175] Building CXX object retrace/CMakeFiles/glretrace_common.dir/glretrace_gl.cpp.o
ninja: build stopped: subcommand failed.
WARNING: TOPDIR/build/tmp/work/core2-32-yoe-linux/apitrace/10.0-r0/temp/run.do_compile.13462:156 exit 1 from 'eval ${DESTDIR:+DESTDIR=${DESTDIR} } cmake --build 'TOPDIR/build/tmp/work/core2-32-yoe-linux/apitrace/10.0-r0/build' "$@" -- ${EXTRA_OECMAKE_BUILD}'
WARNING: Backtrace (BB generated script):
#1: cmake_runcmake_build, TOPDIR/build/tmp/work/core2-32-yoe-linux/apitrace/10.0-r0/temp/run.do_compile.13462, line 156
#2: cmake_do_compile, TOPDIR/build/tmp/work/core2-32-yoe-linux/apitrace/10.0-r0/temp/run.do_compile.13462, line 150
#3: do_compile, TOPDIR/build/tmp/work/core2-32-yoe-linux/apitrace/10.0-r0/temp/run.do_compile.13462, line 145
#4: main, TOPDIR/build/tmp/work/core2-32-yoe-linux/apitrace/10.0-r0/temp/run.do_compile.13462, line 169
Backtrace (metadata-relative locations):
#1: cmake_runcmake_build, TOPDIR/sources/openembedded-core/meta/classes/cmake.bbclass, line 207
#2: cmake_do_compile, TOPDIR/sources/openembedded-core/meta/classes/cmake.bbclass, line 211
#3: do_compile, autogenerated, line 2