Running '. ./oe-init-build-env; ${SCRIPTSDIR}/checkvnc; OEQA_DEBUGGING_SAVED_OUTPUT=/srv/autobuilder/autobuilder.yocto.io/pub/repro-fail/ DISPLAY=:1 oe-selftest -r reproducible' with output to /home/pokybuild/yocto-worker/reproducible/build/build/command-1-cmds.log
This is the default build configuration for the Poky reference distribution.
### Shell environment set up for builds. ###
You can now run 'bitbake <target>'
Common targets are:
core-image-minimal
core-image-full-cmdline
core-image-sato
core-image-weston
meta-toolchain
meta-ide-support
You can also run generated qemu images with a command like 'runqemu qemux86-64'.
Other commonly useful commands are:
- 'devtool' and 'recipetool' handle common recipe tasks
- 'bitbake-layers' handles common layer tasks
- 'oe-pkgdata-util' handles common target package tasks
2024-04-04 15:49:14,448 - oe-selftest - INFO - Adding layer libraries:
2024-04-04 15:49:14,449 - oe-selftest - INFO - /home/pokybuild/yocto-worker/reproducible/build/meta/lib
2024-04-04 15:49:14,449 - oe-selftest - INFO - /home/pokybuild/yocto-worker/reproducible/build/meta-yocto-bsp/lib
2024-04-04 15:49:14,449 - oe-selftest - INFO - /home/pokybuild/yocto-worker/reproducible/build/meta-selftest/lib
2024-04-04 15:49:14,450 - oe-selftest - INFO - Checking base configuration is valid/parsable
NOTE: Reconnecting to bitbake server...
2024-04-04 15:49:14,727 - oe-selftest - INFO - Adding: "include selftest.inc" in /home/pokybuild/yocto-worker/reproducible/build/build-st/conf/local.conf
2024-04-04 15:49:14,728 - oe-selftest - INFO - Adding: "include bblayers.inc" in bblayers.conf
2024-04-04 15:49:14,728 - oe-selftest - INFO - test_diffoscope (reproducible.DiffoscopeTests)
2024-04-04 15:50:02,120 - oe-selftest - INFO - ... ok
2024-04-04 15:50:02,120 - oe-selftest - INFO - test_reproducible_builds (reproducible.ReproducibleTests)
2024-04-04 15:50:22,828 - oe-selftest - INFO - Non-reproducible packages will be copied to /srv/autobuilder/autobuilder.yocto.io/pub/repro-fail/oe-reproducible-20240404-z81wfvik
2024-04-04 15:50:22,828 - oe-selftest - INFO - Building reproducibleA (sstate allowed)...
2024-04-04 17:13:42,828 - oe-selftest - INFO - Keepalive message
2024-04-04 18:01:19,421 - oe-selftest - INFO - Building reproducibleB (sstate NOT allowed)...
2024-04-04 19:24:39,441 - oe-selftest - INFO - Keepalive message
2024-04-04 19:51:12,156 - oe-selftest - INFO - Checking deb packages for differences...
2024-04-04 19:52:01,467 - oe-selftest - INFO - Reproducibility summary for deb: same=12285 different=0 different_excluded=0 missing=0 total=12285
unused_exclusions=[]
2024-04-04 19:52:01,478 - oe-selftest - INFO - Checking ipk packages for differences...
2024-04-04 19:52:27,202 - oe-selftest - INFO - Reproducibility summary for ipk: same=12274 different=1 different_excluded=0 missing=0 total=12275
unused_exclusions=[]
2024-04-04 19:52:27,248 - oe-selftest - INFO - Checking rpm packages for differences...
2024-04-04 19:52:47,213 - oe-selftest - INFO - Reproducibility summary for rpm: same=12275 different=0 different_excluded=0 missing=0 total=12275
unused_exclusions=[]
2024-04-04 19:52:47,228 - oe-selftest - INFO - Running diffoscope
2024-04-04 19:52:47,812 - oe-selftest - INFO - ... FAIL
2024-04-04 19:52:47,819 - oe-selftest - INFO - Traceback (most recent call last):
File "/home/pokybuild/yocto-worker/reproducible/build/meta/lib/oeqa/selftest/cases/reproducible.py", line 337, in test_reproducible_builds
self.fail('\n'.join(fails))
AssertionError: The following ipk packages are different and not in exclusion list:
/home/pokybuild/yocto-worker/reproducible/build/build-st/reproducibleB/tmp/deploy/ipk/./core2-64/util-linux-fcntl-lock_2.39.3-r0_core2-64.ipk
2024-04-04 19:52:47,831 - oe-selftest - INFO - ======================================================================
2024-04-04 19:52:47,831 - oe-selftest - INFO - FAIL: test_reproducible_builds (reproducible.ReproducibleTests)
2024-04-04 19:52:47,831 - oe-selftest - INFO - ----------------------------------------------------------------------
2024-04-04 19:52:47,831 - oe-selftest - INFO - Traceback (most recent call last):
File "/home/pokybuild/yocto-worker/reproducible/build/meta/lib/oeqa/selftest/cases/reproducible.py", line 337, in test_reproducible_builds
self.fail('\n'.join(fails))
AssertionError: The following ipk packages are different and not in exclusion list:
/home/pokybuild/yocto-worker/reproducible/build/build-st/reproducibleB/tmp/deploy/ipk/./core2-64/util-linux-fcntl-lock_2.39.3-r0_core2-64.ipk
2024-04-04 19:52:47,831 - oe-selftest - INFO - ----------------------------------------------------------------------
2024-04-04 19:52:47,831 - oe-selftest - INFO - Ran 2 tests in 14613.271s
2024-04-04 19:52:47,831 - oe-selftest - INFO - FAILED
2024-04-04 19:52:47,831 - oe-selftest - INFO - (failures=1)
2024-04-04 19:52:54,618 - oe-selftest - INFO - RESULTS:
2024-04-04 19:52:54,619 - oe-selftest - INFO - RESULTS - reproducible.DiffoscopeTests.test_diffoscope: PASSED (47.39s)
2024-04-04 19:52:54,619 - oe-selftest - INFO - RESULTS - reproducible.ReproducibleTests.test_reproducible_builds: FAILED (14565.70s)
2024-04-04 19:52:54,960 - oe-selftest - INFO - SUMMARY:
2024-04-04 19:52:54,960 - oe-selftest - INFO - oe-selftest () - Ran 2 tests in 14613.271s
2024-04-04 19:52:54,960 - oe-selftest - INFO - oe-selftest - FAIL - Required tests failed (successes=1, skipped=0, failures=1, errors=0)