Running '. ./oe-init-build-env; ${SCRIPTSDIR}/checkvnc; OEQA_DEBUGGING_SAVED_OUTPUT=/srv/autobuilder/autobuilder.yocto.io/pub/repro-fail/ DISPLAY=:1 oe-selftest -r reproducible' with output to /home/pokybuild/yocto-worker/reproducible/build/build/command-1-cmds.log
This is the default build configuration for the Poky reference distribution.
### Shell environment set up for builds. ###
You can now run 'bitbake <target>'
Common targets are:
core-image-minimal
core-image-full-cmdline
core-image-sato
core-image-weston
meta-toolchain
meta-ide-support
You can also run generated qemu images with a command like 'runqemu qemux86-64'.
Other commonly useful commands are:
- 'devtool' and 'recipetool' handle common recipe tasks
- 'bitbake-layers' handles common layer tasks
- 'oe-pkgdata-util' handles common target package tasks
2024-04-11 21:36:14,594 - oe-selftest - INFO - Adding layer libraries:
2024-04-11 21:36:14,595 - oe-selftest - INFO - /home/pokybuild/yocto-worker/reproducible/build/meta/lib
2024-04-11 21:36:14,595 - oe-selftest - INFO - /home/pokybuild/yocto-worker/reproducible/build/meta-yocto-bsp/lib
2024-04-11 21:36:14,595 - oe-selftest - INFO - /home/pokybuild/yocto-worker/reproducible/build/meta-selftest/lib
2024-04-11 21:36:14,596 - oe-selftest - INFO - Checking base configuration is valid/parsable
NOTE: Reconnecting to bitbake server...
2024-04-11 21:36:14,901 - oe-selftest - INFO - Adding: "include selftest.inc" in /home/pokybuild/yocto-worker/reproducible/build/build-st/conf/local.conf
2024-04-11 21:36:14,901 - oe-selftest - INFO - Adding: "include bblayers.inc" in bblayers.conf
2024-04-11 21:36:14,902 - oe-selftest - INFO - test_diffoscope (reproducible.DiffoscopeTests.test_diffoscope)
2024-04-11 21:37:02,531 - oe-selftest - INFO - ... ok
2024-04-11 21:37:02,531 - oe-selftest - INFO - test_reproducible_builds (reproducible.ReproducibleTests.test_reproducible_builds)
2024-04-11 21:37:23,531 - oe-selftest - INFO - Non-reproducible packages will be copied to /srv/autobuilder/autobuilder.yocto.io/pub/repro-fail/oe-reproducible-20240411-b911c9jv
2024-04-11 21:37:23,532 - oe-selftest - INFO - Building reproducibleA (sstate allowed)...
2024-04-11 21:52:02,435 - oe-selftest - INFO - Building reproducibleB (sstate NOT allowed)...
2024-04-11 23:15:22,437 - oe-selftest - INFO - Keepalive message
2024-04-12 00:33:11,914 - oe-selftest - INFO - Checking deb packages for differences...
2024-04-12 00:33:35,340 - oe-selftest - INFO - Reproducibility summary for deb: same=12316 different=0 different_excluded=0 missing=0 total=12316
unused_exclusions=[]
2024-04-12 00:33:35,355 - oe-selftest - INFO - Checking ipk packages for differences...
2024-04-12 00:34:08,462 - oe-selftest - INFO - Reproducibility summary for ipk: same=12306 different=0 different_excluded=0 missing=0 total=12306
unused_exclusions=[]
2024-04-12 00:34:08,490 - oe-selftest - INFO - Checking rpm packages for differences...
2024-04-12 00:34:34,645 - oe-selftest - INFO - Reproducibility summary for rpm: same=12305 different=1 different_excluded=0 missing=0 total=12306
unused_exclusions=[]
2024-04-12 00:34:34,722 - oe-selftest - INFO - Running diffoscope
2024-04-12 00:34:35,999 - oe-selftest - INFO - ... FAIL
2024-04-12 00:34:36,006 - oe-selftest - INFO - Traceback (most recent call last):
File "/home/pokybuild/yocto-worker/reproducible/build/meta/lib/oeqa/selftest/cases/reproducible.py", line 337, in test_reproducible_builds
self.fail('\n'.join(fails))
AssertionError: The following rpm packages are different and not in exclusion list:
/home/pokybuild/yocto-worker/reproducible/build/build-st/reproducibleB/tmp/deploy/rpm/./core2_64/util-linux-fcntl-lock-2.39.3-r0.core2_64.rpm
2024-04-12 00:34:36,007 - oe-selftest - INFO - ======================================================================
2024-04-12 00:34:36,007 - oe-selftest - INFO - FAIL: test_reproducible_builds (reproducible.ReproducibleTests.test_reproducible_builds)
2024-04-12 00:34:36,007 - oe-selftest - INFO - ----------------------------------------------------------------------
2024-04-12 00:34:36,007 - oe-selftest - INFO - Traceback (most recent call last):
File "/home/pokybuild/yocto-worker/reproducible/build/meta/lib/oeqa/selftest/cases/reproducible.py", line 337, in test_reproducible_builds
self.fail('\n'.join(fails))
AssertionError: The following rpm packages are different and not in exclusion list:
/home/pokybuild/yocto-worker/reproducible/build/build-st/reproducibleB/tmp/deploy/rpm/./core2_64/util-linux-fcntl-lock-2.39.3-r0.core2_64.rpm
2024-04-12 00:34:36,007 - oe-selftest - INFO - ----------------------------------------------------------------------
2024-04-12 00:34:36,007 - oe-selftest - INFO - Ran 2 tests in 10701.313s
2024-04-12 00:34:36,007 - oe-selftest - INFO - FAILED
2024-04-12 00:34:36,007 - oe-selftest - INFO - (failures=1)
2024-04-12 00:34:42,638 - oe-selftest - INFO - RESULTS:
2024-04-12 00:34:42,638 - oe-selftest - INFO - RESULTS - reproducible.DiffoscopeTests.test_diffoscope: PASSED (47.63s)
2024-04-12 00:34:42,639 - oe-selftest - INFO - RESULTS - reproducible.ReproducibleTests.test_reproducible_builds: FAILED (10653.47s)
2024-04-12 00:34:42,967 - oe-selftest - INFO - SUMMARY:
2024-04-12 00:34:42,968 - oe-selftest - INFO - oe-selftest () - Ran 2 tests in 10701.314s
2024-04-12 00:34:42,968 - oe-selftest - INFO - oe-selftest - FAIL - Required tests failed (successes=1, skipped=0, failures=1, errors=0)