DEBUG: Executing python function extend_recipe_sysroot
NOTE: Direct dependencies are ['/yocto/yb2/yocto-worker/cxl/build/meta/recipes-devtools/qemu/qemu-helper-native_1.0.bb:do_populate_sysroot', '/yocto/yb2/yocto-worker/cxl/build/meta/recipes-devtools/qemu/qemu-native_8.1.2.bb:do_populate_sysroot', '/yocto/yb2/yocto-worker/cxl/build/meta/recipes-devtools/qemu/qemu-system-native_8.1.2.bb:do_populate_sysroot', 'virtual:native:/yocto/yb2/yocto-worker/cxl/build/meta/recipes-devtools/apt/apt_2.6.1.bb:do_populate_sysroot', 'virtual:native:/yocto/yb2/yocto-worker/cxl/build/meta/recipes-devtools/dpkg/dpkg_1.22.0.bb:do_populate_sysroot', 'virtual:native:/yocto/yb2/yocto-worker/cxl/build/meta/recipes-devtools/pseudo/pseudo_git.bb:do_populate_sysroot', 'virtual:native:/yocto/yb2/yocto-worker/cxl/build/meta/recipes-devtools/unfs3/unfs3_git.bb:do_populate_sysroot']
NOTE: Installed into sysroot: []
NOTE: Skipping as already exists in sysroot: ['qemu-helper-native', 'qemu-native', 'qemu-system-native', 'apt-native', 'dpkg-native', 'pseudo-native', 'unfs3-native', 'flex-native', 'libtirpc-native', 'libtool-native', 'zlib-native', 'gettext-minimal-native', 'libmd-native', 'gettext-native', 'xz-native', 'perl-native', 'opkg-utils-native', 'bzip2-native', 'alsa-lib-native', 'libepoxy-native', 'pixman-native', 'libpng-native', 'libslirp-native', 'virglrenderer-native', 'dtc-native', 'libsdl2-native', 'glib-2.0-native', 'python3-native', 'lz4-native', 'xxhash-native', 'db-native', 'gnutls-native', 'libgcrypt-native', 'cmake-native', 'texinfo-dummy-native', 'm4-native', 'gdbm-native', 'make-native', 'libx11-native', 'mesa-native', 'libdrm-native', 'libxrender-native', 'libxrandr-native', 'libxext-native', 'libffi-native', 'libpcre2-native', 'util-linux-native', 'sqlite3-native', 'libnsl2-native', 'libedit-native', 'ncurses-native', 'util-linux-libuuid-native', 'expat-native', 'openssl-native', 'nettle-native', 'libidn2-native', 'libtasn1-native', 'libunistring-native', 'gmp-native', 'libgpg-error-native', 'libcap-native', 'zstd-native', 'gnu-config-native', 'xtrans-native', 'xorgproto-native', 'libxcb-native', 'util-macros-native', 'llvm-native', 'libxshmfence-native', 'wayland-protocols-native', 'chrpath-native', 'libxml2-native', 'wayland-native', 'elfutils-native', 'python3-mako-native', 'libxfixes-native', 'libxdamage-native', 'makedepend-native', 'libxxf86vm-native', 'xrandr-native', 'libpthread-stubs-native', 'libpciaccess-native', 'libcap-ng-native', 'libxdmcp-native', 'xcb-proto-native', 'libxau-native', 'libmicrohttpd-native', 'libarchive-native', 'curl-native', 'python3-wheel-native', 'python3-setuptools-native', 'python3-markupsafe-native', 'python3-installer-native', 'python3-build-native', 'python3-pygments-native', 'acl-native', 'attr-native', 'python3-flit-core-native', 'python3-packaging-native', 'python3-pyproject-hooks-native', 'unzip-native']
DEBUG: Python function extend_recipe_sysroot finished
DEBUG: Executing python function do_testimage
/yocto/yb2/yocto-worker/cxl/build/meta/lib/oeqa/runtime/cases/apt.py:44: DeprecationWarning: invalid escape sequence '\['
self.target.run("cd %s; cp sources.list sources.list.bak; sed -i 's|\[trusted=yes\] http://bogus_ip:bogus_port|%s|g' sources.list" % (apt_get_sourceslist_dir, apt_get_source_server))
DEBUG: test suites:
test_ping (ping.PingTest)
test_ssh (ssh.SSHTest)
NOTE: test_ping (ping.PingTest)
DEBUG: Setting up a 30 second(s) timeout
DEBUG: Removed SIGALRM handler
NOTE: ... ok
NOTE: test_ssh (ssh.SSHTest)
DEBUG: Checking if at least one of openssh-sshd, dropbear is installed
DEBUG: [Running]$ ssh -l root -o ServerAliveCountMax=2 -o ServerAliveInterval=30 -o UserKnownHostsFile=/dev/null -o StrictHostKeyChecking=no -o LogLevel=ERROR 127.0.0.1 export PATH=/usr/sbin:/sbin:/usr/bin:/bin; sleep 20
DEBUG: Waiting for process output: time: 1713373290.1233268, endtime: 1713373292.1179974
DEBUG: Partial data from SSH call:
Permission denied, please try again.
Permission denied, please try again.
root@127.0.0.1: Permission denied (publickey,password).
DEBUG: Waiting for process output: time: 1713373290.4904745, endtime: 1713373292.4904704
DEBUG: Data from SSH call:
Permission denied, please try again.
Permission denied, please try again.
root@127.0.0.1: Permission denied (publickey,password).
DEBUG: [Command returned '255' after 0.57 seconds]
DEBUG: Command: sleep 20
Status: 255 Output: Permission denied, please try again.
Permission denied, please try again.
root@127.0.0.1: Permission denied (publickey,password).
DEBUG: [Running]$ ssh -l root -o ServerAliveCountMax=2 -o ServerAliveInterval=30 -o UserKnownHostsFile=/dev/null -o StrictHostKeyChecking=no -o LogLevel=ERROR 127.0.0.1 export PATH=/usr/sbin:/sbin:/usr/bin:/bin; uname -a
DEBUG: Waiting for process output: time: 1713373290.697212, endtime: 1713373590.6926725
DEBUG: Partial data from SSH call:
Permission denied, please try again.
Permission denied, please try again.
root@127.0.0.1: Permission denied (publickey,password).
DEBUG: Waiting for process output: time: 1713373291.054905, endtime: 1713373591.0549006
DEBUG: Data from SSH call:
Permission denied, please try again.
Permission denied, please try again.
root@127.0.0.1: Permission denied (publickey,password).
DEBUG: [Command returned '255' after 0.56 seconds]
DEBUG: Command: uname -a
Status: 255 Output: Permission denied, please try again.
Permission denied, please try again.
root@127.0.0.1: Permission denied (publickey,password).
NOTE: ... FAIL
Traceback (most recent call last):
File "/yocto/yb2/yocto-worker/cxl/build/meta/lib/oeqa/core/decorator/__init__.py", line 35, in wrapped_f
return func(*args, **kwargs)
File "/yocto/yb2/yocto-worker/cxl/build/meta/lib/oeqa/core/decorator/__init__.py", line 35, in wrapped_f
return func(*args, **kwargs)
File "/yocto/yb2/yocto-worker/cxl/build/meta/lib/oeqa/runtime/cases/ssh.py", line 20, in test_ssh
self.assertEqual(status, 0, msg='SSH Test failed: %s' % output)
AssertionError: 255 != 0 : SSH Test failed: Permission denied, please try again.
Permission denied, please try again.
root@127.0.0.1: Permission denied (publickey,password).
NOTE: ======================================================================
NOTE: FAIL: test_ssh (ssh.SSHTest)
NOTE: ----------------------------------------------------------------------
NOTE: Traceback (most recent call last):
File "/yocto/yb2/yocto-worker/cxl/build/meta/lib/oeqa/core/decorator/__init__.py", line 35, in wrapped_f
return func(*args, **kwargs)
File "/yocto/yb2/yocto-worker/cxl/build/meta/lib/oeqa/core/decorator/__init__.py", line 35, in wrapped_f
return func(*args, **kwargs)
File "/yocto/yb2/yocto-worker/cxl/build/meta/lib/oeqa/runtime/cases/ssh.py", line 20, in test_ssh
self.assertEqual(status, 0, msg='SSH Test failed: %s' % output)
AssertionError: 255 != 0 : SSH Test failed: Permission denied, please try again.
Permission denied, please try again.
root@127.0.0.1: Permission denied (publickey,password).
NOTE: ----------------------------------------------------------------------
NOTE: Ran 2 tests in 1.196s
NOTE: FAILED
NOTE: (failures=1)
DEBUG: [Running]$ ssh -l root -o ServerAliveCountMax=2 -o ServerAliveInterval=30 -o UserKnownHostsFile=/dev/null -o StrictHostKeyChecking=no -o LogLevel=ERROR 127.0.0.1 export PATH=/usr/sbin:/sbin:/usr/bin:/bin; for p in /var/log; do if [ -e $p ]; then echo $p; fi; done
DEBUG: Waiting for process output: time: 1713373291.264097, endtime: 1713373591.2594466
DEBUG: Partial data from SSH call:
Permission denied, please try again.
Permission denied, please try again.
root@127.0.0.1: Permission denied (publickey,password).
DEBUG: Waiting for process output: time: 1713373291.6184068, endtime: 1713373591.6184022
DEBUG: Data from SSH call:
Permission denied, please try again.
Permission denied, please try again.
root@127.0.0.1: Permission denied (publickey,password).
DEBUG: [Command returned '255' after 0.56 seconds]
DEBUG: Command: for p in /var/log; do if [ -e $p ]; then echo $p; fi; done
Status: 255 Output: Permission denied, please try again.
Permission denied, please try again.
root@127.0.0.1: Permission denied (publickey,password).
NOTE: No file/directory matching path /var/log
DEBUG: [Running]$ ssh -l root -o ServerAliveCountMax=2 -o ServerAliveInterval=30 -o UserKnownHostsFile=/dev/null -o StrictHostKeyChecking=no -o LogLevel=ERROR 127.0.0.1 export PATH=/usr/sbin:/sbin:/usr/bin:/bin; for p in /etc/version; do if [ -e $p ]; then echo $p; fi; done
DEBUG: Waiting for process output: time: 1713373291.8252048, endtime: 1713373591.820569
DEBUG: Partial data from SSH call:
Permission denied, please try again.
Permission denied, please try again.
root@127.0.0.1: Permission denied (publickey,password).
DEBUG: Waiting for process output: time: 1713373292.178958, endtime: 1713373592.1789534
DEBUG: Data from SSH call:
Permission denied, please try again.
Permission denied, please try again.
root@127.0.0.1: Permission denied (publickey,password).
DEBUG: [Command returned '255' after 0.56 seconds]
DEBUG: Command: for p in /etc/version; do if [ -e $p ]; then echo $p; fi; done
Status: 255 Output: Permission denied, please try again.
Permission denied, please try again.
root@127.0.0.1: Permission denied (publickey,password).
NOTE: No file/directory matching path /etc/version
DEBUG: [Running]$ ssh -l root -o ServerAliveCountMax=2 -o ServerAliveInterval=30 -o UserKnownHostsFile=/dev/null -o StrictHostKeyChecking=no -o LogLevel=ERROR 127.0.0.1 export PATH=/usr/sbin:/sbin:/usr/bin:/bin; for p in /etc/os-release; do if [ -e $p ]; then echo $p; fi; done
DEBUG: Waiting for process output: time: 1713373292.3857048, endtime: 1713373592.381197
DEBUG: Partial data from SSH call:
Permission denied, please try again.
Permission denied, please try again.
root@127.0.0.1: Permission denied (publickey,password).
DEBUG: Waiting for process output: time: 1713373292.7422829, endtime: 1713373592.7422783
DEBUG: Data from SSH call:
Permission denied, please try again.
Permission denied, please try again.
root@127.0.0.1: Permission denied (publickey,password).
DEBUG: [Command returned '255' after 0.56 seconds]
DEBUG: Command: for p in /etc/os-release; do if [ -e $p ]; then echo $p; fi; done
Status: 255 Output: Permission denied, please try again.
Permission denied, please try again.
root@127.0.0.1: Permission denied (publickey,password).
NOTE: No file/directory matching path /etc/os-release
WARNING: Could not load artifacts list, skip artifacts retrieval
RESULTS:
RESULTS - ping.PingTest.test_ping: PASSED (0.06s)
RESULTS - ssh.SSHTest.test_ssh: FAILED (1.14s)
SUMMARY:
core-image-cxl-sdk () - Ran 2 tests in 1.197s
core-image-cxl-sdk - FAIL - Required tests failed (successes=1, skipped=0, failures=1, errors=0)
ERROR: core-image-cxl-sdk - FAILED - also check the logs in TOPDIR/tmp/log
DEBUG: Python function do_testimage finished