DEBUG: Executing shell function do_compile
NOTE: cmake --build TMPDIR/work/riscv64-yoe-linux/mariadb/11.4.5/build --target all --
-- Running cmake version 3.31.6
-- MariaDB 11.4.5
-- Wsrep-lib version: 1.0.0
== Configuring MariaDB Connector/C
-- SYSTEM_LIBS: TMPDIR/work/riscv64-yoe-linux/mariadb/11.4.5/recipe-sysroot/usr/lib/libz.so;dl;m;dl;m;TMPDIR/work/riscv64-yoe-linux/mariadb/11.4.5/recipe-sysroot/usr/lib/libssl.so;TMPDIR/work/riscv64-yoe-linux/mariadb/11.4.5/recipe-sysroot/usr/lib/libcrypto.so;TMPDIR/work/riscv64-yoe-linux/mariadb/11.4.5/recipe-sysroot/usr/lib/libz.so
-- Dynamic column API support: ON
-- Could NOT find LZ4 (missing: LZ4_LIBRARIES LZ4_INCLUDE_DIRS) (Required is at least version "1.6")
-- Could NOT find Snappy (missing: SNAPPY_LIBRARIES SNAPPY_INCLUDE_DIRS)
-- Configuring done (3.1s)
-- Generating done (3.2s)
-- Build files have been written to: TMPDIR/work/riscv64-yoe-linux/mariadb/11.4.5/build
[ 0%] Generating ctype-uca1400data.h
[ 0%] Generating lex_hash.h
[ 1%] Building C object vio/CMakeFiles/vio.dir/vio.c.o
[ 1%] Generating ../include/mysqld_error.h.tmp
[ 1%] Building C object wsrep-lib/wsrep-API/CMakeFiles/wsrep_api_v26.dir/v26/wsrep_dummy.c.o
[ 1%] Building C object unittest/mytap/CMakeFiles/mytap.dir/tap.c.o
[ 1%] Building CXX object tpool/CMakeFiles/tpool.dir/aio_simulated.cc.o
[ 1%] Generating lex_token.h
[ 1%] Built target INFO_SRC
[ 1%] Building yy_mariadb.yy and yy_oracle.yy from sql_yacc.yy
[ 1%] Built target INFO_BIN
[ 1%] Building C object libmariadb/CMakeFiles/dialog.dir/plugins/auth/dialog.c.o
[ 1%] Building C object libmariadb/CMakeFiles/ed25519_ref10.dir/plugins/auth/ref10/fe_0.c.o
[ 1%] Built target GenError
[ 1%] Building C object libmariadb/CMakeFiles/ed25519_ref10.dir/plugins/auth/ref10/fe_isnegative.c.o
[ 2%] Building C object libmariadb/CMakeFiles/ed25519_ref10.dir/plugins/auth/ref10/fe_sub.c.o
[ 2%] Building C object wsrep-lib/wsrep-API/CMakeFiles/wsrep_api_v26.dir/v26/wsrep_gtid.c.o
[ 2%] Building C object wsrep-lib/wsrep-API/CMakeFiles/wsrep_api_v26.dir/v26/wsrep_loader.c.o
[ 2%] Building C object libmariadb/CMakeFiles/ed25519_ref10.dir/plugins/auth/ref10/ge_p1p1_to_p2.c.o
[ 2%] Built target GenUnicodeDataSource
[ 2%] Building C object libmariadb/CMakeFiles/caching_sha2_password.dir/plugins/auth/caching_sha2_pw.c.o
[ 2%] Building C object wsrep-lib/wsrep-API/CMakeFiles/wsrep_api_v26.dir/v26/wsrep_uuid.c.o
[ 2%] Building C object libmariadb/CMakeFiles/ed25519_ref10.dir/plugins/auth/ref10/ge_p3_to_cached.c.o
[ 2%] Building C object libmariadb/CMakeFiles/caching_sha2_password.dir/libmariadb/secure/openssl_crypt.c.o
[ 2%] Linking C static library libmytap.a
[ 2%] Building C object libmariadb/CMakeFiles/dialog.dir/libmariadb/get_password.c.o
[ 2%] Building C object libmariadb/CMakeFiles/ed25519_ref10.dir/plugins/auth/ref10/open.c.o
[ 3%] Linking C static library libwsrep_api_v26.a
[ 3%] Built target mytap
[ 3%] Building C object libmariadb/CMakeFiles/sha256_password.dir/plugins/auth/sha256_pw.c.o
[ 3%] Built target abi_check
[ 3%] Built target wsrep_api_v26
[ 3%] Building C object libmariadb/CMakeFiles/mysql_clear_password.dir/plugins/auth/mariadb_cleartext.c.o
[ 3%] Building C object libmariadb/CMakeFiles/zstd.dir/plugins/compress/c_zstd.c.o
[ 3%] Linking C shared module dialog.so
[ 3%] Building C object libmariadb/libmariadb/CMakeFiles/mariadb_obj.dir/__/plugins/auth/my_auth.c.o
[ 3%] Building C object libmariadb/CMakeFiles/ed25519_ref10.dir/plugins/auth/ref10/fe_1.c.o
[ 3%] Building C object vio/CMakeFiles/vio.dir/viosocket.c.o
[ 3%] Built target dialog
[ 3%] Building C object libmariadb/mariadb_config/CMakeFiles/mariadb_config.dir/mariadb_config.c.o
[ 3%] Linking C shared module caching_sha2_password.so
[ 3%] Building C object libmariadb/CMakeFiles/ed25519_ref10.dir/plugins/auth/ref10/fe_isnonzero.c.o
[ 3%] Linking C shared module mysql_clear_password.so
[ 4%] Linking C shared module zstd.so
[ 4%] Building C object libmariadb/CMakeFiles/ed25519_ref10.dir/plugins/auth/ref10/fe_tobytes.c.o
[ 4%] Built target caching_sha2_password
[ 4%] Built target mysql_clear_password
[ 4%] Building C object libmariadb/unittest/mytap/CMakeFiles/cctap.dir/tap.c.o
[ 4%] Linking C executable mariadb_config
[ 4%] Built target zstd
[ 4%] Building C object libmariadb/unittest/libmariadb/CMakeFiles/ma_getopt.dir/ma_getopt.c.o
[ 4%] Building C object libservices/CMakeFiles/mysqlservices.dir/base64_service.c.o
[ 4%] Building C object libmariadb/CMakeFiles/ed25519_ref10.dir/plugins/auth/ref10/ge_p1p1_to_p3.c.o
[ 4%] Linking C shared module sha256_password.so
[ 4%] Built target mariadb_config
[ 4%] Building C object libmariadb/CMakeFiles/ed25519_ref10.dir/plugins/auth/ref10/ge_p3_to_p2.c.o
[ 4%] Linking C static library libma_getopt.a
[ 4%] Building C object libservices/CMakeFiles/mysqlservices.dir/encryption_scheme_service.c.o
[ 4%] Building C object libservices/CMakeFiles/mysqlservices.dir/debug_sync_service.c.o
[ 4%] Linking C static library libcctap.a
[ 4%] Building C object libmariadb/libmariadb/CMakeFiles/mariadb_obj.dir/__/plugins/auth/old_password.c.o
[ 4%] Building C object libservices/CMakeFiles/mysqlservices.dir/encryption_service.c.o
[ 4%] Built target sha256_password
[ 5%] Building C object libservices/CMakeFiles/mysqlservices.dir/kill_statement_service.c.o
[ 5%] Building C object libservices/CMakeFiles/mysqlservices.dir/logger_service.c.o
[ 5%] Building C object libmariadb/CMakeFiles/ed25519_ref10.dir/plugins/auth/ref10/sc_muladd.c.o
[ 5%] Built target ma_getopt
[ 5%] Building C object libservices/CMakeFiles/mysqlservices.dir/my_crypt_service.c.o
[ 5%] Building C object libmariadb/CMakeFiles/ed25519_ref10.dir/plugins/auth/ref10/fe_add.c.o
[ 5%] Built target cctap
[ 5%] Building C object libservices/CMakeFiles/mysqlservices.dir/my_md5_service.c.o
[ 5%] Building C object libservices/CMakeFiles/mysqlservices.dir/my_print_error_service.c.o
[ 5%] Building CXX object storage/csv/CMakeFiles/csv.dir/ha_tina.cc.o
[ 6%] Building CXX object storage/csv/CMakeFiles/csv.dir/transparent_file.cc.o
[ 6%] Building C object libservices/CMakeFiles/mysqlservices.dir/my_sha1_service.c.o
[ 6%] Building C object libservices/CMakeFiles/mysqlservices.dir/print_check_msg_service.c.o
[ 6%] Building C object libservices/CMakeFiles/mysqlservices.dir/my_sha2_service.c.o
[ 6%] Building C object libservices/CMakeFiles/mysqlservices.dir/my_snprintf_service.c.o
[ 6%] Building C object libmariadb/libmariadb/CMakeFiles/mariadb_obj.dir/__/plugins/compress/c_zlib.c.o
[ 6%] Building C object libmariadb/libmariadb/CMakeFiles/mariadb_obj.dir/__/plugins/pvio/pvio_socket.c.o
[ 6%] Building C object libservices/CMakeFiles/mysqlservices.dir/progress_report_service.c.o
[ 6%] Building C object libservices/CMakeFiles/mysqlservices.dir/thd_alloc_service.c.o
[ 6%] Building C object libmariadb/libmariadb/CMakeFiles/mariadb_obj.dir/ma_array.c.o
[ 6%] Building C object libservices/CMakeFiles/mysqlservices.dir/thd_autoinc_service.c.o
[ 6%] Building C object vio/CMakeFiles/vio.dir/viossl.c.o
[ 6%] Building C object libmariadb/CMakeFiles/ed25519_ref10.dir/plugins/auth/ref10/fe_mul.c.o
[ 6%] Building C object libservices/CMakeFiles/mysqlservices.dir/thd_error_context_service.c.o
[ 6%] Building C object libservices/CMakeFiles/mysqlservices.dir/thd_rnd_service.c.o
[ 6%] Building C object libmariadb/CMakeFiles/ed25519_ref10.dir/plugins/auth/ref10/ge_add.c.o
[ 6%] Building C object libmariadb/libmariadb/CMakeFiles/mariadb_obj.dir/ma_charset.c.o
[ 6%] Building C object vio/CMakeFiles/vio.dir/viopipe.c.o
[ 6%] Building C object libservices/CMakeFiles/mysqlservices.dir/thd_specifics_service.c.o
[ 6%] Building C object libmariadb/CMakeFiles/ed25519_ref10.dir/plugins/auth/ref10/ge_p2_0.c.o
[ 6%] Building C object libservices/CMakeFiles/mysqlservices.dir/thd_timezone_service.c.o
[ 6%] Building C object libmariadb/CMakeFiles/ed25519_ref10.dir/plugins/auth/ref10/ge_precomp_0.c.o
[ 6%] Building C object libservices/CMakeFiles/mysqlservices.dir/thd_wait_service.c.o
[ 6%] Building C object libservices/CMakeFiles/mysqlservices.dir/wsrep_service.c.o
[ 6%] Building C object libmariadb/CMakeFiles/ed25519_ref10.dir/plugins/auth/ref10/sc_reduce.c.o
[ 6%] Building C object libservices/CMakeFiles/mysqlservices.dir/json_service.c.o
[ 6%] Building C object libservices/CMakeFiles/mysqlservices.dir/sql_service.c.o
[ 6%] Building C object libservices/CMakeFiles/mysqlservices.dir/provider_service_bzip2.c.o
[ 7%] Building C object storage/heap/CMakeFiles/heap.dir/_check.c.o
[ 7%] Building CXX object tpool/CMakeFiles/tpool.dir/tpool_generic.cc.o
[ 7%] Building C object storage/heap/CMakeFiles/heap.dir/_rectest.c.o
[ 7%] Building C object libservices/CMakeFiles/mysqlservices.dir/provider_service_lz4.c.o
[ 7%] Building C object libmariadb/CMakeFiles/ed25519_ref10.dir/plugins/auth/ref10/fe_cmov.c.o
[ 7%] Building C object storage/heap/CMakeFiles/heap.dir/hp_block.c.o
[ 7%] Building C object libservices/CMakeFiles/mysqlservices.dir/provider_service_lzma.c.o
[ 7%] Building C object libmariadb/libmariadb/CMakeFiles/mariadb_obj.dir/ma_decimal.c.o
[ 7%] Building C object libmariadb/CMakeFiles/ed25519_ref10.dir/plugins/auth/ref10/fe_neg.c.o
[ 7%] Building C object libservices/CMakeFiles/mysqlservices.dir/provider_service_lzo.c.o
[ 7%] Building C object libservices/CMakeFiles/mysqlservices.dir/provider_service_snappy.c.o
[ 7%] Building C object libmariadb/CMakeFiles/ed25519_ref10.dir/plugins/auth/ref10/ge_double_scalarmult.c.o
[ 7%] Linking C static library libmysqlservices.a
[ 7%] Building C object storage/heap/CMakeFiles/heap_embedded.dir/_check.c.o
[ 7%] Built target mysqlservices
[ 7%] Building C object storage/heap/CMakeFiles/heap_embedded.dir/_rectest.c.o
[ 7%] Building C object vio/CMakeFiles/vio.dir/viosslfactories.c.o
[ 7%] Building C object storage/heap/CMakeFiles/heap.dir/hp_clear.c.o
[ 7%] Building C object libmariadb/CMakeFiles/ed25519_ref10.dir/plugins/auth/ref10/ge_p2_dbl.c.o
[ 7%] Building C object libmariadb/libmariadb/CMakeFiles/mariadb_obj.dir/ma_hashtbl.c.o
[ 7%] [BISON][gen_mariadb_cc_hh] Building parser with bison 3.8.2
[ 7%] Building C object libmariadb/CMakeFiles/ed25519_ref10.dir/plugins/auth/ref10/ge_scalarmult_base.c.o
In file included from TMPDIR/work/riscv64-yoe-linux/mariadb/11.4.5/mariadb-11.4.5/storage/csv/ha_tina.cc:46:
In file included from TMPDIR/work/riscv64-yoe-linux/mariadb/11.4.5/mariadb-11.4.5/sql/sql_class.h:32:
In file included from TMPDIR/work/riscv64-yoe-linux/mariadb/11.4.5/mariadb-11.4.5/sql/field.h:29:
In file included from TMPDIR/work/riscv64-yoe-linux/mariadb/11.4.5/mariadb-11.4.5/sql/table.h:29:
TMPDIR/work/riscv64-yoe-linux/mariadb/11.4.5/mariadb-11.4.5/include/my_cpu.h:100:3: error: use of undeclared identifier '__builtin_riscv_pause'
100 | __builtin_riscv_pause();
| ^
[ 7%] Building C object storage/heap/CMakeFiles/heap.dir/hp_close.c.o
[ 7%] Building C object libmariadb/CMakeFiles/ed25519_ref10.dir/plugins/auth/ref10/sign.c.o
[ 7%] Building C object storage/heap/CMakeFiles/heap_embedded.dir/hp_block.c.o
[ 7%] Building CXX object storage/innobase/CMakeFiles/innobase_embedded.dir/btr/btr0btr.cc.o
[ 7%] Building C object libmariadb/libmariadb/CMakeFiles/mariadb_obj.dir/ma_net.c.o
[ 7%] Building C object libmariadb/CMakeFiles/ed25519_ref10.dir/plugins/auth/ref10/fe_copy.c.o
[ 8%] Building C object storage/heap/CMakeFiles/heap_embedded.dir/hp_clear.c.o
[ 8%] Building C object storage/heap/CMakeFiles/heap.dir/hp_create.c.o
[ 8%] Building C object libmariadb/CMakeFiles/ed25519_ref10.dir/plugins/auth/ref10/fe_pow22523.c.o
[ 8%] Linking C static library libvio.a
[ 8%] Building C object libmariadb/CMakeFiles/ed25519_ref10.dir/plugins/auth/ref10/ge_frombytes.c.o
[ 8%] Built target vio
[ 8%] Building C object libmariadb/CMakeFiles/ed25519_ref10.dir/plugins/auth/ref10/ge_p3_0.c.o
[ 8%] Building C object storage/heap/CMakeFiles/heap_embedded.dir/hp_close.c.o
[ 8%] Building CXX object storage/heap/CMakeFiles/heap.dir/ha_heap.cc.o
[ 8%] Building C object libmariadb/CMakeFiles/ed25519_ref10.dir/plugins/auth/ref10/ge_sub.c.o
[ 8%] Building C object libmariadb/libmariadb/CMakeFiles/mariadb_obj.dir/mariadb_charset.c.o
[ 8%] Building C object libmariadb/CMakeFiles/ed25519_ref10.dir/plugins/auth/ref10/verify.c.o
[ 8%] Building C object libmariadb/libmariadb/CMakeFiles/mariadb_obj.dir/ma_time.c.o
[ 9%] Building C object libmariadb/CMakeFiles/ed25519_ref10.dir/plugins/auth/ref10/fe_frombytes.c.o
[ 9%] Building C object storage/heap/CMakeFiles/heap.dir/hp_delete.c.o
[ 9%] Building C object libmariadb/libmariadb/CMakeFiles/mariadb_obj.dir/ma_default.c.o
[ 9%] Building C object libmariadb/CMakeFiles/ed25519_ref10.dir/plugins/auth/ref10/fe_sq2.c.o
[ 9%] Building C object libmariadb/libmariadb/CMakeFiles/mariadb_obj.dir/ma_errmsg.c.o
[ 9%] Building C object storage/heap/CMakeFiles/heap_embedded.dir/hp_create.c.o
[ 9%] Building C object libmariadb/CMakeFiles/ed25519_ref10.dir/plugins/auth/ref10/ge_madd.c.o
[ 9%] Building C object libmariadb/libmariadb/CMakeFiles/mariadb_obj.dir/mariadb_lib.c.o
[ 9%] Building C object libmariadb/CMakeFiles/ed25519_ref10.dir/plugins/auth/ref10/ge_p3_dbl.c.o
[ 9%] Building CXX object tpool/CMakeFiles/tpool.dir/task_group.cc.o
[ 9%] Building C object libmariadb/CMakeFiles/ed25519_ref10.dir/plugins/auth/ref10/ge_tobytes.c.o
[ 9%] Building C object storage/heap/CMakeFiles/heap.dir/hp_extra.c.o
[ 9%] Building C object libmariadb/CMakeFiles/ed25519_ref10.dir/plugins/auth/ref10/fe_invert.c.o
[ 9%] Building CXX object storage/heap/CMakeFiles/heap_embedded.dir/ha_heap.cc.o
[ 9%] Building C object libmariadb/CMakeFiles/ed25519_ref10.dir/plugins/auth/ref10/fe_sq.c.o
[ 9%] Building C object libmariadb/CMakeFiles/ed25519_ref10.dir/plugins/auth/ref10/ge_msub.c.o
[ 9%] Building C object storage/heap/CMakeFiles/heap_embedded.dir/hp_delete.c.o
[ 9%] Building C object libmariadb/CMakeFiles/ed25519_ref10.dir/plugins/auth/ref10/ge_p3_tobytes.c.o
[ 9%] Building C object libmariadb/CMakeFiles/ed25519_ref10.dir/plugins/auth/ref10/keypair.c.o
In file included from TMPDIR/work/riscv64-yoe-linux/mariadb/11.4.5/mariadb-11.4.5/storage/heap/ha_heap.cc:26:
In file included from TMPDIR/work/riscv64-yoe-linux/mariadb/11.4.5/mariadb-11.4.5/storage/heap/ha_heap.h:26:
In file included from TMPDIR/work/riscv64-yoe-linux/mariadb/11.4.5/mariadb-11.4.5/sql/sql_class.h:32:
In file included from TMPDIR/work/riscv64-yoe-linux/mariadb/11.4.5/mariadb-11.4.5/sql/field.h:29:
In file included from TMPDIR/work/riscv64-yoe-linux/mariadb/11.4.5/mariadb-11.4.5/sql/table.h:29:
TMPDIR/work/riscv64-yoe-linux/mariadb/11.4.5/mariadb-11.4.5/include/my_cpu.h:100:3: error: use of undeclared identifier '__builtin_riscv_pause'
100 | __builtin_riscv_pause();
| ^
[ 9%] Built target ed25519_ref10
[ 9%] Building C object storage/myisammrg/CMakeFiles/myisammrg.dir/myrg_close.c.o
[ 9%] Building C object storage/heap/CMakeFiles/heap_embedded.dir/hp_extra.c.o
1 error generated.
make[2]: *** [storage/csv/CMakeFiles/csv.dir/build.make:79: storage/csv/CMakeFiles/csv.dir/ha_tina.cc.o] Error 1
make[1]: *** [CMakeFiles/Makefile2:6732: storage/csv/CMakeFiles/csv.dir/all] Error 2
make[1]: *** Waiting for unfinished jobs....
[ 9%] [BISON][gen_oracle_cc_hh] Building parser with bison 3.8.2
[ 9%] Building C object libmariadb/libmariadb/CMakeFiles/mariadb_obj.dir/ma_list.c.o
[ 9%] Building C object storage/heap/CMakeFiles/heap_embedded.dir/hp_hash.c.o
[ 9%] Building CXX object tpool/CMakeFiles/tpool.dir/task.cc.o
[ 9%] Building C object storage/myisammrg/CMakeFiles/myisammrg.dir/myrg_create.c.o
In file included from TMPDIR/work/riscv64-yoe-linux/mariadb/11.4.5/mariadb-11.4.5/storage/heap/ha_heap.cc:26:
In file included from TMPDIR/work/riscv64-yoe-linux/mariadb/11.4.5/mariadb-11.4.5/storage/heap/ha_heap.h:26:
In file included from TMPDIR/work/riscv64-yoe-linux/mariadb/11.4.5/mariadb-11.4.5/sql/sql_class.h:32:
In file included from TMPDIR/work/riscv64-yoe-linux/mariadb/11.4.5/mariadb-11.4.5/sql/field.h:29:
In file included from TMPDIR/work/riscv64-yoe-linux/mariadb/11.4.5/mariadb-11.4.5/sql/table.h:29:
TMPDIR/work/riscv64-yoe-linux/mariadb/11.4.5/mariadb-11.4.5/include/my_cpu.h:100:3: error: use of undeclared identifier '__builtin_riscv_pause'
100 | __builtin_riscv_pause();
| ^
[ 9%] Building C object libmariadb/libmariadb/CMakeFiles/mariadb_obj.dir/ma_pvio.c.o
TMPDIR/work/riscv64-yoe-linux/mariadb/11.4.5/build/sql/yy_mariadb.cc:36192: warning: suspicious sequence in the output: b4_bin [-Wother]
[ 9%] Building C object storage/myisammrg/CMakeFiles/myisammrg.dir/myrg_delete.c.o
[ 10%] Building C object libmariadb/libmariadb/CMakeFiles/mariadb_obj.dir/ma_tls.c.o
[ 10%] Building CXX object storage/innobase/CMakeFiles/innobase_embedded.dir/btr/btr0bulk.cc.o
[ 10%] Building C object libmariadb/libmariadb/CMakeFiles/mariadb_obj.dir/ma_alloc.c.o
[ 10%] Building C object storage/myisammrg/CMakeFiles/myisammrg.dir/myrg_extra.c.o
[ 10%] Building CXX object tpool/CMakeFiles/tpool.dir/wait_notification.cc.o
[ 11%] Building C object storage/myisammrg/CMakeFiles/myisammrg.dir/myrg_info.c.o
[ 11%] Building C object libmariadb/libmariadb/CMakeFiles/mariadb_obj.dir/ma_compress.c.o
[ 11%] Building C object libmariadb/libmariadb/CMakeFiles/mariadb_obj.dir/ma_init.c.o
[ 11%] Building CXX object storage/myisammrg/CMakeFiles/myisammrg.dir/ha_myisammrg.cc.o
[ 11%] Building C object storage/myisammrg/CMakeFiles/myisammrg.dir/myrg_locking.c.o
[ 11%] Building C object libmariadb/libmariadb/CMakeFiles/mariadb_obj.dir/ma_password.c.o
[ 11%] Building C object storage/myisammrg/CMakeFiles/myisammrg.dir/myrg_open.c.o
1 error generated.
make[2]: *** [storage/heap/CMakeFiles/heap_embedded.dir/build.make:163: storage/heap/CMakeFiles/heap_embedded.dir/ha_heap.cc.o] Error 1
make[1]: *** [CMakeFiles/Makefile2:6895: storage/heap/CMakeFiles/heap_embedded.dir/all] Error 2
[ 11%] Building C object storage/myisammrg/CMakeFiles/myisammrg.dir/myrg_panic.c.o
[ 11%] Building C object libmariadb/libmariadb/CMakeFiles/mariadb_obj.dir/ma_ll2str.c.o
[ 11%] Building C object libmariadb/libmariadb/CMakeFiles/mariadb_obj.dir/mariadb_stmt.c.o
1 error generated.
TMPDIR/work/riscv64-yoe-linux/mariadb/11.4.5/build/sql/yy_oracle.cc:35210: warning: suspicious sequence in the output: b4_bin [-Wother]
[ 11%] Building CXX object tpool/CMakeFiles/tpool.dir/aio_linux.cc.o
make[2]: *** [storage/heap/CMakeFiles/heap.dir/build.make:163: storage/heap/CMakeFiles/heap.dir/ha_heap.cc.o] Error 1
make[1]: *** [CMakeFiles/Makefile2:6863: storage/heap/CMakeFiles/heap.dir/all] Error 2
[ 11%] Building C object storage/myisammrg/CMakeFiles/myisammrg.dir/myrg_queue.c.o
[ 11%] Building C object storage/myisammrg/CMakeFiles/myisammrg.dir/myrg_range.c.o
[ 11%] Building C object storage/myisammrg/CMakeFiles/myisammrg.dir/myrg_rfirst.c.o
[ 11%] Building C object storage/myisammrg/CMakeFiles/myisammrg.dir/myrg_rkey.c.o
[ 11%] Building CXX object storage/innobase/CMakeFiles/innobase_embedded.dir/btr/btr0cur.cc.o
[ 11%] Building C object storage/myisammrg/CMakeFiles/myisammrg.dir/myrg_rlast.c.o
In file included from TMPDIR/work/riscv64-yoe-linux/mariadb/11.4.5/mariadb-11.4.5/storage/myisammrg/ha_myisammrg.cc:96:
In file included from TMPDIR/work/riscv64-yoe-linux/mariadb/11.4.5/mariadb-11.4.5/sql/unireg.h:163:
In file included from TMPDIR/work/riscv64-yoe-linux/mariadb/11.4.5/mariadb-11.4.5/sql/field.h:29:
In file included from TMPDIR/work/riscv64-yoe-linux/mariadb/11.4.5/mariadb-11.4.5/sql/table.h:29:
TMPDIR/work/riscv64-yoe-linux/mariadb/11.4.5/mariadb-11.4.5/include/my_cpu.h:100:3: error: use of undeclared identifier '__builtin_riscv_pause'
100 | __builtin_riscv_pause();
| ^
[ 11%] Built target GenServerSource
[ 11%] Building C object storage/myisammrg/CMakeFiles/myisammrg.dir/myrg_rnext.c.o
[ 11%] Building C object storage/myisammrg/CMakeFiles/myisammrg.dir/myrg_rnext_same.c.o
[ 11%] Building C object storage/myisammrg/CMakeFiles/myisammrg.dir/myrg_rprev.c.o
[ 11%] Building C object storage/myisammrg/CMakeFiles/myisammrg.dir/myrg_rrnd.c.o
[ 11%] Building C object libmariadb/libmariadb/CMakeFiles/mariadb_obj.dir/ma_loaddata.c.o
[ 11%] Building C object storage/myisammrg/CMakeFiles/myisammrg.dir/myrg_rsame.c.o
[ 11%] Building C object storage/myisammrg/CMakeFiles/myisammrg.dir/myrg_static.c.o
[ 11%] Building C object storage/myisammrg/CMakeFiles/myisammrg.dir/myrg_update.c.o
[ 11%] Building C object storage/myisammrg/CMakeFiles/myisammrg.dir/myrg_write.c.o
[ 11%] Building C object libmariadb/libmariadb/CMakeFiles/mariadb_obj.dir/ma_stmt_codec.c.o
[ 11%] Building C object storage/myisammrg/CMakeFiles/myisammrg.dir/myrg_records.c.o
[ 11%] Building CXX object storage/innobase/CMakeFiles/innobase_embedded.dir/btr/btr0pcur.cc.o
[ 11%] Building CXX object storage/innobase/CMakeFiles/innobase_embedded.dir/btr/btr0sea.cc.o
[ 11%] Building C object libmariadb/libmariadb/CMakeFiles/mariadb_obj.dir/ma_string.c.o
[ 11%] Building C object libmariadb/libmariadb/CMakeFiles/mariadb_obj.dir/ma_dtoa.c.o
[ 11%] Building C object libmariadb/libmariadb/CMakeFiles/mariadb_obj.dir/mariadb_rpl.c.o
[ 11%] Building C object libmariadb/libmariadb/CMakeFiles/mariadb_obj.dir/ma_client_plugin.c.o
[ 11%] Linking CXX static library libtpool.a
[ 11%] Built target tpool
[ 11%] Building CXX object storage/innobase/CMakeFiles/innobase_embedded.dir/buf/buf0buddy.cc.o
[ 11%] Building C object libmariadb/libmariadb/CMakeFiles/mariadb_obj.dir/ma_io.c.o
[ 11%] Building C object libmariadb/libmariadb/CMakeFiles/mariadb_obj.dir/secure/openssl.c.o
[ 11%] Building C object libmariadb/libmariadb/CMakeFiles/mariadb_obj.dir/secure/openssl_crypt.c.o
[ 11%] Building C object libmariadb/libmariadb/CMakeFiles/mariadb_obj.dir/mariadb_dyncol.c.o
[ 11%] Building C object libmariadb/libmariadb/CMakeFiles/mariadb_obj.dir/mariadb_async.c.o
[ 11%] Building C object libmariadb/libmariadb/CMakeFiles/mariadb_obj.dir/ma_context.c.o
[ 11%] Building CXX object storage/innobase/CMakeFiles/innobase_embedded.dir/buf/buf0buf.cc.o
TMPDIR/work/riscv64-yoe-linux/mariadb/11.4.5/mariadb-11.4.5/libmariadb/libmariadb/ma_context.c:109:36: warning: cast from 'void (*)(int, int)' to 'uc_func_t' (aka 'void (*)(void)') converts to incompatible function type [-Wcast-function-type-strict]
109 | makecontext(&c->spawned_context, (uc_func_t)my_context_spawn_internal, 2,
| ^~~~~~~~~~~~~~~~~~~~~~~~~~~~~~~~~~~~
1 warning generated.
[ 11%] Building CXX object storage/innobase/CMakeFiles/innobase_embedded.dir/buf/buf0dblwr.cc.o
[ 11%] Building CXX object storage/innobase/CMakeFiles/innobase_embedded.dir/buf/buf0checksum.cc.o
[ 11%] Built target mariadb_obj
[ 11%] Building CXX object storage/innobase/CMakeFiles/innobase_embedded.dir/buf/buf0dump.cc.o
[ 11%] Building CXX object storage/innobase/CMakeFiles/innobase_embedded.dir/buf/buf0flu.cc.o
In file included from TMPDIR/work/riscv64-yoe-linux/mariadb/11.4.5/mariadb-11.4.5/storage/innobase/btr/btr0cur.cc:40:
In file included from TMPDIR/work/riscv64-yoe-linux/mariadb/11.4.5/mariadb-11.4.5/storage/innobase/include/row0upd.h:557:
In file included from TMPDIR/work/riscv64-yoe-linux/mariadb/11.4.5/mariadb-11.4.5/storage/innobase/include/row0upd.inl:29:
In file included from TMPDIR/work/riscv64-yoe-linux/mariadb/11.4.5/mariadb-11.4.5/storage/innobase/include/trx0undo.h:31:
In file included from TMPDIR/work/riscv64-yoe-linux/mariadb/11.4.5/mariadb-11.4.5/storage/innobase/include/trx0sys.h:39:
TMPDIR/work/riscv64-yoe-linux/mariadb/11.4.5/mariadb-11.4.5/include/my_cpu.h:100:3: error: use of undeclared identifier '__builtin_riscv_pause'
100 | __builtin_riscv_pause();
| ^
1 error generated.
make[2]: *** [storage/myisammrg/CMakeFiles/myisammrg.dir/build.make:149: storage/myisammrg/CMakeFiles/myisammrg.dir/ha_myisammrg.cc.o] Error 1
make[1]: *** [CMakeFiles/Makefile2:9459: storage/myisammrg/CMakeFiles/myisammrg.dir/all] Error 2
[ 11%] Building CXX object storage/innobase/CMakeFiles/innobase_embedded.dir/buf/buf0lru.cc.o
1 error generated.
make[2]: *** [storage/innobase/CMakeFiles/innobase_embedded.dir/build.make:107: storage/innobase/CMakeFiles/innobase_embedded.dir/btr/btr0cur.cc.o] Error 1
make[2]: *** Waiting for unfinished jobs....
In file included from TMPDIR/work/riscv64-yoe-linux/mariadb/11.4.5/mariadb-11.4.5/storage/innobase/buf/buf0buf.cc:38:
TMPDIR/work/riscv64-yoe-linux/mariadb/11.4.5/mariadb-11.4.5/include/my_cpu.h:100:3: error: use of undeclared identifier '__builtin_riscv_pause'
100 | __builtin_riscv_pause();
| ^
In file included from TMPDIR/work/riscv64-yoe-linux/mariadb/11.4.5/mariadb-11.4.5/storage/innobase/buf/buf0dblwr.cc:33:
In file included from TMPDIR/work/riscv64-yoe-linux/mariadb/11.4.5/mariadb-11.4.5/storage/innobase/include/trx0sys.h:39:
TMPDIR/work/riscv64-yoe-linux/mariadb/11.4.5/mariadb-11.4.5/include/my_cpu.h:100:3: error: use of undeclared identifier '__builtin_riscv_pause'
100 | __builtin_riscv_pause();
| ^
In file included from TMPDIR/work/riscv64-yoe-linux/mariadb/11.4.5/mariadb-11.4.5/storage/innobase/buf/buf0flu.cc:31:
In file included from TMPDIR/work/riscv64-yoe-linux/mariadb/11.4.5/mariadb-11.4.5/sql/sql_class.h:32:
In file included from TMPDIR/work/riscv64-yoe-linux/mariadb/11.4.5/mariadb-11.4.5/sql/field.h:29:
In file included from TMPDIR/work/riscv64-yoe-linux/mariadb/11.4.5/mariadb-11.4.5/sql/table.h:29:
TMPDIR/work/riscv64-yoe-linux/mariadb/11.4.5/mariadb-11.4.5/include/my_cpu.h:100:3: error: use of undeclared identifier '__builtin_riscv_pause'
100 | __builtin_riscv_pause();
| ^
1 error generated.
make[2]: *** [storage/innobase/CMakeFiles/innobase_embedded.dir/build.make:177: storage/innobase/CMakeFiles/innobase_embedded.dir/buf/buf0dblwr.cc.o] Error 1
1 error generated.
make[2]: *** [storage/innobase/CMakeFiles/innobase_embedded.dir/build.make:163: storage/innobase/CMakeFiles/innobase_embedded.dir/buf/buf0buf.cc.o] Error 1
In file included from TMPDIR/work/riscv64-yoe-linux/mariadb/11.4.5/mariadb-11.4.5/storage/innobase/buf/buf0lru.cc:40:
TMPDIR/work/riscv64-yoe-linux/mariadb/11.4.5/mariadb-11.4.5/include/my_cpu.h:100:3: error: use of undeclared identifier '__builtin_riscv_pause'
100 | __builtin_riscv_pause();
| ^
1 error generated.
make[2]: *** [storage/innobase/CMakeFiles/innobase_embedded.dir/build.make:233: storage/innobase/CMakeFiles/innobase_embedded.dir/buf/buf0lru.cc.o] Error 1
1 error generated.
make[2]: *** [storage/innobase/CMakeFiles/innobase_embedded.dir/build.make:219: storage/innobase/CMakeFiles/innobase_embedded.dir/buf/buf0flu.cc.o] Error 1
make[1]: *** [CMakeFiles/Makefile2:7027: storage/innobase/CMakeFiles/innobase_embedded.dir/all] Error 2
make: *** [Makefile:166: all] Error 2
WARNING: TMPDIR/work/riscv64-yoe-linux/mariadb/11.4.5/temp/run.do_compile.343164:170 exit 2 from 'eval ${DESTDIR:+DESTDIR=${DESTDIR} } cmake --build 'TMPDIR/work/riscv64-yoe-linux/mariadb/11.4.5/build' "$@" -- ${EXTRA_OECMAKE_BUILD}'
WARNING: Backtrace (BB generated script):
#1: cmake_runcmake_build, TMPDIR/work/riscv64-yoe-linux/mariadb/11.4.5/temp/run.do_compile.343164, line 170
#2: cmake_do_compile, TMPDIR/work/riscv64-yoe-linux/mariadb/11.4.5/temp/run.do_compile.343164, line 164
#3: do_compile, TMPDIR/work/riscv64-yoe-linux/mariadb/11.4.5/temp/run.do_compile.343164, line 159
#4: main, TMPDIR/work/riscv64-yoe-linux/mariadb/11.4.5/temp/run.do_compile.343164, line 183