Running '. ./oe-init-build-env; bitbake-selftest' with output to /home/pokybuild/yocto-worker/oe-selftest-armhost/build/build/command-1-cmds.log
This is the default build configuration for the Poky reference distribution.

### Shell environment set up for builds. ###

You can now run 'bitbake <target>'

Common targets are:
    core-image-minimal
    core-image-full-cmdline
    core-image-sato
    core-image-weston
    meta-toolchain
    meta-ide-support

You can also run generated qemu images with a command like 'runqemu qemux86-64'.

Other commonly useful commands are:
 - 'devtool' and 'recipetool' handle common recipe tasks
 - 'bitbake-layers' handles common layer tasks
 - 'oe-pkgdata-util' handles common target package tasks
...............................................................................................................................................................................................................................s.......................................................ssss.s..ssss.............................................................................E.F..............ss...................................................................................................................ssssssssssssssssssssssssssssssssssssssss.........................................................................................................................ssssssssssssssssssssssssssssssssssssssss......Sending SIGTERM to pr-server.
..................
======================================================================
ERROR: test_npm_registry_alternate (bb.tests.fetch.NPMTest.test_npm_registry_alternate)
----------------------------------------------------------------------
Traceback (most recent call last):
  File "/home/pokybuild/yocto-worker/oe-selftest-armhost/build/bitbake/lib/bb/tests/fetch.py", line 2922, in test_npm_registry_alternate
    fetcher.download()
    ~~~~~~~~~~~~~~~~^^
  File "/home/pokybuild/yocto-worker/oe-selftest-armhost/build/bitbake/lib/bb/fetch2/__init__.py", line 1872, in download
    if m.verify_donestamp(ud, self.d) and not m.need_update(ud, self.d):
       ~~~~~~~~~~~~~~~~~~^^^^^^^^^^^^
  File "/home/pokybuild/yocto-worker/oe-selftest-armhost/build/bitbake/lib/bb/fetch2/npm.py", line 285, in verify_donestamp
    proxy_m, proxy_ud, proxy_d = self._get_proxy_method(ud, d)
                                 ~~~~~~~~~~~~~~~~~~~~~~^^^^^^^
  File "/home/pokybuild/yocto-worker/oe-selftest-armhost/build/bitbake/lib/bb/fetch2/npm.py", line 276, in _get_proxy_method
    self._setup_proxy(ud, d)
    ~~~~~~~~~~~~~~~~~^^^^^^^
  File "/home/pokybuild/yocto-worker/oe-selftest-armhost/build/bitbake/lib/bb/fetch2/npm.py", line 264, in _setup_proxy
    self._resolve_proxy_url(ud, d)
    ~~~~~~~~~~~~~~~~~~~~~~~^^^^^^^
  File "/home/pokybuild/yocto-worker/oe-selftest-armhost/build/bitbake/lib/bb/fetch2/npm.py", line 255, in _resolve_proxy_url
    url = _get_url(_npm_view())
                   ~~~~~~~~~^^
  File "/home/pokybuild/yocto-worker/oe-selftest-armhost/build/bitbake/lib/bb/fetch2/npm.py", line 209, in _npm_view
    view_string = env.run(cmd, args=args)
  File "/home/pokybuild/yocto-worker/oe-selftest-armhost/build/bitbake/lib/bb/fetch2/npm.py", line 146, in run
    return _run(cmd)
  File "/home/pokybuild/yocto-worker/oe-selftest-armhost/build/bitbake/lib/bb/fetch2/npm.py", line 134, in _run
    return runfetchcmd(cmd, d, workdir=workdir)
  File "/home/pokybuild/yocto-worker/oe-selftest-armhost/build/bitbake/lib/bb/fetch2/__init__.py", line 980, in runfetchcmd
    raise FetchError(error_message)
bb.fetch2.FetchError: Fetcher failure: Fetch command export PSEUDO_DISABLED=1; export HOME="/tmp/tmpmm1iehyd"; NPM_CONFIG_GLOBALCONFIG=/dev/null NPM_CONFIG_USERCONFIG=/tmp/tmp9f1exusz npm view @savoirfairelinux/node-server-example@1.0.0 --json=true --registry=https://skimdb.npmjs.com failed with exit code 1, output:
{
  "error": {
    "code": "E404",
    "summary": "Not Found - GET https://replicate.npmjs.com/@savoirfairelinux%2Fnode-server-example",
    "detail": "\n '@savoirfairelinux/node-server-example@1.0.0' is not in this registry.\n\nNote that you can also install from a\ntarball, folder, http url, or git url."
  }
}

npm ERR! code E404
npm ERR! 404 Not Found - GET https://replicate.npmjs.com/@savoirfairelinux%2Fnode-server-example
npm ERR! 404 
npm ERR! 404  '@savoirfairelinux/node-server-example@1.0.0' is not in this registry.
npm ERR! 404 
npm ERR! 404 Note that you can also install from a
npm ERR! 404 tarball, folder, http url, or git url.

npm ERR! A complete log of this run can be found in:
npm ERR!     /tmp/tmpmm1iehyd/.npm/_logs/2025-08-16T09_49_23_555Z-debug-0.log


======================================================================
FAIL: test_npm_registry_none (bb.tests.fetch.NPMTest.test_npm_registry_none)
----------------------------------------------------------------------
Traceback (most recent call last):
  File "/home/pokybuild/yocto-worker/oe-selftest-armhost/build/bitbake/lib/bb/tests/fetch.py", line 2964, in test_npm_registry_none
    with self.assertRaises(bb.fetch2.MalformedUrl):
         ~~~~~~~~~~~~~~~~~^^^^^^^^^^^^^^^^^^^^^^^^
AssertionError: MalformedUrl not raised

----------------------------------------------------------------------
Ran 727 tests in 1119.961s

FAILED (failures=1, errors=1, skipped=92)

Error details

Submitted on:
16/08/25 04:56
Error type:
Bitbake selftest
Command:
bitbake-selftest
Machine:
qemuarm64
Distro:
poky
Build system:
unknown
Target system:
unknown
Host distro:
unknown
Branch:
master
Commit:
unknown
Build:
#214528
Submitter:
yp-ab-bagheera
Link back:
http://pluto.local:8010/#/builders/33/builds/1
Similar errors:
3
Open a bug