Running '. ./init-build-env; /srv/pokybuild/yocto-worker/pkgman-non-rpm/yocto-autobuilder-helper/scripts/checkvnc; DISPLAY=:1 bitbake core-image-minimal:do_testimage core-image-sato:do_testimage core-image-sato-sdk:do_testimage core-image-minimal:do_testsdk -k' with output to /srv/pokybuild/yocto-worker/pkgman-non-rpm/build/build/command-3-test-targets.log in /srv/pokybuild/yocto-worker/pkgman-non-rpm/build/build
Poky - The Yocto Project testing distribution
NOTE: Reconnecting to bitbake server...
Loading cache...done.
Loaded 1939 entries from dependency cache.
NOTE: Resolving any missing task queue dependencies

Build Configuration:
BB_VERSION           = "2.15.2"
BUILD_SYS            = "x86_64-linux"
NATIVELSBSTRING      = "universal"
TARGET_SYS           = "aarch64-poky-linux"
MACHINE              = "qemuarm64"
DISTRO               = "poky"
DISTRO_VERSION       = "5.2.99+snapshot-7a571c23b137c4bf60fa6d402e3f86195f263bde"
TUNE_FEATURES        = "aarch64 crc cortexa57"
TARGET_FPU           = ""
meta                 = "mathieu/master-next:7a571c23b137c4bf60fa6d402e3f86195f263bde"
meta-yocto-bsp       
meta-poky            = "master:fe65e142d0d9ba0e51ff9175ffa82e902f982a20"

Initialising tasks...Sstate summary: Wanted 153 Local 153 Mirrors 0 Missed 0 Current 235 (100% match, 100% complete)
done.
NOTE: Executing Tasks
NOTE: Setscene tasks completed
NOTE: Running task 1314 of 1319 (/srv/pokybuild/yocto-worker/pkgman-non-rpm/build/layers/openembedded-core/meta/recipes-core/meta/package-index.bb:do_package_index)
NOTE: Running task 1316 of 1319 (/srv/pokybuild/yocto-worker/pkgman-non-rpm/build/layers/openembedded-core/meta/recipes-core/images/core-image-minimal.bb:do_testsdk)
NOTE: recipe package-index-1.0-r0: task do_package_index: Started
NOTE: recipe core-image-minimal-1.0-r0: task do_testsdk: Started
NOTE: recipe package-index-1.0-r0: task do_package_index: Succeeded
NOTE: Running task 1317 of 1319 (/srv/pokybuild/yocto-worker/pkgman-non-rpm/build/layers/openembedded-core/meta/recipes-sato/images/core-image-sato-sdk.bb:do_testimage)
NOTE: Running task 1318 of 1319 (/srv/pokybuild/yocto-worker/pkgman-non-rpm/build/layers/openembedded-core/meta/recipes-sato/images/core-image-sato.bb:do_testimage)
NOTE: Running task 1319 of 1319 (/srv/pokybuild/yocto-worker/pkgman-non-rpm/build/layers/openembedded-core/meta/recipes-core/images/core-image-minimal.bb:do_testimage)
NOTE: recipe core-image-sato-sdk-1.0-r0: task do_testimage: Started
NOTE: recipe core-image-sato-1.0-r0: task do_testimage: Started
NOTE: recipe core-image-minimal-1.0-r0: task do_testimage: Started
QMP Available for connection at /srv/pokybuild/yocto-worker/pkgman-non-rpm/build/build/tmp/.8ytdlcam
QMP Available for connection at /srv/pokybuild/yocto-worker/pkgman-non-rpm/build/build/tmp/.4t9naefu
QMP Available for connection at /srv/pokybuild/yocto-worker/pkgman-non-rpm/build/build/tmp/.o363ydyq
QMP connected to QEMU at 10/16/25 05:38:47 and took 0.60 seconds
QMP released QEMU at 10/16/25 05:38:47 and took 0.14 seconds from connect
QMP connected to QEMU at 10/16/25 05:38:47 and took 1.07 seconds
QMP released QEMU at 10/16/25 05:38:47 and took 0.12 seconds from connect
SDK testing environment: cortexa57-poky-linux
QMP connected to QEMU at 10/16/25 05:38:51 and took 5.28 seconds
QMP released QEMU at 10/16/25 05:38:52 and took 0.14 seconds from connect
Test requires apt to be installed
Test requires openssh-sshd, or dropbear to be installed
Test requires autoconf to be installed
Test requires gtk+3 to be installed
Test requires autoconf to be installed
Test requires connman to be installed
Test case connman.ConnmanTest.test_connmand_running depends on connman.ConnmanTest.test_connmand_help but it didn't pass/run.
Test case date.DateTest.test_date depends on ssh.SSHTest.test_ssh but it didn't pass/run.
Test case df.DfTest.test_df depends on ssh.SSHTest.test_ssh but it didn't pass/run.
Test case dnf.DnfBasicTest.test_dnf_help depends on ssh.SSHTest.test_ssh but it didn't pass/run.
Test case dnf.DnfBasicTest.test_dnf_history depends on dnf.DnfBasicTest.test_dnf_help but it didn't pass/run.
Test case dnf.DnfBasicTest.test_dnf_info depends on dnf.DnfBasicTest.test_dnf_help but it didn't pass/run.
Test case dnf.DnfBasicTest.test_dnf_search depends on dnf.DnfBasicTest.test_dnf_help but it didn't pass/run.
Test case dnf.DnfBasicTest.test_dnf_version depends on dnf.DnfBasicTest.test_dnf_help but it didn't pass/run.
Test case dnf.DnfRepoTest.test_dnf_makecache depends on dnf.DnfBasicTest.test_dnf_help but it didn't pass/run.
Test case dnf.DnfRepoTest.test_dnf_exclude depends on dnf.DnfRepoTest.test_dnf_makecache but it didn't pass/run.
Test case dnf.DnfRepoTest.test_dnf_install depends on dnf.DnfRepoTest.test_dnf_makecache but it didn't pass/run.
Test case dnf.DnfRepoTest.test_dnf_install_dependency depends on dnf.DnfRepoTest.test_dnf_install but it didn't pass/run.
Test case dnf.DnfRepoTest.test_dnf_install_from_disk depends on dnf.DnfRepoTest.test_dnf_install_dependency but it didn't pass/run.
Test case dnf.DnfRepoTest.test_dnf_install_from_http depends on dnf.DnfRepoTest.test_dnf_install_from_disk but it didn't pass/run.
Test case dnf.DnfRepoTest.test_dnf_installroot depends on dnf.DnfRepoTest.test_dnf_makecache but it didn't pass/run.
Test run when enable usrmerge
Test case dnf.DnfRepoTest.test_dnf_reinstall depends on dnf.DnfRepoTest.test_dnf_install but it didn't pass/run.
Test case dnf.DnfRepoTest.test_dnf_repoinfo depends on dnf.DnfRepoTest.test_dnf_makecache but it didn't pass/run.
Test requires gcc to be installed
Test requires g++ to be installed
Test requires g++ to be installed
Test requires make to be installed
Test requires python3-pygobject to be installed
Test requires openssh-scp to be installed
Test requires openssh-scp to be installed
Test requires go-helloworld to be installed
Test requires gcc to be installed
Test case ldd.LddTest.test_ldd depends on ssh.SSHTest.test_ssh but it didn't pass/run.
Test requires logrotate to be installed
Test case logrotate.LogrotateTest.test_logrotate_newlog depends on logrotate.LogrotateTest.test_logrotate_wtmp but it didn't pass/run.
Test case oe_syslog.SyslogTest.test_syslog_running depends on ssh.SSHTest.test_ssh but it didn't pass/run.
Test case oe_syslog.SyslogTestConfig.test_syslog_logger depends on oe_syslog.SyslogTest.test_syslog_running but it didn't pass/run.
Test case oe_syslog.SyslogTestConfig.test_syslog_restart depends on oe_syslog.SyslogTest.test_syslog_running but it didn't pass/run.
Test case oe_syslog.SyslogTestConfig.test_syslog_startup_config depends on oe_syslog.SyslogTestConfig.test_syslog_logger but it didn't pass/run.
Test requires opkg to be installed
Test requires shadow-base to be installed
Test case parselogs.ParseLogsTest.test_parselogs depends on ssh.SSHTest.test_ssh but it didn't pass/run.
Test requires perl to be installed
Test requires ptest-runner to be installed
Test requires ptest-runner to be installed
Test requires python3-core to be installed
Test case rpm.RpmBasicTest.test_rpm_help depends on ssh.SSHTest.test_ssh but it didn't pass/run.
Test case rpm.RpmBasicTest.test_rpm_query depends on rpm.RpmBasicTest.test_rpm_help but it didn't pass/run.
Test case rpm.RpmBasicTest.test_rpm_query_nonroot depends on rpm.RpmBasicTest.test_rpm_query but it didn't pass/run.
Test case rpm.RpmInstallRemoveTest.test_rpm_install depends on rpm.RpmBasicTest.test_rpm_query but it didn't pass/run.
Test case rpm.RpmInstallRemoveTest.test_rpm_remove depends on rpm.RpmInstallRemoveTest.test_rpm_install but it didn't pass/run.
Test case rpm.RpmInstallRemoveTest.test_check_rpm_install_removal_log_file_size depends on rpm.RpmInstallRemoveTest.test_rpm_remove but it didn't pass/run.
Test requires rust-c-lib-example-bin to be installed
Test requires openssh-scp to be installed
Test requires openssh-scp to be installed
Test requires openssh-scp, or openssh-sftp-server to be installed
Test requires kernel-devsrc to be installed
Test case systemd.SystemdBasicTests.test_systemd_basic depends on ssh.SSHTest.test_ssh but it didn't pass/run.
Test case systemd.SystemdBasicTests.test_systemd_failed depends on systemd.SystemdBasicTests.test_systemd_basic but it didn't pass/run.
Test case systemd.SystemdBasicTests.test_systemd_list depends on systemd.SystemdBasicTests.test_systemd_basic but it didn't pass/run.
Test case systemd.SystemdJournalTests.test_systemd_boot_time depends on systemd.SystemdBasicTests.test_systemd_basic but it didn't pass/run.
Test case systemd.SystemdJournalTests.test_systemd_journal depends on systemd.SystemdBasicTests.test_systemd_basic but it didn't pass/run.
Test requires minidebuginfo to be in DISTRO_FEATURES
Test case systemd.SystemdServiceTests.test_systemd_status depends on systemd.SystemdBasicTests.test_systemd_basic but it didn't pass/run.
Test case systemd.SystemdServiceTests.test_systemd_disable_enable depends on systemd.SystemdServiceTests.test_systemd_status but it didn't pass/run.
Test is only meant to run with read-only-rootfs in IMAGE_FEATURES
Test case systemd.SystemdServiceTests.test_systemd_stop_start depends on systemd.SystemdServiceTests.test_systemd_status but it didn't pass/run.
Test requires wayland-utils to be installed
Test requires weston to be installed
Test requires weston to be installed
Test requires weston to be installed
Test requires xserver-nodm-init to be installed
Test requires apt to be installed
Test requires autoconf to be installed
Test requires gtk+3 to be installed
Test requires autoconf to be installed
Output from runqemu:
runqemu - INFO - Received signal: 15
runqemu - INFO - Cleaning up
runqemu - INFO - Host uptime: 258227.93

runqemu - INFO - Removing /srv/pokybuild/yocto-worker/pkgman-non-rpm/build/build/tmp/deploy/images/qemuarm64/core-image-minimal-qemuarm64.rootfs-20251016053408.ext4
runqemu - INFO - Removing /home/pokybuild/tmp/core-image-minimal-qemuarm64.rootfs-20251016053408.ext4.3846104
tput: No value for $TERM and no -T specified

RESULTS:
RESULTS - parselogs.ParseLogsTest.test_get_context: PASSED (0.00s)
RESULTS - ping.PingTest.test_ping: PASSED (0.03s)
RESULTS - apt.AptRepoTest.test_apt_install_from_repo: SKIPPED (0.00s)
RESULTS - buildcpio.BuildCpioTest.test_cpio: SKIPPED (0.00s)
RESULTS - buildgalculator.GalculatorTest.test_galculator: SKIPPED (0.00s)
RESULTS - buildlzip.BuildLzipTest.test_lzip: SKIPPED (0.00s)
RESULTS - connman.ConnmanTest.test_connmand_help: SKIPPED (0.00s)
RESULTS - connman.ConnmanTest.test_connmand_running: SKIPPED (0.00s)
RESULTS - date.DateTest.test_date: SKIPPED (0.00s)
RESULTS - df.DfTest.test_df: SKIPPED (0.00s)
RESULTS - dnf.DnfBasicTest.test_dnf_help: SKIPPED (0.00s)
RESULTS - dnf.DnfBasicTest.test_dnf_history: SKIPPED (0.00s)
RESULTS - dnf.DnfBasicTest.test_dnf_info: SKIPPED (0.00s)
RESULTS - dnf.DnfBasicTest.test_dnf_search: SKIPPED (0.00s)
RESULTS - dnf.DnfBasicTest.test_dnf_version: SKIPPED (0.00s)
RESULTS - dnf.DnfRepoTest.test_dnf_exclude: SKIPPED (0.00s)
RESULTS - dnf.DnfRepoTest.test_dnf_install: SKIPPED (0.00s)
RESULTS - dnf.DnfRepoTest.test_dnf_install_dependency: SKIPPED (0.00s)
RESULTS - dnf.DnfRepoTest.test_dnf_install_from_disk: SKIPPED (0.00s)
RESULTS - dnf.DnfRepoTest.test_dnf_install_from_http: SKIPPED (0.00s)
RESULTS - dnf.DnfRepoTest.test_dnf_installroot: SKIPPED (0.00s)
RESULTS - dnf.DnfRepoTest.test_dnf_installroot_usrmerge: SKIPPED (0.00s)
RESULTS - dnf.DnfRepoTest.test_dnf_makecache: SKIPPED (0.00s)
RESULTS - dnf.DnfRepoTest.test_dnf_reinstall: SKIPPED (0.00s)
RESULTS - dnf.DnfRepoTest.test_dnf_repoinfo: SKIPPED (0.00s)
RESULTS - gcc.GccCompileTest.test_gcc_compile: SKIPPED (0.00s)
RESULTS - gcc.GccCompileTest.test_gpp2_compile: SKIPPED (0.00s)
RESULTS - gcc.GccCompileTest.test_gpp_compile: SKIPPED (0.00s)
RESULTS - gcc.GccCompileTest.test_make: SKIPPED (0.00s)
RESULTS - gi.GObjectIntrospectionTest.test_python: SKIPPED (0.00s)
RESULTS - go.GoCompileTest.test_go_compile: SKIPPED (0.00s)
RESULTS - go.GoCompileTest.test_go_module: SKIPPED (0.00s)
RESULTS - go.GoHelloworldTest.test_gohelloworld: SKIPPED (0.00s)
RESULTS - kernelmodule.KernelModuleTest.test_kernel_module: SKIPPED (0.00s)
RESULTS - ldd.LddTest.test_ldd: SKIPPED (0.00s)
RESULTS - logrotate.LogrotateTest.test_logrotate_newlog: SKIPPED (0.00s)
RESULTS - logrotate.LogrotateTest.test_logrotate_wtmp: SKIPPED (0.00s)
RESULTS - oe_syslog.SyslogTest.test_syslog_running: SKIPPED (0.00s)
RESULTS - oe_syslog.SyslogTestConfig.test_syslog_logger: SKIPPED (0.00s)
RESULTS - oe_syslog.SyslogTestConfig.test_syslog_restart: SKIPPED (0.00s)
RESULTS - oe_syslog.SyslogTestConfig.test_syslog_startup_config: SKIPPED (0.00s)
RESULTS - opkg.OpkgRepoTest.test_opkg_install_from_repo: SKIPPED (0.00s)
RESULTS - pam.PamBasicTest.test_pam: SKIPPED (0.00s)
RESULTS - parselogs.ParseLogsTest.test_parselogs: SKIPPED (0.00s)
RESULTS - perl.PerlTest.test_perl_works: SKIPPED (0.00s)
RESULTS - ptest.PtestRunnerTest.test_ptestrunner_expectfail: SKIPPED (0.00s)
RESULTS - ptest.PtestRunnerTest.test_ptestrunner_expectsuccess: SKIPPED (0.00s)
RESULTS - python.PythonTest.test_python3: SKIPPED (0.00s)
RESULTS - rpm.RpmBasicTest.test_rpm_help: SKIPPED (0.00s)
RESULTS - rpm.RpmBasicTest.test_rpm_query: SKIPPED (0.00s)
RESULTS - rpm.RpmBasicTest.test_rpm_query_nonroot: SKIPPED (0.00s)
RESULTS - rpm.RpmInstallRemoveTest.test_check_rpm_install_removal_log_file_size: SKIPPED (0.00s)
RESULTS - rpm.RpmInstallRemoveTest.test_rpm_install: SKIPPED (0.00s)
RESULTS - rpm.RpmInstallRemoveTest.test_rpm_remove: SKIPPED (0.00s)
RESULTS - rust.RustCLibExampleTest.test_rust_c_lib_example: SKIPPED (0.00s)
RESULTS - rust.RustCompileTest.test_cargo_compile: SKIPPED (0.00s)
RESULTS - rust.RustCompileTest.test_rust_compile: SKIPPED (0.00s)
RESULTS - scp.ScpTest.test_scp_file: SKIPPED (0.00s)
RESULTS - ssh.SSHTest.test_ssh: SKIPPED (0.00s)
RESULTS - stap.StapTest.test_stap: SKIPPED (0.00s)
RESULTS - systemd.SystemdBasicTests.test_systemd_basic: SKIPPED (0.00s)
RESULTS - systemd.SystemdBasicTests.test_systemd_failed: SKIPPED (0.00s)
RESULTS - systemd.SystemdBasicTests.test_systemd_list: SKIPPED (0.00s)
RESULTS - systemd.SystemdJournalTests.test_systemd_boot_time: SKIPPED (0.00s)
RESULTS - systemd.SystemdJournalTests.test_systemd_journal: SKIPPED (0.00s)
RESULTS - systemd.SystemdServiceTests.test_systemd_coredump_minidebuginfo: SKIPPED (0.00s)
RESULTS - systemd.SystemdServiceTests.test_systemd_disable_enable: SKIPPED (0.00s)
RESULTS - systemd.SystemdServiceTests.test_systemd_disable_enable_ro: SKIPPED (0.00s)
RESULTS - systemd.SystemdServiceTests.test_systemd_status: SKIPPED (0.00s)
RESULTS - systemd.SystemdServiceTests.test_systemd_stop_start: SKIPPED (0.00s)
RESULTS - weston.WestonTest.test_wayland_info: SKIPPED (0.00s)
RESULTS - weston.WestonTest.test_weston_can_initialize_new_wayland_compositor: SKIPPED (0.00s)
RESULTS - weston.WestonTest.test_weston_running: SKIPPED (0.00s)
RESULTS - weston.WestonTest.test_weston_supports_xwayland: SKIPPED (0.00s)
RESULTS - xorg.XorgTest.test_xorg_running: SKIPPED (0.00s)
SUMMARY:
core-image-minimal () - Ran 75 tests in 0.098s
core-image-minimal - OK - All required tests passed (successes=2, skipped=73, failures=0, errors=0)
NOTE: recipe core-image-minimal-1.0-r0: task do_testimage: Succeeded
Test requires dnf to be installed
Test case dnf.DnfBasicTest.test_dnf_history depends on dnf.DnfBasicTest.test_dnf_help but it didn't pass/run.
Test case dnf.DnfBasicTest.test_dnf_info depends on dnf.DnfBasicTest.test_dnf_help but it didn't pass/run.
Test case dnf.DnfBasicTest.test_dnf_search depends on dnf.DnfBasicTest.test_dnf_help but it didn't pass/run.
Test case dnf.DnfBasicTest.test_dnf_version depends on dnf.DnfBasicTest.test_dnf_help but it didn't pass/run.
Test case dnf.DnfRepoTest.test_dnf_makecache depends on dnf.DnfBasicTest.test_dnf_help but it didn't pass/run.
Test case dnf.DnfRepoTest.test_dnf_exclude depends on dnf.DnfRepoTest.test_dnf_makecache but it didn't pass/run.
Test case dnf.DnfRepoTest.test_dnf_install depends on dnf.DnfRepoTest.test_dnf_makecache but it didn't pass/run.
Test case dnf.DnfRepoTest.test_dnf_install_dependency depends on dnf.DnfRepoTest.test_dnf_install but it didn't pass/run.
Test case dnf.DnfRepoTest.test_dnf_install_from_disk depends on dnf.DnfRepoTest.test_dnf_install_dependency but it didn't pass/run.
Test case dnf.DnfRepoTest.test_dnf_install_from_http depends on dnf.DnfRepoTest.test_dnf_install_from_disk but it didn't pass/run.
Test case dnf.DnfRepoTest.test_dnf_installroot depends on dnf.DnfRepoTest.test_dnf_makecache but it didn't pass/run.
Test run when enable usrmerge
Test case dnf.DnfRepoTest.test_dnf_reinstall depends on dnf.DnfRepoTest.test_dnf_install but it didn't pass/run.
Test case dnf.DnfRepoTest.test_dnf_repoinfo depends on dnf.DnfRepoTest.test_dnf_makecache but it didn't pass/run.
Test requires gcc to be installed
Test requires g++ to be installed
Test requires g++ to be installed
Test requires make to be installed
Test requires python3-pygobject to be installed
Test requires openssh-scp to be installed
Test requires openssh-scp to be installed
Test requires go-helloworld to be installed
Test requires gcc to be installed
Test requires ldd to be installed
Test requires logrotate to be installed
Test case logrotate.LogrotateTest.test_logrotate_newlog depends on logrotate.LogrotateTest.test_logrotate_wtmp but it didn't pass/run.
Test requires apt to be installed
Test requires pam to be in DISTRO_FEATURES
Test requires perl to be installed
Test requires ptest-runner to be installed
Test requires ptest-runner to be installed
Test requires rpm to be installed
Test case rpm.RpmBasicTest.test_rpm_query depends on rpm.RpmBasicTest.test_rpm_help but it didn't pass/run.
Test case rpm.RpmBasicTest.test_rpm_query_nonroot depends on rpm.RpmBasicTest.test_rpm_query but it didn't pass/run.
Test case rpm.RpmInstallRemoveTest.test_rpm_install depends on rpm.RpmBasicTest.test_rpm_query but it didn't pass/run.
Test case rpm.RpmInstallRemoveTest.test_rpm_remove depends on rpm.RpmInstallRemoveTest.test_rpm_install but it didn't pass/run.
Test case rpm.RpmInstallRemoveTest.test_check_rpm_install_removal_log_file_size depends on rpm.RpmInstallRemoveTest.test_rpm_remove but it didn't pass/run.
Test requires rust-c-lib-example-bin to be installed
Test requires openssh-scp to be installed
Test requires openssh-scp to be installed
Test requires kernel-devsrc to be installed
systemd is not the init manager for this image
Test case systemd.SystemdBasicTests.test_systemd_failed depends on systemd.SystemdBasicTests.test_systemd_basic but it didn't pass/run.
Test case systemd.SystemdBasicTests.test_systemd_list depends on systemd.SystemdBasicTests.test_systemd_basic but it didn't pass/run.
Test case systemd.SystemdJournalTests.test_systemd_boot_time depends on systemd.SystemdBasicTests.test_systemd_basic but it didn't pass/run.
Test case systemd.SystemdJournalTests.test_systemd_journal depends on systemd.SystemdBasicTests.test_systemd_basic but it didn't pass/run.
Test requires minidebuginfo to be in DISTRO_FEATURES
Test case systemd.SystemdServiceTests.test_systemd_status depends on systemd.SystemdBasicTests.test_systemd_basic but it didn't pass/run.
Test case systemd.SystemdServiceTests.test_systemd_disable_enable depends on systemd.SystemdServiceTests.test_systemd_status but it didn't pass/run.
Test is only meant to run with read-only-rootfs in IMAGE_FEATURES
Test case systemd.SystemdServiceTests.test_systemd_stop_start depends on systemd.SystemdServiceTests.test_systemd_status but it didn't pass/run.
Test requires wayland-utils to be installed
Test requires weston to be installed
Test requires weston to be installed
Test requires weston to be installed
Output from runqemu:
runqemu - INFO - Received signal: 15
runqemu - INFO - Cleaning up
runqemu - INFO - Host uptime: 258268.56

runqemu - INFO - Removing /srv/pokybuild/yocto-worker/pkgman-non-rpm/build/build/tmp/deploy/images/qemuarm64/core-image-sato-qemuarm64.rootfs-20251016053408.ext4
runqemu - INFO - Removing /home/pokybuild/tmp/core-image-sato-qemuarm64.rootfs-20251016053408.ext4.3846090
tput: No value for $TERM and no -T specified

RESULTS:
RESULTS - connman.ConnmanTest.test_connmand_help: PASSED (0.67s)
RESULTS - connman.ConnmanTest.test_connmand_running: PASSED (0.64s)
RESULTS - date.DateTest.test_date: PASSED (2.37s)
RESULTS - df.DfTest.test_df: PASSED (0.58s)
RESULTS - oe_syslog.SyslogTest.test_syslog_running: PASSED (0.58s)
RESULTS - oe_syslog.SyslogTestConfig.test_syslog_logger: PASSED (1.97s)
RESULTS - oe_syslog.SyslogTestConfig.test_syslog_restart: PASSED (6.24s)
RESULTS - oe_syslog.SyslogTestConfig.test_syslog_startup_config: PASSED (12.09s)
RESULTS - opkg.OpkgRepoTest.test_opkg_install_from_repo: PASSED (4.89s)
RESULTS - parselogs.ParseLogsTest.test_get_context: PASSED (0.00s)
RESULTS - parselogs.ParseLogsTest.test_parselogs: PASSED (3.19s)
RESULTS - ping.PingTest.test_ping: PASSED (0.02s)
RESULTS - python.PythonTest.test_python3: PASSED (1.06s)
RESULTS - scp.ScpTest.test_scp_file: PASSED (1.40s)
RESULTS - ssh.SSHTest.test_ssh: PASSED (0.61s)
RESULTS - xorg.XorgTest.test_xorg_running: PASSED (1.22s)
RESULTS - apt.AptRepoTest.test_apt_install_from_repo: SKIPPED (0.00s)
RESULTS - buildcpio.BuildCpioTest.test_cpio: SKIPPED (0.00s)
RESULTS - buildgalculator.GalculatorTest.test_galculator: SKIPPED (0.00s)
RESULTS - buildlzip.BuildLzipTest.test_lzip: SKIPPED (0.00s)
RESULTS - dnf.DnfBasicTest.test_dnf_help: SKIPPED (0.00s)
RESULTS - dnf.DnfBasicTest.test_dnf_history: SKIPPED (0.00s)
RESULTS - dnf.DnfBasicTest.test_dnf_info: SKIPPED (0.00s)
RESULTS - dnf.DnfBasicTest.test_dnf_search: SKIPPED (0.00s)
RESULTS - dnf.DnfBasicTest.test_dnf_version: SKIPPED (0.00s)
RESULTS - dnf.DnfRepoTest.test_dnf_exclude: SKIPPED (0.00s)
RESULTS - dnf.DnfRepoTest.test_dnf_install: SKIPPED (0.00s)
RESULTS - dnf.DnfRepoTest.test_dnf_install_dependency: SKIPPED (0.00s)
RESULTS - dnf.DnfRepoTest.test_dnf_install_from_disk: SKIPPED (0.00s)
RESULTS - dnf.DnfRepoTest.test_dnf_install_from_http: SKIPPED (0.00s)
RESULTS - dnf.DnfRepoTest.test_dnf_installroot: SKIPPED (0.00s)
RESULTS - dnf.DnfRepoTest.test_dnf_installroot_usrmerge: SKIPPED (0.00s)
RESULTS - dnf.DnfRepoTest.test_dnf_makecache: SKIPPED (0.00s)
RESULTS - dnf.DnfRepoTest.test_dnf_reinstall: SKIPPED (0.00s)
RESULTS - dnf.DnfRepoTest.test_dnf_repoinfo: SKIPPED (0.00s)
RESULTS - gcc.GccCompileTest.test_gcc_compile: SKIPPED (0.00s)
RESULTS - gcc.GccCompileTest.test_gpp2_compile: SKIPPED (0.00s)
RESULTS - gcc.GccCompileTest.test_gpp_compile: SKIPPED (0.00s)
RESULTS - gcc.GccCompileTest.test_make: SKIPPED (0.00s)
RESULTS - gi.GObjectIntrospectionTest.test_python: SKIPPED (0.00s)
RESULTS - go.GoCompileTest.test_go_compile: SKIPPED (0.00s)
RESULTS - go.GoCompileTest.test_go_module: SKIPPED (0.00s)
RESULTS - go.GoHelloworldTest.test_gohelloworld: SKIPPED (0.00s)
RESULTS - kernelmodule.KernelModuleTest.test_kernel_module: SKIPPED (0.00s)
RESULTS - ldd.LddTest.test_ldd: SKIPPED (0.00s)
RESULTS - logrotate.LogrotateTest.test_logrotate_newlog: SKIPPED (0.00s)
RESULTS - logrotate.LogrotateTest.test_logrotate_wtmp: SKIPPED (0.00s)
RESULTS - pam.PamBasicTest.test_pam: SKIPPED (0.00s)
RESULTS - perl.PerlTest.test_perl_works: SKIPPED (0.00s)
RESULTS - ptest.PtestRunnerTest.test_ptestrunner_expectfail: SKIPPED (0.00s)
RESULTS - ptest.PtestRunnerTest.test_ptestrunner_expectsuccess: SKIPPED (0.00s)
RESULTS - rpm.RpmBasicTest.test_rpm_help: SKIPPED (0.00s)
RESULTS - rpm.RpmBasicTest.test_rpm_query: SKIPPED (0.00s)
RESULTS - rpm.RpmBasicTest.test_rpm_query_nonroot: SKIPPED (0.00s)
RESULTS - rpm.RpmInstallRemoveTest.test_check_rpm_install_removal_log_file_size: SKIPPED (0.00s)
RESULTS - rpm.RpmInstallRemoveTest.test_rpm_install: SKIPPED (0.00s)
RESULTS - rpm.RpmInstallRemoveTest.test_rpm_remove: SKIPPED (0.00s)
RESULTS - rust.RustCLibExampleTest.test_rust_c_lib_example: SKIPPED (0.00s)
RESULTS - rust.RustCompileTest.test_cargo_compile: SKIPPED (0.00s)
RESULTS - rust.RustCompileTest.test_rust_compile: SKIPPED (0.00s)
RESULTS - stap.StapTest.test_stap: SKIPPED (0.00s)
RESULTS - systemd.SystemdBasicTests.test_systemd_basic: SKIPPED (0.00s)
RESULTS - systemd.SystemdBasicTests.test_systemd_failed: SKIPPED (0.00s)
RESULTS - systemd.SystemdBasicTests.test_systemd_list: SKIPPED (0.00s)
RESULTS - systemd.SystemdJournalTests.test_systemd_boot_time: SKIPPED (0.00s)
RESULTS - systemd.SystemdJournalTests.test_systemd_journal: SKIPPED (0.00s)
RESULTS - systemd.SystemdServiceTests.test_systemd_coredump_minidebuginfo: SKIPPED (0.00s)
RESULTS - systemd.SystemdServiceTests.test_systemd_disable_enable: SKIPPED (0.00s)
RESULTS - systemd.SystemdServiceTests.test_systemd_disable_enable_ro: SKIPPED (0.00s)
RESULTS - systemd.SystemdServiceTests.test_systemd_status: SKIPPED (0.00s)
RESULTS - systemd.SystemdServiceTests.test_systemd_stop_start: SKIPPED (0.00s)
RESULTS - weston.WestonTest.test_wayland_info: SKIPPED (0.00s)
RESULTS - weston.WestonTest.test_weston_can_initialize_new_wayland_compositor: SKIPPED (0.00s)
RESULTS - weston.WestonTest.test_weston_running: SKIPPED (0.00s)
RESULTS - weston.WestonTest.test_weston_supports_xwayland: SKIPPED (0.00s)
SUMMARY:
core-image-sato () - Ran 75 tests in 37.590s
core-image-sato - OK - All required tests passed (successes=16, skipped=59, failures=0, errors=0)
NOTE: recipe core-image-sato-1.0-r0: task do_testimage: Succeeded
GoCompileTest class: go command not available: Command '. /srv/pokybuild/yocto-worker/pkgman-non-rpm/build/build/tmp/work/qemuarm64-poky-linux/core-image-minimal/1.0/testimage-sdk/environment-setup-cortexa57-poky-linux > /dev/null; which go;' returned non-zero exit status 1.
Standard Output: which: no go in (/srv/pokybuild/yocto-worker/pkgman-non-rpm/build/build/tmp/work/qemuarm64-poky-linux/core-image-minimal/1.0/testimage-sdk/sysroots/x86_64-pokysdk-linux/usr/bin:/srv/pokybuild/yocto-worker/pkgman-non-rpm/build/build/tmp/work/qemuarm64-poky-linux/core-image-minimal/1.0/testimage-sdk/sysroots/x86_64-pokysdk-linux/usr/sbin:/srv/pokybuild/yocto-worker/pkgman-non-rpm/build/build/tmp/work/qemuarm64-poky-linux/core-image-minimal/1.0/testimage-sdk/sysroots/x86_64-pokysdk-linux/bin:/srv/pokybuild/yocto-worker/pkgman-non-rpm/build/build/tmp/work/qemuarm64-poky-linux/core-image-minimal/1.0/testimage-sdk/sysroots/x86_64-pokysdk-linux/sbin:/srv/pokybuild/yocto-worker/pkgman-non-rpm/build/build/tmp/work/qemuarm64-poky-linux/core-image-minimal/1.0/testimage-sdk/sysroots/x86_64-pokysdk-linux/usr/bin/../x86_64-pokysdk-linux/bin:/srv/pokybuild/yocto-worker/pkgman-non-rpm/build/build/tmp/work/qemuarm64-poky-linux/core-image-minimal/1.0/testimage-sdk/sysroots/x86_64-pokysdk-linux/usr/bin/aarch64-poky-linux:/srv/pokybuild/yocto-worker/pkgman-non-rpm/build/build/tmp/work/qemuarm64-poky-linux/core-image-minimal/1.0/testimage-sdk/sysroots/x86_64-pokysdk-linux/usr/bin/aarch64-poky-linux-musl:/srv/pokybuild/yocto-worker/pkgman-non-rpm/build/layers/openembedded-core/scripts:/srv/pokybuild/yocto-worker/pkgman-non-rpm/build/layers/bitbake/bin:/srv/pokybuild/buildbot-venv/bin:/srv/pokybuild/bin:/usr/local/bin:/usr/bin:/bin:/usr/local/sbin:/usr/sbin)

GoCompileTest class: go command not available: Command '. /srv/pokybuild/yocto-worker/pkgman-non-rpm/build/build/tmp/work/qemuarm64-poky-linux/core-image-minimal/1.0/testimage-sdk/environment-setup-cortexa57-poky-linux > /dev/null; which go;' returned non-zero exit status 1.
Standard Output: which: no go in (/srv/pokybuild/yocto-worker/pkgman-non-rpm/build/build/tmp/work/qemuarm64-poky-linux/core-image-minimal/1.0/testimage-sdk/sysroots/x86_64-pokysdk-linux/usr/bin:/srv/pokybuild/yocto-worker/pkgman-non-rpm/build/build/tmp/work/qemuarm64-poky-linux/core-image-minimal/1.0/testimage-sdk/sysroots/x86_64-pokysdk-linux/usr/sbin:/srv/pokybuild/yocto-worker/pkgman-non-rpm/build/build/tmp/work/qemuarm64-poky-linux/core-image-minimal/1.0/testimage-sdk/sysroots/x86_64-pokysdk-linux/bin:/srv/pokybuild/yocto-worker/pkgman-non-rpm/build/build/tmp/work/qemuarm64-poky-linux/core-image-minimal/1.0/testimage-sdk/sysroots/x86_64-pokysdk-linux/sbin:/srv/pokybuild/yocto-worker/pkgman-non-rpm/build/build/tmp/work/qemuarm64-poky-linux/core-image-minimal/1.0/testimage-sdk/sysroots/x86_64-pokysdk-linux/usr/bin/../x86_64-pokysdk-linux/bin:/srv/pokybuild/yocto-worker/pkgman-non-rpm/build/build/tmp/work/qemuarm64-poky-linux/core-image-minimal/1.0/testimage-sdk/sysroots/x86_64-pokysdk-linux/usr/bin/aarch64-poky-linux:/srv/pokybuild/yocto-worker/pkgman-non-rpm/build/build/tmp/work/qemuarm64-poky-linux/core-image-minimal/1.0/testimage-sdk/sysroots/x86_64-pokysdk-linux/usr/bin/aarch64-poky-linux-musl:/srv/pokybuild/yocto-worker/pkgman-non-rpm/build/layers/openembedded-core/scripts:/srv/pokybuild/yocto-worker/pkgman-non-rpm/build/layers/bitbake/bin:/srv/pokybuild/buildbot-venv/bin:/srv/pokybuild/bin:/usr/local/bin:/usr/bin:/bin:/usr/local/sbin:/usr/sbin)

GoHostCompileTest class: go command not available: Command '. /srv/pokybuild/yocto-worker/pkgman-non-rpm/build/build/tmp/work/qemuarm64-poky-linux/core-image-minimal/1.0/testimage-sdk/environment-setup-cortexa57-poky-linux > /dev/null; which go;' returned non-zero exit status 1.
Standard Output: which: no go in (/srv/pokybuild/yocto-worker/pkgman-non-rpm/build/build/tmp/work/qemuarm64-poky-linux/core-image-minimal/1.0/testimage-sdk/sysroots/x86_64-pokysdk-linux/usr/bin:/srv/pokybuild/yocto-worker/pkgman-non-rpm/build/build/tmp/work/qemuarm64-poky-linux/core-image-minimal/1.0/testimage-sdk/sysroots/x86_64-pokysdk-linux/usr/sbin:/srv/pokybuild/yocto-worker/pkgman-non-rpm/build/build/tmp/work/qemuarm64-poky-linux/core-image-minimal/1.0/testimage-sdk/sysroots/x86_64-pokysdk-linux/bin:/srv/pokybuild/yocto-worker/pkgman-non-rpm/build/build/tmp/work/qemuarm64-poky-linux/core-image-minimal/1.0/testimage-sdk/sysroots/x86_64-pokysdk-linux/sbin:/srv/pokybuild/yocto-worker/pkgman-non-rpm/build/build/tmp/work/qemuarm64-poky-linux/core-image-minimal/1.0/testimage-sdk/sysroots/x86_64-pokysdk-linux/usr/bin/../x86_64-pokysdk-linux/bin:/srv/pokybuild/yocto-worker/pkgman-non-rpm/build/build/tmp/work/qemuarm64-poky-linux/core-image-minimal/1.0/testimage-sdk/sysroots/x86_64-pokysdk-linux/usr/bin/aarch64-poky-linux:/srv/pokybuild/yocto-worker/pkgman-non-rpm/build/build/tmp/work/qemuarm64-poky-linux/core-image-minimal/1.0/testimage-sdk/sysroots/x86_64-pokysdk-linux/usr/bin/aarch64-poky-linux-musl:/srv/pokybuild/yocto-worker/pkgman-non-rpm/build/layers/openembedded-core/scripts:/srv/pokybuild/yocto-worker/pkgman-non-rpm/build/layers/bitbake/bin:/srv/pokybuild/buildbot-venv/bin:/srv/pokybuild/bin:/usr/local/bin:/usr/bin:/bin:/usr/local/sbin:/usr/sbin)

GoHostCompileTest class: go command not available: Command '. /srv/pokybuild/yocto-worker/pkgman-non-rpm/build/build/tmp/work/qemuarm64-poky-linux/core-image-minimal/1.0/testimage-sdk/environment-setup-cortexa57-poky-linux > /dev/null; which go;' returned non-zero exit status 1.
Standard Output: which: no go in (/srv/pokybuild/yocto-worker/pkgman-non-rpm/build/build/tmp/work/qemuarm64-poky-linux/core-image-minimal/1.0/testimage-sdk/sysroots/x86_64-pokysdk-linux/usr/bin:/srv/pokybuild/yocto-worker/pkgman-non-rpm/build/build/tmp/work/qemuarm64-poky-linux/core-image-minimal/1.0/testimage-sdk/sysroots/x86_64-pokysdk-linux/usr/sbin:/srv/pokybuild/yocto-worker/pkgman-non-rpm/build/build/tmp/work/qemuarm64-poky-linux/core-image-minimal/1.0/testimage-sdk/sysroots/x86_64-pokysdk-linux/bin:/srv/pokybuild/yocto-worker/pkgman-non-rpm/build/build/tmp/work/qemuarm64-poky-linux/core-image-minimal/1.0/testimage-sdk/sysroots/x86_64-pokysdk-linux/sbin:/srv/pokybuild/yocto-worker/pkgman-non-rpm/build/build/tmp/work/qemuarm64-poky-linux/core-image-minimal/1.0/testimage-sdk/sysroots/x86_64-pokysdk-linux/usr/bin/../x86_64-pokysdk-linux/bin:/srv/pokybuild/yocto-worker/pkgman-non-rpm/build/build/tmp/work/qemuarm64-poky-linux/core-image-minimal/1.0/testimage-sdk/sysroots/x86_64-pokysdk-linux/usr/bin/aarch64-poky-linux:/srv/pokybuild/yocto-worker/pkgman-non-rpm/build/build/tmp/work/qemuarm64-poky-linux/core-image-minimal/1.0/testimage-sdk/sysroots/x86_64-pokysdk-linux/usr/bin/aarch64-poky-linux-musl:/srv/pokybuild/yocto-worker/pkgman-non-rpm/build/layers/openembedded-core/scripts:/srv/pokybuild/yocto-worker/pkgman-non-rpm/build/layers/bitbake/bin:/srv/pokybuild/buildbot-venv/bin:/srv/pokybuild/bin:/usr/local/bin:/usr/bin:/bin:/usr/local/sbin:/usr/sbin)

Test gtk3.GTK3Test.test_libhandy needs one of gtk+3, libgtk-3.0
Test kmod.KernelModuleTest.test_cryptodev needs one of kernel-devsrc
Test maturin.MaturinDevelopTest.test_maturin_develop needs one of python3-maturin
Test maturin.MaturinTest.test_maturin_list_python needs one of python3-maturin
RESULTS:
RESULTS - autotools.AutotoolsTest.test_cpio: PASSED (24.96s)
RESULTS - cmake.CMakeTest.test_assimp: PASSED (69.49s)
RESULTS - gcc.GccCompileTest.test_gcc_compile: PASSED (0.08s)
RESULTS - gcc.GccCompileTest.test_gpp2_compile: PASSED (0.08s)
RESULTS - gcc.GccCompileTest.test_gpp_compile: PASSED (0.21s)
RESULTS - gcc.GccCompileTest.test_make: PASSED (0.09s)
RESULTS - makefile.MakefileTest.test_lzip: PASSED (1.27s)
RESULTS - manifest.ManifestTest.test_manifests: PASSED (0.00s)
RESULTS - meson.MesonTest.test_epoxy: PASSED (12.79s)
RESULTS - perl.PerlTest.test_perl: PASSED (0.01s)
RESULTS - python.Python3Test.test_python3: PASSED (0.02s)
RESULTS - rust.RustCompileTest.test_cargo_build: PASSED (11.52s)
RESULTS - rust.RustHostCompileTest.test_cargo_build: PASSED (12.51s)
RESULTS - go.GoCompileTest.test_go_build: SKIPPED (0.01s)
RESULTS - go.GoCompileTest.test_go_module: SKIPPED (0.01s)
RESULTS - go.GoHostCompileTest.test_go_cross_compile: SKIPPED (0.01s)
RESULTS - go.GoHostCompileTest.test_go_module_cross_compile: SKIPPED (0.01s)
RESULTS - gtk3.GTK3Test.test_libhandy: SKIPPED (0.00s)
RESULTS - kmod.KernelModuleTest.test_cryptodev: SKIPPED (0.00s)
RESULTS - maturin.MaturinDevelopTest.test_maturin_develop: SKIPPED (0.00s)
RESULTS - maturin.MaturinTest.test_maturin_list_python: SKIPPED (0.00s)
SUMMARY:
core-image-minimal sdk (poky-glibc-x86_64-core-image-minimal-cortexa57-qemuarm64-toolchain-5.2.99+snapshot.sh:environment-setup-cortexa57-poky-linux) - Ran 21 tests in 133.101s
core-image-minimal sdk - OK - All required tests passed (successes=13, skipped=8, failures=0, errors=0)
NOTE: recipe core-image-minimal-1.0-r0: task do_testsdk: Succeeded
Test requires gtk+3 to be installed
Test requires dnf to be installed
Test case dnf.DnfBasicTest.test_dnf_history depends on dnf.DnfBasicTest.test_dnf_help but it didn't pass/run.
Test case dnf.DnfBasicTest.test_dnf_info depends on dnf.DnfBasicTest.test_dnf_help but it didn't pass/run.
Test case dnf.DnfBasicTest.test_dnf_search depends on dnf.DnfBasicTest.test_dnf_help but it didn't pass/run.
Test case dnf.DnfBasicTest.test_dnf_version depends on dnf.DnfBasicTest.test_dnf_help but it didn't pass/run.
Test case dnf.DnfRepoTest.test_dnf_makecache depends on dnf.DnfBasicTest.test_dnf_help but it didn't pass/run.
Test case dnf.DnfRepoTest.test_dnf_exclude depends on dnf.DnfRepoTest.test_dnf_makecache but it didn't pass/run.
Test case dnf.DnfRepoTest.test_dnf_install depends on dnf.DnfRepoTest.test_dnf_makecache but it didn't pass/run.
Test case dnf.DnfRepoTest.test_dnf_install_dependency depends on dnf.DnfRepoTest.test_dnf_install but it didn't pass/run.
Test case dnf.DnfRepoTest.test_dnf_install_from_disk depends on dnf.DnfRepoTest.test_dnf_install_dependency but it didn't pass/run.
Test case dnf.DnfRepoTest.test_dnf_install_from_http depends on dnf.DnfRepoTest.test_dnf_install_from_disk but it didn't pass/run.
Test case dnf.DnfRepoTest.test_dnf_installroot depends on dnf.DnfRepoTest.test_dnf_makecache but it didn't pass/run.
Test run when enable usrmerge
Test case dnf.DnfRepoTest.test_dnf_reinstall depends on dnf.DnfRepoTest.test_dnf_install but it didn't pass/run.
Test case dnf.DnfRepoTest.test_dnf_repoinfo depends on dnf.DnfRepoTest.test_dnf_makecache but it didn't pass/run.
Test requires pam to be in DISTRO_FEATURES
Test requires ptest-runner to be installed
Test requires ptest-runner to be installed
Test requires rpm to be installed
Test case rpm.RpmBasicTest.test_rpm_query depends on rpm.RpmBasicTest.test_rpm_help but it didn't pass/run.
Test case rpm.RpmBasicTest.test_rpm_query_nonroot depends on rpm.RpmBasicTest.test_rpm_query but it didn't pass/run.
Test case rpm.RpmInstallRemoveTest.test_rpm_install depends on rpm.RpmBasicTest.test_rpm_query but it didn't pass/run.
Test case rpm.RpmInstallRemoveTest.test_rpm_remove depends on rpm.RpmInstallRemoveTest.test_rpm_install but it didn't pass/run.
Test case rpm.RpmInstallRemoveTest.test_check_rpm_install_removal_log_file_size depends on rpm.RpmInstallRemoveTest.test_rpm_remove but it didn't pass/run.
Test requires rust-c-lib-example-bin to be installed
Bitbake still alive (no events for 600s). Active tasks:
/srv/pokybuild/yocto-worker/pkgman-non-rpm/build/layers/openembedded-core/meta/recipes-sato/images/core-image-sato-sdk.bb:do_testimage
Traceback (most recent call last):
  File "/srv/pokybuild/yocto-worker/pkgman-non-rpm/build/layers/openembedded-core/meta/lib/oeqa/runtime/cases/stap.py", line 29, in test_stap
    status, output = self.target.run(cmd, 900)
                     ~~~~~~~~~~~~~~~^^^^^^^^^^
  File "/srv/pokybuild/yocto-worker/pkgman-non-rpm/build/layers/openembedded-core/meta/lib/oeqa/core/target/ssh.py", line 98, in run
    status, output = self._run(sshCmd, processTimeout, ignore_status, raw, ignore_ssh_fails)
                     ~~~~~~~~~^^^^^^^^^^^^^^^^^^^^^^^^^^^^^^^^^^^^^^^^^^^^^^^^^^^^^^^^^^^^^^
  File "/srv/pokybuild/yocto-worker/pkgman-non-rpm/build/layers/openembedded-core/meta/lib/oeqa/core/target/ssh.py", line 70, in _run
    raise AssertionError("ssh exited with status '255' for command "
                         "'%s': this is likely an SSH failure\n%s"
                         % (command, output))
AssertionError: ssh exited with status '255' for command '['ssh', '-l', 'root', '-o', 'ServerAliveCountMax=2', '-o', 'ServerAliveInterval=30', '-o', 'UserKnownHostsFile=/dev/null', '-o', 'StrictHostKeyChecking=no', '-o', 'LogLevel=ERROR', '192.168.7.6', 'export PATH=/usr/sbin:/sbin:/usr/bin:/bin; stap -v -p4 -m stap_hello --disable-cache -DSTP_NO_VERREL_CHECK -e \'probe oneshot { print("Hello, "); println("SystemTap!") }\'']': this is likely an SSH failure
Pass 1: parsed user script and 466 library scripts using 324644virt/100548res/6624shr/126432data kb, in 2810usr/1640sys/1721real ms.
Pass 2: analyzed script: 1 probe, 1 function, 0 embeds, 0 globals using 326096virt/102484res/7100shr/127884data kb, in 90usr/10sys/111real ms.
Pass 3: translated to C into "/tmp/stapP0b846/stap_hello_src.c" using 326096virt/102884res/7472shr/127884data kb, in 20usr/0sys/21real ms.

Process killed - no output for 900 seconds. Total running time: 908 seconds.

During handling of the above exception, another exception occurred:

Traceback (most recent call last):
  File "/srv/pokybuild/yocto-worker/pkgman-non-rpm/build/layers/openembedded-core/meta/lib/oeqa/core/decorator/__init__.py", line 35, in wrapped_f
    return func(*args, **kwargs)
  File "/srv/pokybuild/yocto-worker/pkgman-non-rpm/build/layers/openembedded-core/meta/lib/oeqa/core/decorator/__init__.py", line 35, in wrapped_f
    return func(*args, **kwargs)
  File "/srv/pokybuild/yocto-worker/pkgman-non-rpm/build/layers/openembedded-core/meta/lib/oeqa/core/decorator/__init__.py", line 35, in wrapped_f
    return func(*args, **kwargs)
  [Previous line repeated 1 more time]
  File "/srv/pokybuild/yocto-worker/pkgman-non-rpm/build/layers/openembedded-core/meta/lib/oeqa/runtime/cases/stap.py", line 37, in test_stap
    status, dmesg = self.target.run('dmesg')
                    ~~~~~~~~~~~~~~~^^^^^^^^^
  File "/srv/pokybuild/yocto-worker/pkgman-non-rpm/build/layers/openembedded-core/meta/lib/oeqa/core/target/ssh.py", line 98, in run
    status, output = self._run(sshCmd, processTimeout, ignore_status, raw, ignore_ssh_fails)
                     ~~~~~~~~~^^^^^^^^^^^^^^^^^^^^^^^^^^^^^^^^^^^^^^^^^^^^^^^^^^^^^^^^^^^^^^
  File "/srv/pokybuild/yocto-worker/pkgman-non-rpm/build/layers/openembedded-core/meta/lib/oeqa/core/target/ssh.py", line 70, in _run
    raise AssertionError("ssh exited with status '255' for command "
                         "'%s': this is likely an SSH failure\n%s"
                         % (command, output))
AssertionError: ssh exited with status '255' for command '['ssh', '-l', 'root', '-o', 'ServerAliveCountMax=2', '-o', 'ServerAliveInterval=30', '-o', 'UserKnownHostsFile=/dev/null', '-o', 'StrictHostKeyChecking=no', '-o', 'LogLevel=ERROR', '192.168.7.6', 'export PATH=/usr/sbin:/sbin:/usr/bin:/bin; dmesg']': this is likely an SSH failure


systemd is not the init manager for this image
Test case systemd.SystemdBasicTests.test_systemd_failed depends on systemd.SystemdBasicTests.test_systemd_basic but it didn't pass/run.
Test case systemd.SystemdBasicTests.test_systemd_list depends on systemd.SystemdBasicTests.test_systemd_basic but it didn't pass/run.
Test case systemd.SystemdJournalTests.test_systemd_boot_time depends on systemd.SystemdBasicTests.test_systemd_basic but it didn't pass/run.
Test case systemd.SystemdJournalTests.test_systemd_journal depends on systemd.SystemdBasicTests.test_systemd_basic but it didn't pass/run.
Test requires minidebuginfo to be in DISTRO_FEATURES
Test case systemd.SystemdServiceTests.test_systemd_status depends on systemd.SystemdBasicTests.test_systemd_basic but it didn't pass/run.
Test case systemd.SystemdServiceTests.test_systemd_disable_enable depends on systemd.SystemdServiceTests.test_systemd_status but it didn't pass/run.
Test is only meant to run with read-only-rootfs in IMAGE_FEATURES
Test case systemd.SystemdServiceTests.test_systemd_stop_start depends on systemd.SystemdServiceTests.test_systemd_status but it didn't pass/run.
Test requires wayland-utils to be installed
Test requires weston to be installed
Test requires weston to be installed
Test requires weston to be installed
Output from runqemu:
runqemu - INFO - Received signal: 15
runqemu - INFO - Cleaning up
runqemu - INFO - Host uptime: 260228.90

runqemu - INFO - Removing /srv/pokybuild/yocto-worker/pkgman-non-rpm/build/build/tmp/deploy/images/qemuarm64/core-image-sato-sdk-qemuarm64.rootfs-20251016053408.ext4
runqemu - INFO - Removing /home/pokybuild/tmp/core-image-sato-sdk-qemuarm64.rootfs-20251016053408.ext4.3846083
tput: No value for $TERM and no -T specified

RESULTS:
RESULTS - buildcpio.BuildCpioTest.test_cpio: PASSED (356.26s)
RESULTS - buildlzip.BuildLzipTest.test_lzip: PASSED (81.57s)
RESULTS - connman.ConnmanTest.test_connmand_help: PASSED (0.71s)
RESULTS - connman.ConnmanTest.test_connmand_running: PASSED (0.78s)
RESULTS - date.DateTest.test_date: PASSED (2.78s)
RESULTS - df.DfTest.test_df: PASSED (0.73s)
RESULTS - gcc.GccCompileTest.test_gcc_compile: PASSED (3.50s)
RESULTS - gcc.GccCompileTest.test_gpp2_compile: PASSED (3.43s)
RESULTS - gcc.GccCompileTest.test_gpp_compile: PASSED (5.25s)
RESULTS - gcc.GccCompileTest.test_make: PASSED (2.61s)
RESULTS - gi.GObjectIntrospectionTest.test_python: PASSED (1.91s)
RESULTS - go.GoCompileTest.test_go_compile: PASSED (44.96s)
RESULTS - go.GoCompileTest.test_go_module: PASSED (6.52s)
RESULTS - go.GoHelloworldTest.test_gohelloworld: PASSED (1.24s)
RESULTS - kernelmodule.KernelModuleTest.test_kernel_module: PASSED (199.95s)
RESULTS - ldd.LddTest.test_ldd: PASSED (2.23s)
RESULTS - logrotate.LogrotateTest.test_logrotate_newlog: PASSED (5.44s)
RESULTS - logrotate.LogrotateTest.test_logrotate_wtmp: PASSED (3.47s)
RESULTS - oe_syslog.SyslogTest.test_syslog_running: PASSED (0.75s)
RESULTS - oe_syslog.SyslogTestConfig.test_syslog_logger: PASSED (2.22s)
RESULTS - oe_syslog.SyslogTestConfig.test_syslog_restart: PASSED (6.29s)
RESULTS - oe_syslog.SyslogTestConfig.test_syslog_startup_config: PASSED (14.73s)
RESULTS - opkg.OpkgRepoTest.test_opkg_install_from_repo: PASSED (12.50s)
RESULTS - parselogs.ParseLogsTest.test_get_context: PASSED (0.00s)
RESULTS - parselogs.ParseLogsTest.test_parselogs: PASSED (4.27s)
RESULTS - perl.PerlTest.test_perl_works: PASSED (0.71s)
RESULTS - ping.PingTest.test_ping: PASSED (0.02s)
RESULTS - python.PythonTest.test_python3: PASSED (0.84s)
RESULTS - rust.RustCompileTest.test_cargo_compile: PASSED (10.67s)
RESULTS - rust.RustCompileTest.test_rust_compile: PASSED (4.69s)
RESULTS - scp.ScpTest.test_scp_file: PASSED (2.70s)
RESULTS - ssh.SSHTest.test_ssh: PASSED (0.86s)
RESULTS - xorg.XorgTest.test_xorg_running: PASSED (62.68s)
RESULTS - apt.AptRepoTest.test_apt_install_from_repo: SKIPPED (0.00s)
RESULTS - buildgalculator.GalculatorTest.test_galculator: SKIPPED (0.00s)
RESULTS - dnf.DnfBasicTest.test_dnf_help: SKIPPED (0.00s)
RESULTS - dnf.DnfBasicTest.test_dnf_history: SKIPPED (0.00s)
RESULTS - dnf.DnfBasicTest.test_dnf_info: SKIPPED (0.00s)
RESULTS - dnf.DnfBasicTest.test_dnf_search: SKIPPED (0.00s)
RESULTS - dnf.DnfBasicTest.test_dnf_version: SKIPPED (0.00s)
RESULTS - dnf.DnfRepoTest.test_dnf_exclude: SKIPPED (0.00s)
RESULTS - dnf.DnfRepoTest.test_dnf_install: SKIPPED (0.00s)
RESULTS - dnf.DnfRepoTest.test_dnf_install_dependency: SKIPPED (0.00s)
RESULTS - dnf.DnfRepoTest.test_dnf_install_from_disk: SKIPPED (0.00s)
RESULTS - dnf.DnfRepoTest.test_dnf_install_from_http: SKIPPED (0.00s)
RESULTS - dnf.DnfRepoTest.test_dnf_installroot: SKIPPED (0.00s)
RESULTS - dnf.DnfRepoTest.test_dnf_installroot_usrmerge: SKIPPED (0.00s)
RESULTS - dnf.DnfRepoTest.test_dnf_makecache: SKIPPED (0.00s)
RESULTS - dnf.DnfRepoTest.test_dnf_reinstall: SKIPPED (0.00s)
RESULTS - dnf.DnfRepoTest.test_dnf_repoinfo: SKIPPED (0.00s)
RESULTS - pam.PamBasicTest.test_pam: SKIPPED (0.00s)
RESULTS - ptest.PtestRunnerTest.test_ptestrunner_expectfail: SKIPPED (0.00s)
RESULTS - ptest.PtestRunnerTest.test_ptestrunner_expectsuccess: SKIPPED (0.00s)
RESULTS - rpm.RpmBasicTest.test_rpm_help: SKIPPED (0.00s)
RESULTS - rpm.RpmBasicTest.test_rpm_query: SKIPPED (0.00s)
RESULTS - rpm.RpmBasicTest.test_rpm_query_nonroot: SKIPPED (0.00s)
RESULTS - rpm.RpmInstallRemoveTest.test_check_rpm_install_removal_log_file_size: SKIPPED (0.00s)
RESULTS - rpm.RpmInstallRemoveTest.test_rpm_install: SKIPPED (0.00s)
RESULTS - rpm.RpmInstallRemoveTest.test_rpm_remove: SKIPPED (0.00s)
RESULTS - rust.RustCLibExampleTest.test_rust_c_lib_example: SKIPPED (0.00s)
RESULTS - systemd.SystemdBasicTests.test_systemd_basic: SKIPPED (0.00s)
RESULTS - systemd.SystemdBasicTests.test_systemd_failed: SKIPPED (0.00s)
RESULTS - systemd.SystemdBasicTests.test_systemd_list: SKIPPED (0.00s)
RESULTS - systemd.SystemdJournalTests.test_systemd_boot_time: SKIPPED (0.00s)
RESULTS - systemd.SystemdJournalTests.test_systemd_journal: SKIPPED (0.00s)
RESULTS - systemd.SystemdServiceTests.test_systemd_coredump_minidebuginfo: SKIPPED (0.00s)
RESULTS - systemd.SystemdServiceTests.test_systemd_disable_enable: SKIPPED (0.00s)
RESULTS - systemd.SystemdServiceTests.test_systemd_disable_enable_ro: SKIPPED (0.00s)
RESULTS - systemd.SystemdServiceTests.test_systemd_status: SKIPPED (0.00s)
RESULTS - systemd.SystemdServiceTests.test_systemd_stop_start: SKIPPED (0.00s)
RESULTS - weston.WestonTest.test_wayland_info: SKIPPED (0.00s)
RESULTS - weston.WestonTest.test_weston_can_initialize_new_wayland_compositor: SKIPPED (0.00s)
RESULTS - weston.WestonTest.test_weston_running: SKIPPED (0.00s)
RESULTS - weston.WestonTest.test_weston_supports_xwayland: SKIPPED (0.00s)
RESULTS - stap.StapTest.test_stap: FAILED (1135.75s)
SUMMARY:
core-image-sato-sdk () - Ran 75 tests in 1983.915s
core-image-sato-sdk - FAIL - Required tests failed (successes=33, skipped=41, failures=1, errors=0)
ERROR: core-image-sato-sdk-1.0-r0 do_testimage: core-image-sato-sdk - FAILED - also check the logs in /srv/pokybuild/yocto-worker/pkgman-non-rpm/build/build/tmp/log
NOTE: recipe core-image-sato-sdk-1.0-r0: task do_testimage: Succeeded
NOTE: Tasks Summary: Attempted 1319 tasks of which 1314 didn't need to be rerun and all succeeded.

Summary: There was 1 ERROR message, returning a non-zero exit code.

Error details

Submitted on:
16/10/25 01:47
Error type:
Core
Command:
bitbake core-image-minimal:do_testimage core-image-sato:do_testimage core-image-sato-sdk:do_testimage core-image-minimal:do_testsdk -k
Machine:
qemuarm64
Distro:
poky
Build system:
unknown
Target system:
unknown
Host distro:
unknown
Branch:
mathieu/master-next
Commit:
unknown
Build:
#218765
Submitter:
yp-ab-fedora41-vk-1.yocto.io
Link back:
https://autobuilder.yoctoproject.org/valkyrie/#/builders/67/builds/2622
Similar errors:
0
Open a bug