Running '. ./init-build-env; OEQA_DEBUGGING_SAVED_OUTPUT=/srv/autobuilder/valkyrie.yocto.io/pub/repro-fail/ oe-selftest -r reproducible' with output to /srv/pokybuild/yocto-worker/reproducible/build/build/command-1-cmds.log in /srv/pokybuild/yocto-worker/reproducible/build/build
Poky - The Yocto Project testing distribution
2026-10-02 15:09:26,391 - oe-selftest - INFO - Adding layer libraries:
2026-10-02 15:09:26,391 - oe-selftest - INFO - /srv/pokybuild/yocto-worker/reproducible/build/layers/meta-yocto/meta-poky/lib
2026-10-02 15:09:26,391 - oe-selftest - INFO - /srv/pokybuild/yocto-worker/reproducible/build/layers/openembedded-core/meta/lib
2026-10-02 15:09:26,391 - oe-selftest - INFO - /srv/pokybuild/yocto-worker/reproducible/build/layers/meta-yocto/meta-yocto-bsp/lib
2026-10-02 15:09:26,391 - oe-selftest - INFO - /srv/pokybuild/yocto-worker/reproducible/build/layers/openembedded-core/meta-selftest/lib
2026-10-02 15:09:26,392 - oe-selftest - INFO - Checking base configuration is valid/parsable
NOTE: Reconnecting to bitbake server...
NOTE: Retrying server connection (#1)... (15:09:26.853213)
NOTE: Reconnecting to bitbake server...
NOTE: Reconnecting to bitbake server...
NOTE: Retrying server connection (#1)... (15:09:26.853213)
NOTE: Retrying server connection (#1)... (15:09:26.853213)
NOTE: Starting bitbake server...
2026-10-02 15:09:27,757 - oe-selftest - INFO - Adding: "include selftest.inc" in /srv/pokybuild/yocto-worker/reproducible/build/build-st/conf/local.conf
2026-10-02 15:09:27,757 - oe-selftest - INFO - Adding: "include bblayers.inc" in bblayers.conf
2026-10-02 15:09:27,757 - oe-selftest - INFO - test_diffoscope (reproducible.DiffoscopeTests.test_diffoscope)
2026-10-02 15:09:51,208 - oe-selftest - INFO - ... ok
2026-10-02 15:09:51,208 - oe-selftest - INFO - test_reproducible_builds (reproducible.ReproducibleTests.test_reproducible_builds)
2026-10-02 15:10:17,041 - oe-selftest - INFO - Non-reproducible packages will be copied to /srv/autobuilder/valkyrie.yocto.io/pub/repro-fail/oe-reproducible-20261002-5junl8s_
2026-10-02 15:10:20,957 - oe-selftest - INFO - Building reproducibleA (sstate allowed)...
2026-10-02 16:00:20,869 - oe-selftest - INFO - Building reproducibleB-extended (sstate NOT allowed)...
2026-10-02 17:11:01,419 - oe-selftest - INFO - Checking deb packages for differences...
2026-10-02 17:11:03,204 - oe-selftest - INFO - Reproducibility summary for deb: same=12889 different=0 different_excluded=0 missing=0 total=12889
unused_exclusions=[]
2026-10-02 17:11:03,207 - oe-selftest - INFO - Checking ipk packages for differences...
2026-10-02 17:11:05,061 - oe-selftest - INFO - Reproducibility summary for ipk: same=12889 different=0 different_excluded=0 missing=0 total=12889
unused_exclusions=[]
2026-10-02 17:11:05,063 - oe-selftest - INFO - Checking rpm packages for differences...
2026-10-02 17:11:07,035 - oe-selftest - INFO - Reproducibility summary for rpm: same=12888 different=1 different_excluded=0 missing=0 total=12889
unused_exclusions=[]
2026-10-02 17:11:07,074 - oe-selftest - INFO - Running diffoscope
2026-10-02 17:11:11,840 - oe-selftest - INFO - ... FAIL
2026-10-02 17:11:11,845 - oe-selftest - INFO - Traceback (most recent call last):
File "/srv/pokybuild/yocto-worker/reproducible/build/layers/openembedded-core/meta/lib/oeqa/selftest/cases/reproducible.py", line 421, in test_reproducible_builds
self.fail('\n'.join(fails))
~~~~~~~~~^^^^^^^^^^^^^^^^^^
AssertionError: The following rpm packages are different and not in exclusion list:
/srv/pokybuild/yocto-worker/reproducible/build/build-st/reproducibleB-extended/tmp/deploy/rpm/./x86_64_v3/gtk4-src-4.24.0-r0.x86_64_v3.rpm
2026-10-02 17:11:11,845 - oe-selftest - INFO - ======================================================================
2026-10-02 17:11:11,846 - oe-selftest - INFO - FAIL: test_reproducible_builds (reproducible.ReproducibleTests.test_reproducible_builds)
2026-10-02 17:11:11,846 - oe-selftest - INFO - ----------------------------------------------------------------------
2026-10-02 17:11:11,846 - oe-selftest - INFO - Traceback (most recent call last):
File "/srv/pokybuild/yocto-worker/reproducible/build/layers/openembedded-core/meta/lib/oeqa/selftest/cases/reproducible.py", line 421, in test_reproducible_builds
self.fail('\n'.join(fails))
~~~~~~~~~^^^^^^^^^^^^^^^^^^
AssertionError: The following rpm packages are different and not in exclusion list:
/srv/pokybuild/yocto-worker/reproducible/build/build-st/reproducibleB-extended/tmp/deploy/rpm/./x86_64_v3/gtk4-src-4.24.0-r0.x86_64_v3.rpm
2026-10-02 17:11:11,846 - oe-selftest - INFO - ----------------------------------------------------------------------
2026-10-02 17:11:11,846 - oe-selftest - INFO - Ran 2 tests in 7304.219s
2026-10-02 17:11:11,846 - oe-selftest - INFO - FAILED
2026-10-02 17:11:11,846 - oe-selftest - INFO - (failures=1)
2026-10-02 17:11:14,649 - oe-selftest - INFO - RESULTS:
2026-10-02 17:11:14,650 - oe-selftest - INFO - RESULTS - reproducible.DiffoscopeTests.test_diffoscope: PASSED (23.45s)
2026-10-02 17:11:14,650 - oe-selftest - INFO - RESULTS - reproducible.ReproducibleTests.test_reproducible_builds: FAILED (7280.64s)
2026-10-02 17:11:14,658 - oe-selftest - INFO - SUMMARY:
2026-10-02 17:11:14,658 - oe-selftest - INFO - oe-selftest () - Ran 2 tests in 7304.220s
2026-10-02 17:11:14,658 - oe-selftest - INFO - oe-selftest - FAIL - Required tests failed (successes=1, skipped=0, failures=1, errors=0)