DEBUG: Executing shell function do_compile
NOTE: Building/installing only 64-bit libpseudo.so for pseudo-native.
NOTE: If you need to run 32-bit executables, ensure that NO32LIBS is set to 0.
SQLite header for version 3054000 found in TOPDIR/tmp/work/x86_64-linux/pseudo-native/1.9.11+git/recipe-sysroot-native/usr.
Enabling in-memory database by default.
NOTE: make -j 16 -l 75 RPATH=-Wl,--rpath=XORIGIN/../../../sqlite3-native/usr/lib/
gcc  -c -isystemTOPDIR/tmp/work/x86_64-linux/pseudo-native/1.9.11+git/recipe-sysroot-native/usr/include -isystemTOPDIR/tmp/work/x86_64-linux/pseudo-native/1.9.11+git/recipe-sysroot-native/usr/include -O2 -pipe -pipe -std=gnu99 -Wall -W -Wextra -Wno-deprecated-declarations -fPIC -D_LARGEFILE64_SOURCE -D_ATFILE_SOURCE -isystemTOPDIR/tmp/work/x86_64-linux/pseudo-native/1.9.11+git/recipe-sysroot-native/usr/include -O2 -pipe -DPSEUDO_PREFIX='"TOPDIR/tmp/work/x86_64-linux/pseudo-native/1.9.11+git/recipe-sysroot-native/usr"' -DPSEUDO_SUFFIX='""' -DPSEUDO_BINDIR='"bin"' -DPSEUDO_LIBDIR='"lib/pseudo/lib64"' -DPSEUDO_LOCALSTATEDIR='"var/pseudo"' -DPSEUDO_VERSION='"1.99.0"' -DUSE_MEMORY_DB -DPSEUDO_FORCE_ASYNC -DPSEUDO_PASSWD_FALLBACK='NULL'   -DPSEUDO_XATTR_SUPPORT       -DPSEUDO_EPOLL -O2 -g -LTOPDIR/tmp/work/x86_64-linux/pseudo-native/1.9.11+git/recipe-sysroot-native/usr/lib -ITOPDIR/tmp/work/x86_64-linux/pseudo-native/1.9.11+git/recipe-sysroot-native/usr/include -Wl,--rpath=XORIGIN/../../../sqlite3-native/usr/lib/ pseudo_client.c
pseudo_client.c: In function ‘pseudo_client_op’:
pseudo_client.c:1824:11: error: expected ‘}’ before ‘else’
 1824 |         } else {
      |           ^~~~
pseudo_client.c:2108:1: error: invalid storage class for function ‘populate_path_segs’
 2108 | populate_path_segs(void) {
      | ^~~~~~~~~~~~~~~~~~
pseudo_client.c:2235:1: error: expected declaration or statement at end of input
 2235 | }
      | ^
pseudo_client.c:2237: warning: control reaches end of non-void function [-Wreturn-type]
pseudo_client.c: At top level:
pseudo_client.c:2169:1: warning: ‘pseudo_exec_path’ defined but not used [-Wunused-function]
 2169 | pseudo_exec_path(const char *filename, int search_path) {
      | ^~~~~~~~~~~~~~~~
make: *** [Makefile:133: pseudo_client.o] Error 1
ERROR: oe_runmake failed
WARNING: exit code 1 from a shell command.

Error details

Submitted on:
15/10/26 17:41
Error type:
Recipe
Task:
do_compile
Recipe:
pseudo-native
Recipe version:
1.9.11+git-r0
Machine:
qemuarm
Distro:
poky-tiny
Build system:
x86_64-linux
Target system:
arm-poky-linux-musleabi
Host distro:
universal/debian-13
Branch:
master-next
Commit:
65059ba36323b568186ed85eee0bddca475672d5
Build:
#253103
Submitter:
yp-ab-debian13-vk-2
Link back:
https://autobuilder.yoctoproject.org/valkyrie/#/builders/50/builds/4875
Similar errors:
59
Open a bug