DEBUG: Executing shell function do_compile
NOTE: Building/installing only 64-bit libpseudo.so for pseudo-native.
NOTE: If you need to run 32-bit executables, ensure that NO32LIBS is set to 0.
SQLite header for version 3054000 found in TOPDIR/tmp/work/x86_64-linux/pseudo-native/1.9.11+git/recipe-sysroot-native/usr.
Enabling in-memory database by default.
NOTE: make -j 16 -l 75 RPATH=-Wl,--rpath=XORIGIN/../../../sqlite3-native/usr/lib/
gcc -c -isystemTOPDIR/tmp/work/x86_64-linux/pseudo-native/1.9.11+git/recipe-sysroot-native/usr/include -isystemTOPDIR/tmp/work/x86_64-linux/pseudo-native/1.9.11+git/recipe-sysroot-native/usr/include -O2 -pipe -pipe -std=gnu99 -Wall -W -Wextra -Wno-deprecated-declarations -fPIC -D_LARGEFILE64_SOURCE -D_ATFILE_SOURCE -isystemTOPDIR/tmp/work/x86_64-linux/pseudo-native/1.9.11+git/recipe-sysroot-native/usr/include -O2 -pipe -DPSEUDO_PREFIX='"TOPDIR/tmp/work/x86_64-linux/pseudo-native/1.9.11+git/recipe-sysroot-native/usr"' -DPSEUDO_SUFFIX='""' -DPSEUDO_BINDIR='"bin"' -DPSEUDO_LIBDIR='"lib/pseudo/lib64"' -DPSEUDO_LOCALSTATEDIR='"var/pseudo"' -DPSEUDO_VERSION='"1.99.0"' -DUSE_MEMORY_DB -DPSEUDO_FORCE_ASYNC -DPSEUDO_PASSWD_FALLBACK='NULL' -DPSEUDO_XATTR_SUPPORT -DPSEUDO_EPOLL -O2 -g -LTOPDIR/tmp/work/x86_64-linux/pseudo-native/1.9.11+git/recipe-sysroot-native/usr/lib -ITOPDIR/tmp/work/x86_64-linux/pseudo-native/1.9.11+git/recipe-sysroot-native/usr/include -Wl,--rpath=XORIGIN/../../../sqlite3-native/usr/lib/ pseudo_client.c
pseudo_client.c: In function ‘pseudo_client_op’:
pseudo_client.c:1824:11: error: expected ‘}’ before ‘else’
1824 | } else {
| ^~~~
pseudo_client.c:2108:1: error: invalid storage class for function ‘populate_path_segs’
2108 | populate_path_segs(void) {
| ^~~~~~~~~~~~~~~~~~
pseudo_client.c:2235:1: error: expected declaration or statement at end of input
2235 | }
| ^
pseudo_client.c:2237: warning: control reaches end of non-void function [-Wreturn-type]
pseudo_client.c: At top level:
pseudo_client.c:2169:1: warning: ‘pseudo_exec_path’ defined but not used [-Wunused-function]
2169 | pseudo_exec_path(const char *filename, int search_path) {
| ^~~~~~~~~~~~~~~~
make: *** [Makefile:133: pseudo_client.o] Error 1
ERROR: oe_runmake failed
WARNING: TOPDIR/tmp/work/x86_64-linux/pseudo-native/1.9.11+git/temp/run.do_compile.3275105:244 exit 1 from 'exit 1'
WARNING: Backtrace (BB generated script):
#1: bbfatal_log, TOPDIR/tmp/work/x86_64-linux/pseudo-native/1.9.11+git/temp/run.do_compile.3275105, line 244
#2: die, TOPDIR/tmp/work/x86_64-linux/pseudo-native/1.9.11+git/temp/run.do_compile.3275105, line 221
#3: oe_runmake, TOPDIR/tmp/work/x86_64-linux/pseudo-native/1.9.11+git/temp/run.do_compile.3275105, line 207
#4: do_compile, TOPDIR/tmp/work/x86_64-linux/pseudo-native/1.9.11+git/temp/run.do_compile.3275105, line 164
#5: main, TOPDIR/tmp/work/x86_64-linux/pseudo-native/1.9.11+git/temp/run.do_compile.3275105, line 257