Running '. ./init-build-env; bitbake core-image-minimal:do_testimage core-image-sato:do_testimage core-image-sato-sdk:do_testimage core-image-sato:do_testsdk core-image-minimal:do_testsdkext core-image-sato:do_testsdkext -k' with output to /srv/pokybuild/yocto-worker/qemuarm/build/build/command-1-test-targets.log in /srv/pokybuild/yocto-worker/qemuarm/build/build
Poky - The Yocto Project testing distribution
NOTE: Reconnecting to bitbake server...
NOTE: Retrying server connection (#1)... (12:54:39.641230)
Loading cache...done.
Loaded 0 entries from dependency cache.
Parsing recipes...done.
Parsing of 958 .bb files complete (0 cached, 958 parsed). 1997 targets, 68 skipped, 0 masked, 0 errors.
NOTE: Resolving any missing task queue dependencies
Build Configuration:
BB_VERSION = "2.20.0"
BUILD_SYS = "x86_64-linux"
NATIVELSBSTRING = "universal"
TARGET_SYS = "arm-poky-linux-gnueabi"
MACHINE = "qemuarm"
SDKMACHINE = "x86_64"
DISTRO = "poky"
DISTRO_VERSION = "6.1.99+snapshot-afed99fe638ec1e2c0db3292cc4ae55d84aa3473"
TUNE_FEATURES = "arm vfp cortexa15 neon thumb callconvention-hard"
meta = "mathieu/master-next:afed99fe638ec1e2c0db3292cc4ae55d84aa3473"
meta-yocto-bsp
meta-poky = "contrib/mathieu/master-next:03d0c19e6eb089e9dd91c5e84ebeb2bfd2aec9e7"
Initialising tasks...NOTE: The /proc/pressure files can't be read. Continuing build without monitoring pressure
Sstate summary: Wanted 129 Local 129 Mirrors 0 Missed 0 Current 322 (100% match, 100% complete)
done.
NOTE: Executing Tasks
NOTE: Setscene tasks completed
NOTE: Running task 1547 of 1552 (/srv/pokybuild/yocto-worker/qemuarm/build/layers/openembedded-core/meta/recipes-sato/images/core-image-sato-sdk.bb:do_testimage)
NOTE: Running task 1548 of 1552 (/srv/pokybuild/yocto-worker/qemuarm/build/layers/openembedded-core/meta/recipes-sato/images/core-image-sato.bb:do_testimage)
NOTE: Running task 1549 of 1552 (/srv/pokybuild/yocto-worker/qemuarm/build/layers/openembedded-core/meta/recipes-sato/images/core-image-sato.bb:do_testsdkext)
NOTE: Running task 1550 of 1552 (/srv/pokybuild/yocto-worker/qemuarm/build/layers/openembedded-core/meta/recipes-sato/images/core-image-sato.bb:do_testsdk)
NOTE: Running task 1551 of 1552 (/srv/pokybuild/yocto-worker/qemuarm/build/layers/openembedded-core/meta/recipes-core/images/core-image-minimal.bb:do_testimage)
NOTE: Running task 1552 of 1552 (/srv/pokybuild/yocto-worker/qemuarm/build/layers/openembedded-core/meta/recipes-core/images/core-image-minimal.bb:do_testsdkext)
NOTE: recipe core-image-sato-sdk-1.0-r0: task do_testimage: Started
NOTE: recipe core-image-sato-1.0-r0: task do_testimage: Started
NOTE: recipe core-image-sato-1.0-r0: task do_testsdkext: Started
NOTE: recipe core-image-sato-1.0-r0: task do_testsdk: Started
NOTE: recipe core-image-minimal-1.0-r0: task do_testimage: Started
NOTE: recipe core-image-minimal-1.0-r0: task do_testsdkext: Started
QMP Available for connection at /srv/pokybuild/yocto-worker/qemuarm/build/build/tmp/.ahxde_e3
QMP Available for connection at /srv/pokybuild/yocto-worker/qemuarm/build/build/tmp/.q1b9oy18
QMP Available for connection at /srv/pokybuild/yocto-worker/qemuarm/build/build/tmp/.vb_idpe8
QMP connected to QEMU at 10/20/26 12:54:57 and took 0.57 seconds
QMP released QEMU at 10/20/26 12:54:57 and took 0.07 seconds from connect
QMP connected to QEMU at 10/20/26 12:54:58 and took 1.11 seconds
QMP released QEMU at 10/20/26 12:54:58 and took 0.07 seconds from connect
QMP connected to QEMU at 10/20/26 12:55:01 and took 4.57 seconds
QMP released QEMU at 10/20/26 12:55:01 and took 0.08 seconds from connect
Test requires apt to be installed
Test requires dropbear, or openssh-sshd to be installed
Test requires autoconf to be installed
Test requires gtk+3 to be installed
Test requires autoconf to be installed
Test requires connman to be installed
Test case connman.ConnmanTest.test_connmand_running depends on connman.ConnmanTest.test_connmand_help but it didn't pass/run.
Test case date.DateTest.test_date depends on ssh.SSHTest.test_ssh but it didn't pass/run.
Test case df.DfTest.test_df depends on ssh.SSHTest.test_ssh but it didn't pass/run.
Test case dnf.DnfBasicTest.test_dnf_help depends on ssh.SSHTest.test_ssh but it didn't pass/run.
Test case dnf.DnfBasicTest.test_dnf_history depends on dnf.DnfBasicTest.test_dnf_help but it didn't pass/run.
Test case dnf.DnfBasicTest.test_dnf_info depends on dnf.DnfBasicTest.test_dnf_help but it didn't pass/run.
Test case dnf.DnfBasicTest.test_dnf_search depends on dnf.DnfBasicTest.test_dnf_help but it didn't pass/run.
Test case dnf.DnfBasicTest.test_dnf_version depends on dnf.DnfBasicTest.test_dnf_help but it didn't pass/run.
Test case dnf.DnfRepoTest.test_dnf_makecache depends on dnf.DnfBasicTest.test_dnf_help but it didn't pass/run.
Test case dnf.DnfRepoTest.test_dnf_exclude depends on dnf.DnfRepoTest.test_dnf_makecache but it didn't pass/run.
Test case dnf.DnfRepoTest.test_dnf_install depends on dnf.DnfRepoTest.test_dnf_makecache but it didn't pass/run.
Test case dnf.DnfRepoTest.test_dnf_install_dependency depends on dnf.DnfRepoTest.test_dnf_install but it didn't pass/run.
Test case dnf.DnfRepoTest.test_dnf_install_from_disk depends on dnf.DnfRepoTest.test_dnf_install_dependency but it didn't pass/run.
Test case dnf.DnfRepoTest.test_dnf_install_from_http depends on dnf.DnfRepoTest.test_dnf_install_from_disk but it didn't pass/run.
Test case dnf.DnfRepoTest.test_dnf_installroot depends on dnf.DnfRepoTest.test_dnf_makecache but it didn't pass/run.
Test run when enable usrmerge
Test case dnf.DnfRepoTest.test_dnf_reinstall depends on dnf.DnfRepoTest.test_dnf_install but it didn't pass/run.
Test case dnf.DnfRepoTest.test_dnf_repoinfo depends on dnf.DnfRepoTest.test_dnf_makecache but it didn't pass/run.
Test requires gcc to be installed
Test requires g++ to be installed
Test requires g++ to be installed
Test requires make to be installed
Test requires python3-pygobject to be installed
Test requires cgo-helloworld to be installed
Test requires go-runtime-dev to be installed
Test requires go-runtime-dev to be installed
Test requires go-helloworld to be installed
Test requires gcc to be installed
Test case ldd.LddTest.test_ldd depends on ssh.SSHTest.test_ssh but it didn't pass/run.
Test requires logrotate to be installed
Test case logrotate.LogrotateTest.test_logrotate_newlog depends on logrotate.LogrotateTest.test_logrotate_wtmp but it didn't pass/run.
Test case oe_syslog.SyslogTest.test_syslog_running depends on ssh.SSHTest.test_ssh but it didn't pass/run.
Test case oe_syslog.SyslogTestConfig.test_syslog_logger depends on oe_syslog.SyslogTest.test_syslog_running but it didn't pass/run.
Test case oe_syslog.SyslogTestConfig.test_syslog_restart depends on oe_syslog.SyslogTest.test_syslog_running but it didn't pass/run.
Test case oe_syslog.SyslogTestConfig.test_syslog_startup_config depends on oe_syslog.SyslogTestConfig.test_syslog_logger but it didn't pass/run.
Test requires opkg to be installed
Test requires shadow-base to be installed
Test case parselogs.ParseLogsTest.test_parselogs depends on ssh.SSHTest.test_ssh but it didn't pass/run.
Test requires perl to be installed
Test requires ptest-runner to be installed
Test requires ptest-runner to be installed
Test requires python3-core to be installed
Test case rpm.RpmBasicTest.test_rpm_help depends on ssh.SSHTest.test_ssh but it didn't pass/run.
Test case rpm.RpmBasicTest.test_rpm_query depends on rpm.RpmBasicTest.test_rpm_help but it didn't pass/run.
Test case rpm.RpmBasicTest.test_rpm_query_nonroot depends on rpm.RpmBasicTest.test_rpm_query but it didn't pass/run.
Test case rpm.RpmInstallRemoveTest.test_rpm_install depends on rpm.RpmBasicTest.test_rpm_query but it didn't pass/run.
Test case rpm.RpmInstallRemoveTest.test_rpm_remove depends on rpm.RpmInstallRemoveTest.test_rpm_install but it didn't pass/run.
Test case rpm.RpmInstallRemoveTest.test_check_rpm_install_removal_log_file_size depends on rpm.RpmInstallRemoveTest.test_rpm_remove but it didn't pass/run.
Test requires rust-c-lib-example-bin to be installed
Test requires openssh-scp to be installed
Test requires openssh-scp to be installed
Test requires openssh-sftp-server, or openssh-scp to be installed
Test requires kernel-devsrc to be installed
Test case systemd.SystemdBasicTests.test_systemd_basic depends on ssh.SSHTest.test_ssh but it didn't pass/run.
Test case systemd.SystemdBasicTests.test_systemd_failed depends on systemd.SystemdBasicTests.test_systemd_basic but it didn't pass/run.
Test case systemd.SystemdBasicTests.test_systemd_list depends on systemd.SystemdBasicTests.test_systemd_basic but it didn't pass/run.
Test case systemd.SystemdJournalTests.test_systemd_boot_time depends on systemd.SystemdBasicTests.test_systemd_basic but it didn't pass/run.
Test case systemd.SystemdJournalTests.test_systemd_journal depends on systemd.SystemdBasicTests.test_systemd_basic but it didn't pass/run.
Test requires minidebuginfo to be in DISTRO_FEATURES
Test case systemd.SystemdServiceTests.test_systemd_status depends on systemd.SystemdBasicTests.test_systemd_basic but it didn't pass/run.
Test case systemd.SystemdServiceTests.test_systemd_disable_enable depends on systemd.SystemdServiceTests.test_systemd_status but it didn't pass/run.
Test is only meant to run with read-only-rootfs in IMAGE_FEATURES
Test case systemd.SystemdServiceTests.test_systemd_stop_start depends on systemd.SystemdServiceTests.test_systemd_status but it didn't pass/run.
Test requires wayland-utils to be installed
Test requires weston to be installed
Test requires weston to be installed
Test requires weston to be installed
Test requires xserver-nodm-init to be installed
Output from runqemu:
runqemu - INFO - Received signal: 15
runqemu - INFO - Cleaning up
runqemu - INFO - Host uptime: 62476.91
runqemu - INFO - Removing /srv/pokybuild/yocto-worker/qemuarm/build/build/tmp/deploy/images/qemuarm/core-image-minimal-qemuarm.rootfs-20261020115930.ext4
runqemu - INFO - Removing /home/pokybuild/tmp/core-image-minimal-qemuarm.rootfs-20261020115930.ext4.1031070
tput: No value for $TERM and no -T specified
RESULTS:
RESULTS - parselogs.ParseLogsTest.test_get_context: PASSED (0.00s)
RESULTS - ping.PingTest.test_ping: PASSED (0.03s)
RESULTS - apt.AptRepoTest.test_apt_install_from_repo: SKIPPED (0.00s)
RESULTS - buildcpio.BuildCpioTest.test_cpio: SKIPPED (0.00s)
RESULTS - buildgalculator.GalculatorTest.test_galculator: SKIPPED (0.00s)
RESULTS - buildlzip.BuildLzipTest.test_lzip: SKIPPED (0.00s)
RESULTS - connman.ConnmanTest.test_connmand_help: SKIPPED (0.00s)
RESULTS - connman.ConnmanTest.test_connmand_running: SKIPPED (0.00s)
RESULTS - date.DateTest.test_date: SKIPPED (0.00s)
RESULTS - df.DfTest.test_df: SKIPPED (0.00s)
RESULTS - dnf.DnfBasicTest.test_dnf_help: SKIPPED (0.00s)
RESULTS - dnf.DnfBasicTest.test_dnf_history: SKIPPED (0.00s)
RESULTS - dnf.DnfBasicTest.test_dnf_info: SKIPPED (0.00s)
RESULTS - dnf.DnfBasicTest.test_dnf_search: SKIPPED (0.00s)
RESULTS - dnf.DnfBasicTest.test_dnf_version: SKIPPED (0.00s)
RESULTS - dnf.DnfRepoTest.test_dnf_exclude: SKIPPED (0.00s)
RESULTS - dnf.DnfRepoTest.test_dnf_install: SKIPPED (0.00s)
RESULTS - dnf.DnfRepoTest.test_dnf_install_dependency: SKIPPED (0.00s)
RESULTS - dnf.DnfRepoTest.test_dnf_install_from_disk: SKIPPED (0.00s)
RESULTS - dnf.DnfRepoTest.test_dnf_install_from_http: SKIPPED (0.00s)
RESULTS - dnf.DnfRepoTest.test_dnf_installroot: SKIPPED (0.00s)
RESULTS - dnf.DnfRepoTest.test_dnf_installroot_usrmerge: SKIPPED (0.00s)
RESULTS - dnf.DnfRepoTest.test_dnf_makecache: SKIPPED (0.00s)
RESULTS - dnf.DnfRepoTest.test_dnf_reinstall: SKIPPED (0.00s)
RESULTS - dnf.DnfRepoTest.test_dnf_repoinfo: SKIPPED (0.00s)
RESULTS - gcc.GccCompileTest.test_gcc_compile: SKIPPED (0.00s)
RESULTS - gcc.GccCompileTest.test_gpp2_compile: SKIPPED (0.00s)
RESULTS - gcc.GccCompileTest.test_gpp_compile: SKIPPED (0.00s)
RESULTS - gcc.GccCompileTest.test_make: SKIPPED (0.00s)
RESULTS - gi.GObjectIntrospectionTest.test_python: SKIPPED (0.00s)
RESULTS - go.CgoHelloworldTest.test_cgohelloworld: SKIPPED (0.00s)
RESULTS - go.GoCompileTest.test_go_compile: SKIPPED (0.00s)
RESULTS - go.GoCompileTest.test_go_module: SKIPPED (0.00s)
RESULTS - go.GoHelloworldTest.test_gohelloworld: SKIPPED (0.00s)
RESULTS - kernelmodule.KernelModuleTest.test_kernel_module: SKIPPED (0.00s)
RESULTS - ldd.LddTest.test_ldd: SKIPPED (0.00s)
RESULTS - logrotate.LogrotateTest.test_logrotate_newlog: SKIPPED (0.00s)
RESULTS - logrotate.LogrotateTest.test_logrotate_wtmp: SKIPPED (0.00s)
RESULTS - oe_syslog.SyslogTest.test_syslog_running: SKIPPED (0.00s)
RESULTS - oe_syslog.SyslogTestConfig.test_syslog_logger: SKIPPED (0.00s)
RESULTS - oe_syslog.SyslogTestConfig.test_syslog_restart: SKIPPED (0.00s)
RESULTS - oe_syslog.SyslogTestConfig.test_syslog_startup_config: SKIPPED (0.00s)
RESULTS - opkg.OpkgRepoTest.test_opkg_install_from_repo: SKIPPED (0.00s)
RESULTS - pam.PamBasicTest.test_pam: SKIPPED (0.00s)
RESULTS - parselogs.ParseLogsTest.test_parselogs: SKIPPED (0.00s)
RESULTS - perl.PerlTest.test_perl_works: SKIPPED (0.00s)
RESULTS - ptest.PtestRunnerTest.test_ptestrunner_expectfail: SKIPPED (0.00s)
RESULTS - ptest.PtestRunnerTest.test_ptestrunner_expectsuccess: SKIPPED (0.00s)
RESULTS - python.PythonTest.test_python3: SKIPPED (0.00s)
RESULTS - rpm.RpmBasicTest.test_rpm_help: SKIPPED (0.00s)
RESULTS - rpm.RpmBasicTest.test_rpm_query: SKIPPED (0.00s)
RESULTS - rpm.RpmBasicTest.test_rpm_query_nonroot: SKIPPED (0.00s)
RESULTS - rpm.RpmInstallRemoveTest.test_check_rpm_install_removal_log_file_size: SKIPPED (0.00s)
RESULTS - rpm.RpmInstallRemoveTest.test_rpm_install: SKIPPED (0.00s)
RESULTS - rpm.RpmInstallRemoveTest.test_rpm_remove: SKIPPED (0.00s)
RESULTS - rust.RustCLibExampleTest.test_rust_c_lib_example: SKIPPED (0.00s)
RESULTS - rust.RustCompileTest.test_cargo_compile: SKIPPED (0.00s)
RESULTS - rust.RustCompileTest.test_rust_compile: SKIPPED (0.00s)
RESULTS - scp.ScpTest.test_scp_file: SKIPPED (0.00s)
RESULTS - ssh.SSHTest.test_ssh: SKIPPED (0.00s)
RESULTS - stap.StapTest.test_stap: SKIPPED (0.00s)
RESULTS - systemd.SystemdBasicTests.test_systemd_basic: SKIPPED (0.00s)
RESULTS - systemd.SystemdBasicTests.test_systemd_failed: SKIPPED (0.00s)
RESULTS - systemd.SystemdBasicTests.test_systemd_list: SKIPPED (0.00s)
RESULTS - systemd.SystemdJournalTests.test_systemd_boot_time: SKIPPED (0.00s)
RESULTS - systemd.SystemdJournalTests.test_systemd_journal: SKIPPED (0.00s)
RESULTS - systemd.SystemdServiceTests.test_systemd_coredump_minidebuginfo: SKIPPED (0.00s)
RESULTS - systemd.SystemdServiceTests.test_systemd_disable_enable: SKIPPED (0.00s)
RESULTS - systemd.SystemdServiceTests.test_systemd_disable_enable_ro: SKIPPED (0.00s)
RESULTS - systemd.SystemdServiceTests.test_systemd_status: SKIPPED (0.00s)
RESULTS - systemd.SystemdServiceTests.test_systemd_stop_start: SKIPPED (0.00s)
RESULTS - weston.WestonTest.test_wayland_info: SKIPPED (0.00s)
RESULTS - weston.WestonTest.test_weston_can_initialize_new_wayland_compositor: SKIPPED (0.00s)
RESULTS - weston.WestonTest.test_weston_running: SKIPPED (0.00s)
RESULTS - weston.WestonTest.test_weston_supports_xwayland: SKIPPED (0.00s)
RESULTS - xorg.XorgTest.test_xorg_running: SKIPPED (0.00s)
SUMMARY:
core-image-minimal () - Ran 76 tests in 0.289s
core-image-minimal - OK - All required tests passed (successes=2, skipped=74, failures=0, errors=0)
NOTE: recipe core-image-minimal-1.0-r0: task do_testimage: Succeeded
SDK testing environment: cortexa15t2hf-neon-poky-linux-gnueabi
Test requires apt to be installed
Test requires autoconf to be installed
Test requires gtk+3 to be installed
Test requires autoconf to be installed
Test requires apt to be installed
Extensible SDK testing environment: cortexa15t2hf-neon-poky-linux-gnueabi
Extensible SDK testing environment: cortexa15t2hf-neon-poky-linux-gnueabi
GoCompileTest class: go command not available: Command '. /srv/pokybuild/yocto-worker/qemuarm/build/build/tmp/work/qemuarm-poky-linux-gnueabi/core-image-sato/1.0/testimage-sdk/environment-setup-cortexa15t2hf-neon-poky-linux-gnueabi > /dev/null; which go;' returned non-zero exit status 1.
Standard Output: which: no go in (/srv/pokybuild/yocto-worker/qemuarm/build/build/tmp/work/qemuarm-poky-linux-gnueabi/core-image-sato/1.0/testimage-sdk/sysroots/x86_64-pokysdk-linux/usr/bin:/srv/pokybuild/yocto-worker/qemuarm/build/build/tmp/work/qemuarm-poky-linux-gnueabi/core-image-sato/1.0/testimage-sdk/sysroots/x86_64-pokysdk-linux/usr/sbin:/srv/pokybuild/yocto-worker/qemuarm/build/build/tmp/work/qemuarm-poky-linux-gnueabi/core-image-sato/1.0/testimage-sdk/sysroots/x86_64-pokysdk-linux/bin:/srv/pokybuild/yocto-worker/qemuarm/build/build/tmp/work/qemuarm-poky-linux-gnueabi/core-image-sato/1.0/testimage-sdk/sysroots/x86_64-pokysdk-linux/sbin:/srv/pokybuild/yocto-worker/qemuarm/build/build/tmp/work/qemuarm-poky-linux-gnueabi/core-image-sato/1.0/testimage-sdk/sysroots/x86_64-pokysdk-linux/usr/bin/../x86_64-pokysdk-linux/bin:/srv/pokybuild/yocto-worker/qemuarm/build/build/tmp/work/qemuarm-poky-linux-gnueabi/core-image-sato/1.0/testimage-sdk/sysroots/x86_64-pokysdk-linux/usr/bin/arm-poky-linux-gnueabi:/srv/pokybuild/yocto-worker/qemuarm/build/build/tmp/work/qemuarm-poky-linux-gnueabi/core-image-sato/1.0/testimage-sdk/sysroots/x86_64-pokysdk-linux/usr/bin/arm-poky-linux-musl:/srv/pokybuild/yocto-worker/qemuarm/build/layers/openembedded-core/scripts:/srv/pokybuild/yocto-worker/qemuarm/build/layers/bitbake/bin:/srv/pokybuild/yocto-worker/qemuarm/build/extratools/sysroots/x86_64-pokysdk-linux/usr/bin:/srv/pokybuild/yocto-worker/qemuarm/build/extratools/sysroots/x86_64-pokysdk-linux/usr/sbin:/srv/pokybuild/yocto-worker/qemuarm/build/extratools/sysroots/x86_64-pokysdk-linux/bin:/srv/pokybuild/yocto-worker/qemuarm/build/extratools/sysroots/x86_64-pokysdk-linux/sbin:/srv/pokybuild/buildbot-venv/bin:/srv/pokybuild/bin:/usr/local/bin:/usr/bin:/bin:/usr/local/sbin:/usr/sbin)
GoCompileTest class: go command not available: Command '. /srv/pokybuild/yocto-worker/qemuarm/build/build/tmp/work/qemuarm-poky-linux-gnueabi/core-image-sato/1.0/testimage-sdk/environment-setup-cortexa15t2hf-neon-poky-linux-gnueabi > /dev/null; which go;' returned non-zero exit status 1.
Standard Output: which: no go in (/srv/pokybuild/yocto-worker/qemuarm/build/build/tmp/work/qemuarm-poky-linux-gnueabi/core-image-sato/1.0/testimage-sdk/sysroots/x86_64-pokysdk-linux/usr/bin:/srv/pokybuild/yocto-worker/qemuarm/build/build/tmp/work/qemuarm-poky-linux-gnueabi/core-image-sato/1.0/testimage-sdk/sysroots/x86_64-pokysdk-linux/usr/sbin:/srv/pokybuild/yocto-worker/qemuarm/build/build/tmp/work/qemuarm-poky-linux-gnueabi/core-image-sato/1.0/testimage-sdk/sysroots/x86_64-pokysdk-linux/bin:/srv/pokybuild/yocto-worker/qemuarm/build/build/tmp/work/qemuarm-poky-linux-gnueabi/core-image-sato/1.0/testimage-sdk/sysroots/x86_64-pokysdk-linux/sbin:/srv/pokybuild/yocto-worker/qemuarm/build/build/tmp/work/qemuarm-poky-linux-gnueabi/core-image-sato/1.0/testimage-sdk/sysroots/x86_64-pokysdk-linux/usr/bin/../x86_64-pokysdk-linux/bin:/srv/pokybuild/yocto-worker/qemuarm/build/build/tmp/work/qemuarm-poky-linux-gnueabi/core-image-sato/1.0/testimage-sdk/sysroots/x86_64-pokysdk-linux/usr/bin/arm-poky-linux-gnueabi:/srv/pokybuild/yocto-worker/qemuarm/build/build/tmp/work/qemuarm-poky-linux-gnueabi/core-image-sato/1.0/testimage-sdk/sysroots/x86_64-pokysdk-linux/usr/bin/arm-poky-linux-musl:/srv/pokybuild/yocto-worker/qemuarm/build/layers/openembedded-core/scripts:/srv/pokybuild/yocto-worker/qemuarm/build/layers/bitbake/bin:/srv/pokybuild/yocto-worker/qemuarm/build/extratools/sysroots/x86_64-pokysdk-linux/usr/bin:/srv/pokybuild/yocto-worker/qemuarm/build/extratools/sysroots/x86_64-pokysdk-linux/usr/sbin:/srv/pokybuild/yocto-worker/qemuarm/build/extratools/sysroots/x86_64-pokysdk-linux/bin:/srv/pokybuild/yocto-worker/qemuarm/build/extratools/sysroots/x86_64-pokysdk-linux/sbin:/srv/pokybuild/buildbot-venv/bin:/srv/pokybuild/bin:/usr/local/bin:/usr/bin:/bin:/usr/local/sbin:/usr/sbin)
GoHostCompileTest class: go command not available: Command '. /srv/pokybuild/yocto-worker/qemuarm/build/build/tmp/work/qemuarm-poky-linux-gnueabi/core-image-sato/1.0/testimage-sdk/environment-setup-cortexa15t2hf-neon-poky-linux-gnueabi > /dev/null; which go;' returned non-zero exit status 1.
Standard Output: which: no go in (/srv/pokybuild/yocto-worker/qemuarm/build/build/tmp/work/qemuarm-poky-linux-gnueabi/core-image-sato/1.0/testimage-sdk/sysroots/x86_64-pokysdk-linux/usr/bin:/srv/pokybuild/yocto-worker/qemuarm/build/build/tmp/work/qemuarm-poky-linux-gnueabi/core-image-sato/1.0/testimage-sdk/sysroots/x86_64-pokysdk-linux/usr/sbin:/srv/pokybuild/yocto-worker/qemuarm/build/build/tmp/work/qemuarm-poky-linux-gnueabi/core-image-sato/1.0/testimage-sdk/sysroots/x86_64-pokysdk-linux/bin:/srv/pokybuild/yocto-worker/qemuarm/build/build/tmp/work/qemuarm-poky-linux-gnueabi/core-image-sato/1.0/testimage-sdk/sysroots/x86_64-pokysdk-linux/sbin:/srv/pokybuild/yocto-worker/qemuarm/build/build/tmp/work/qemuarm-poky-linux-gnueabi/core-image-sato/1.0/testimage-sdk/sysroots/x86_64-pokysdk-linux/usr/bin/../x86_64-pokysdk-linux/bin:/srv/pokybuild/yocto-worker/qemuarm/build/build/tmp/work/qemuarm-poky-linux-gnueabi/core-image-sato/1.0/testimage-sdk/sysroots/x86_64-pokysdk-linux/usr/bin/arm-poky-linux-gnueabi:/srv/pokybuild/yocto-worker/qemuarm/build/build/tmp/work/qemuarm-poky-linux-gnueabi/core-image-sato/1.0/testimage-sdk/sysroots/x86_64-pokysdk-linux/usr/bin/arm-poky-linux-musl:/srv/pokybuild/yocto-worker/qemuarm/build/layers/openembedded-core/scripts:/srv/pokybuild/yocto-worker/qemuarm/build/layers/bitbake/bin:/srv/pokybuild/yocto-worker/qemuarm/build/extratools/sysroots/x86_64-pokysdk-linux/usr/bin:/srv/pokybuild/yocto-worker/qemuarm/build/extratools/sysroots/x86_64-pokysdk-linux/usr/sbin:/srv/pokybuild/yocto-worker/qemuarm/build/extratools/sysroots/x86_64-pokysdk-linux/bin:/srv/pokybuild/yocto-worker/qemuarm/build/extratools/sysroots/x86_64-pokysdk-linux/sbin:/srv/pokybuild/buildbot-venv/bin:/srv/pokybuild/bin:/usr/local/bin:/usr/bin:/bin:/usr/local/sbin:/usr/sbin)
GoHostCompileTest class: go command not available: Command '. /srv/pokybuild/yocto-worker/qemuarm/build/build/tmp/work/qemuarm-poky-linux-gnueabi/core-image-sato/1.0/testimage-sdk/environment-setup-cortexa15t2hf-neon-poky-linux-gnueabi > /dev/null; which go;' returned non-zero exit status 1.
Standard Output: which: no go in (/srv/pokybuild/yocto-worker/qemuarm/build/build/tmp/work/qemuarm-poky-linux-gnueabi/core-image-sato/1.0/testimage-sdk/sysroots/x86_64-pokysdk-linux/usr/bin:/srv/pokybuild/yocto-worker/qemuarm/build/build/tmp/work/qemuarm-poky-linux-gnueabi/core-image-sato/1.0/testimage-sdk/sysroots/x86_64-pokysdk-linux/usr/sbin:/srv/pokybuild/yocto-worker/qemuarm/build/build/tmp/work/qemuarm-poky-linux-gnueabi/core-image-sato/1.0/testimage-sdk/sysroots/x86_64-pokysdk-linux/bin:/srv/pokybuild/yocto-worker/qemuarm/build/build/tmp/work/qemuarm-poky-linux-gnueabi/core-image-sato/1.0/testimage-sdk/sysroots/x86_64-pokysdk-linux/sbin:/srv/pokybuild/yocto-worker/qemuarm/build/build/tmp/work/qemuarm-poky-linux-gnueabi/core-image-sato/1.0/testimage-sdk/sysroots/x86_64-pokysdk-linux/usr/bin/../x86_64-pokysdk-linux/bin:/srv/pokybuild/yocto-worker/qemuarm/build/build/tmp/work/qemuarm-poky-linux-gnueabi/core-image-sato/1.0/testimage-sdk/sysroots/x86_64-pokysdk-linux/usr/bin/arm-poky-linux-gnueabi:/srv/pokybuild/yocto-worker/qemuarm/build/build/tmp/work/qemuarm-poky-linux-gnueabi/core-image-sato/1.0/testimage-sdk/sysroots/x86_64-pokysdk-linux/usr/bin/arm-poky-linux-musl:/srv/pokybuild/yocto-worker/qemuarm/build/layers/openembedded-core/scripts:/srv/pokybuild/yocto-worker/qemuarm/build/layers/bitbake/bin:/srv/pokybuild/yocto-worker/qemuarm/build/extratools/sysroots/x86_64-pokysdk-linux/usr/bin:/srv/pokybuild/yocto-worker/qemuarm/build/extratools/sysroots/x86_64-pokysdk-linux/usr/sbin:/srv/pokybuild/yocto-worker/qemuarm/build/extratools/sysroots/x86_64-pokysdk-linux/bin:/srv/pokybuild/yocto-worker/qemuarm/build/extratools/sysroots/x86_64-pokysdk-linux/sbin:/srv/pokybuild/buildbot-venv/bin:/srv/pokybuild/bin:/usr/local/bin:/usr/bin:/bin:/usr/local/sbin:/usr/sbin)
Test kmod.KernelModuleTest.test_cryptodev needs one of kernel-devsrc
Test maturin.MaturinDevelopTest.test_maturin_develop needs one of python3-maturin
Test maturin.MaturinTest.test_maturin_list_python needs one of python3-maturin
RESULTS:
RESULTS - autotools.AutotoolsTest.test_cpio: PASSED (20.13s)
RESULTS - cmake.CMakeTest.test_assimp: PASSED (71.49s)
RESULTS - gcc.GccCompileTest.test_gcc_compile: PASSED (0.07s)
RESULTS - gcc.GccCompileTest.test_gpp2_compile: PASSED (0.07s)
RESULTS - gcc.GccCompileTest.test_gpp_compile: PASSED (0.21s)
RESULTS - gcc.GccCompileTest.test_make: PASSED (0.07s)
RESULTS - gtk3.GTK3Test.test_libhandy: PASSED (4.82s)
RESULTS - makefile.MakefileTest.test_lzip: PASSED (1.44s)
RESULTS - manifest.ManifestTest.test_manifests: PASSED (0.00s)
RESULTS - meson.MesonTest.test_iputils: PASSED (2.73s)
RESULTS - perl.PerlTest.test_perl: PASSED (0.01s)
RESULTS - python.Python3Test.test_python3: PASSED (0.02s)
RESULTS - rust.RustCompileTest.test_cargo_build: PASSED (12.97s)
RESULTS - rust.RustHostCompileTest.test_cargo_build: PASSED (11.94s)
RESULTS - go.GoCompileTest.test_go_build: SKIPPED (0.00s)
RESULTS - go.GoCompileTest.test_go_module: SKIPPED (0.00s)
RESULTS - go.GoHostCompileTest.test_go_cross_compile: SKIPPED (0.00s)
RESULTS - go.GoHostCompileTest.test_go_module_cross_compile: SKIPPED (0.00s)
RESULTS - kmod.KernelModuleTest.test_cryptodev: SKIPPED (0.00s)
RESULTS - maturin.MaturinDevelopTest.test_maturin_develop: SKIPPED (0.00s)
RESULTS - maturin.MaturinTest.test_maturin_list_python: SKIPPED (0.00s)
SUMMARY:
core-image-sato sdk (poky-glibc-x86_64-core-image-sato-cortexa15t2hf-neon-qemuarm-toolchain-6.1.99+snapshot.sh:environment-setup-cortexa15t2hf-neon-poky-linux-gnueabi) - Ran 21 tests in 126.022s
core-image-sato sdk - OK - All required tests passed (successes=14, skipped=7, failures=0, errors=0)
NOTE: recipe core-image-sato-1.0-r0: task do_testsdk: Succeeded
GoCompileTest class: SDK doesn't contain a Go cross-canadian toolchain
GoCompileTest class: SDK doesn't contain a Go cross-canadian toolchain
GoHostCompileTest class: SDK doesn't contain a Go cross-canadian toolchain
GoHostCompileTest class: SDK doesn't contain a Go cross-canadian toolchain
gtk3.GTK3Test.test_libhandy does not support eSDK (https://bugzilla.yoctoproject.org/show_bug.cgi?id=15854)
kmod.KernelModuleTest.test_cryptodev does not support eSDK (https://bugzilla.yoctoproject.org/show_bug.cgi?id=15850)
GoCompileTest class: SDK doesn't contain a Go cross-canadian toolchain
GoCompileTest class: SDK doesn't contain a Go cross-canadian toolchain
GoHostCompileTest class: SDK doesn't contain a Go cross-canadian toolchain
GoHostCompileTest class: SDK doesn't contain a Go cross-canadian toolchain
gtk3.GTK3Test.test_libhandy does not support eSDK (https://bugzilla.yoctoproject.org/show_bug.cgi?id=15854)
kmod.KernelModuleTest.test_cryptodev does not support eSDK (https://bugzilla.yoctoproject.org/show_bug.cgi?id=15850)
Testing 'maturin develop' requires Rust cross-canadian in the SDK
Testing 'maturin develop' requires Rust cross-canadian in the SDK
meson.MesonTest.test_iputils does not support eSDK (https://bugzilla.yoctoproject.org/show_bug.cgi?id=15854)
meson.MesonTest.test_iputils does not support eSDK (https://bugzilla.yoctoproject.org/show_bug.cgi?id=15854)
Test run when enable usrmerge
RustCompileTest class: SDK doesn't contain a Rust cross-canadian toolchain
RustCompileTest class: SDK doesn't contain a Rust cross-canadian toolchain
RustCompileTest class: SDK doesn't contain a Rust cross-canadian toolchain
RustCompileTest class: SDK doesn't contain a Rust cross-canadian toolchain
Test requires gcc to be installed
Test requires g++ to be installed
Test requires g++ to be installed
Test requires make to be installed
Test requires python3-pygobject to be installed
Test requires cgo-helloworld to be installed
Test requires go-runtime-dev to be installed
Test requires go-runtime-dev to be installed
Test requires go-helloworld to be installed
Test requires gcc to be installed
Test requires ldd to be installed
Test requires logrotate to be installed
Test case logrotate.LogrotateTest.test_logrotate_newlog depends on logrotate.LogrotateTest.test_logrotate_wtmp but it didn't pass/run.
Test requires opkg to be installed
Test requires pam to be in DISTRO_FEATURES
Traceback (most recent call last):
File "/srv/pokybuild/yocto-worker/qemuarm/build/layers/openembedded-core/meta/lib/oeqa/core/decorator/__init__.py", line 35, in wrapped_f
return func(*args, **kwargs)
File "/srv/pokybuild/yocto-worker/qemuarm/build/layers/openembedded-core/meta/lib/oeqa/runtime/cases/parselogs.py", line 185, in test_parselogs
self.assertEqual(errcount, 0, msg=self.msg)
~~~~~~~~~~~~~~~~^^^^^^^^^^^^^^^^^^^^^^^^^^^
AssertionError: 2 != 0 : Log: /srv/pokybuild/yocto-worker/qemuarm/build/build/tmp/work/qemuarm-poky-linux-gnueabi/core-image-sato/1.0/target_logs/dmesg
-----------------------
Central error: [ 1.146227] CPU1: failed to come online
***********************
[ 0.039916] VFS: Finished mounting rootfs on nullfs
[ 0.057913] /cpus/cpu@0 missing clock-frequency property
[ 0.058214] /cpus/cpu@1 missing clock-frequency property
[ 0.058296] /cpus/cpu@2 missing clock-frequency property
[ 0.058390] /cpus/cpu@3 missing clock-frequency property
[ 0.058519] CPU0: thread -1, cpu 0, socket 0, mpidr 80000000
[ 0.072045] Setting up static identity map for 0x40200000 - 0x40200060
[ 0.075135] rcu: Hierarchical SRCU implementation.
[ 0.075167] rcu: Max phase no-delay instances is 1000.
[ 0.079848] smp: Bringing up secondary CPUs ...
[ 1.146227] CPU1: failed to come online
[ 1.156057] CPU2: thread -1, cpu 2, socket 0, mpidr 80000002
[ 1.156409] CPU2: Spectre v2: firmware did not set auxiliary control register IBE bit, system vulnerable
[ 1.161054] CPU3: thread -1, cpu 3, socket 0, mpidr 80000003
[ 1.161229] CPU3: Spectre v2: firmware did not set auxiliary control register IBE bit, system vulnerable
[ 1.161836] smp: Brought up 1 node, 3 CPUs
[ 1.161917] SMP: Total of 3 processors activated (375.00 BogoMIPS).
[ 1.161970] CPU: All CPU(s) started in SVC mode.
[ 1.170482] Memory: 491208K/524288K available (12288K kernel code, 1629K rwdata, 3204K rodata, 2048K init, 348K bss, 28992K reserved, 0K cma-reserved, 0K highmem)
[ 1.177560] devtmpfs: initialized
[ 3.762379] VFP support v0.3: implementor 41 architecture 4 part 30 variant f rev 0
***********************
Log: /srv/pokybuild/yocto-worker/qemuarm/build/build/tmp/work/qemuarm-poky-linux-gnueabi/core-image-sato/1.0/target_logs/dmesg_output.log
-----------------------
Central error: [ 1.146227] CPU1: failed to come online
***********************
[ 0.039916] VFS: Finished mounting rootfs on nullfs
[ 0.057913] /cpus/cpu@0 missing clock-frequency property
[ 0.058214] /cpus/cpu@1 missing clock-frequency property
[ 0.058296] /cpus/cpu@2 missing clock-frequency property
[ 0.058390] /cpus/cpu@3 missing clock-frequency property
[ 0.058519] CPU0: thread -1, cpu 0, socket 0, mpidr 80000000
[ 0.072045] Setting up static identity map for 0x40200000 - 0x40200060
[ 0.075135] rcu: Hierarchical SRCU implementation.
[ 0.075167] rcu: Max phase no-delay instances is 1000.
[ 0.079848] smp: Bringing up secondary CPUs ...
[ 1.146227] CPU1: failed to come online
[ 1.156057] CPU2: thread -1, cpu 2, socket 0, mpidr 80000002
[ 1.156409] CPU2: Spectre v2: firmware did not set auxiliary control register IBE bit, system vulnerable
[ 1.161054] CPU3: thread -1, cpu 3, socket 0, mpidr 80000003
[ 1.161229] CPU3: Spectre v2: firmware did not set auxiliary control register IBE bit, system vulnerable
[ 1.161836] smp: Brought up 1 node, 3 CPUs
[ 1.161917] SMP: Total of 3 processors activated (375.00 BogoMIPS).
[ 1.161970] CPU: All CPU(s) started in SVC mode.
[ 1.170482] Memory: 491208K/524288K available (12288K kernel code, 1629K rwdata, 3204K rodata, 2048K init, 348K bss, 28992K reserved, 0K cma-reserved, 0K highmem)
[ 1.177560] devtmpfs: initialized
[ 3.762379] VFP support v0.3: implementor 41 architecture 4 part 30 variant f rev 0
***********************
2 errors found in logs.
Test requires ptest-runner to be installed
Test requires ptest-runner to be installed
Test requires rust-c-lib-example-bin to be installed
Test requires openssh-scp to be installed
Test requires openssh-scp to be installed
Test requires kernel-devsrc to be installed
systemd is not the init manager for this image
Test case systemd.SystemdBasicTests.test_systemd_failed depends on systemd.SystemdBasicTests.test_systemd_basic but it didn't pass/run.
Test case systemd.SystemdBasicTests.test_systemd_list depends on systemd.SystemdBasicTests.test_systemd_basic but it didn't pass/run.
Test case systemd.SystemdJournalTests.test_systemd_boot_time depends on systemd.SystemdBasicTests.test_systemd_basic but it didn't pass/run.
Test case systemd.SystemdJournalTests.test_systemd_journal depends on systemd.SystemdBasicTests.test_systemd_basic but it didn't pass/run.
Test requires minidebuginfo to be in DISTRO_FEATURES
Test case systemd.SystemdServiceTests.test_systemd_status depends on systemd.SystemdBasicTests.test_systemd_basic but it didn't pass/run.
Test case systemd.SystemdServiceTests.test_systemd_disable_enable depends on systemd.SystemdServiceTests.test_systemd_status but it didn't pass/run.
Test is only meant to run with read-only-rootfs in IMAGE_FEATURES
Test case systemd.SystemdServiceTests.test_systemd_stop_start depends on systemd.SystemdServiceTests.test_systemd_status but it didn't pass/run.
Test requires wayland-utils to be installed
Test requires weston to be installed
Test requires weston to be installed
Test requires weston to be installed
Output from runqemu:
runqemu - INFO - Received signal: 15
runqemu - INFO - Cleaning up
runqemu - INFO - Host uptime: 62755.09
runqemu - INFO - Removing /srv/pokybuild/yocto-worker/qemuarm/build/build/tmp/deploy/images/qemuarm/core-image-sato-qemuarm.rootfs-20261020115930.ext4
runqemu - INFO - Removing /home/pokybuild/tmp/core-image-sato-qemuarm.rootfs-20261020115930.ext4.1031065
tput: No value for $TERM and no -T specified
RESULTS:
RESULTS - connman.ConnmanTest.test_connmand_help: PASSED (1.11s)
RESULTS - connman.ConnmanTest.test_connmand_running: PASSED (0.95s)
RESULTS - date.DateTest.test_date: PASSED (3.64s)
RESULTS - df.DfTest.test_df: PASSED (0.80s)
RESULTS - dnf.DnfBasicTest.test_dnf_help: PASSED (15.31s)
RESULTS - dnf.DnfBasicTest.test_dnf_history: PASSED (7.34s)
RESULTS - dnf.DnfBasicTest.test_dnf_info: PASSED (5.14s)
RESULTS - dnf.DnfBasicTest.test_dnf_search: PASSED (5.32s)
RESULTS - dnf.DnfBasicTest.test_dnf_version: PASSED (4.33s)
RESULTS - dnf.DnfRepoTest.test_dnf_exclude: PASSED (12.43s)
RESULTS - dnf.DnfRepoTest.test_dnf_install: PASSED (9.37s)
RESULTS - dnf.DnfRepoTest.test_dnf_install_dependency: PASSED (13.67s)
RESULTS - dnf.DnfRepoTest.test_dnf_install_from_disk: PASSED (15.79s)
RESULTS - dnf.DnfRepoTest.test_dnf_install_from_http: PASSED (10.22s)
RESULTS - dnf.DnfRepoTest.test_dnf_installroot: PASSED (62.61s)
RESULTS - dnf.DnfRepoTest.test_dnf_makecache: PASSED (3.59s)
RESULTS - dnf.DnfRepoTest.test_dnf_reinstall: PASSED (4.47s)
RESULTS - dnf.DnfRepoTest.test_dnf_repoinfo: PASSED (3.73s)
RESULTS - oe_syslog.SyslogTest.test_syslog_running: PASSED (0.82s)
RESULTS - oe_syslog.SyslogTestConfig.test_syslog_logger: PASSED (2.34s)
RESULTS - oe_syslog.SyslogTestConfig.test_syslog_restart: PASSED (7.41s)
RESULTS - oe_syslog.SyslogTestConfig.test_syslog_startup_config: PASSED (17.28s)
RESULTS - parselogs.ParseLogsTest.test_get_context: PASSED (0.00s)
RESULTS - perl.PerlTest.test_perl_works: PASSED (0.83s)
RESULTS - ping.PingTest.test_ping: PASSED (0.02s)
RESULTS - python.PythonTest.test_python3: PASSED (0.98s)
RESULTS - rpm.RpmBasicTest.test_rpm_help: PASSED (0.82s)
RESULTS - rpm.RpmBasicTest.test_rpm_query: PASSED (1.64s)
RESULTS - rpm.RpmBasicTest.test_rpm_query_nonroot: PASSED (5.64s)
RESULTS - rpm.RpmInstallRemoveTest.test_check_rpm_install_removal_log_file_size: PASSED (27.99s)
RESULTS - rpm.RpmInstallRemoveTest.test_rpm_install: PASSED (2.39s)
RESULTS - rpm.RpmInstallRemoveTest.test_rpm_remove: PASSED (1.15s)
RESULTS - scp.ScpTest.test_scp_file: PASSED (2.02s)
RESULTS - ssh.SSHTest.test_ssh: PASSED (0.88s)
RESULTS - xorg.XorgTest.test_xorg_running: PASSED (1.65s)
RESULTS - apt.AptRepoTest.test_apt_install_from_repo: SKIPPED (0.00s)
RESULTS - buildcpio.BuildCpioTest.test_cpio: SKIPPED (0.00s)
RESULTS - buildgalculator.GalculatorTest.test_galculator: SKIPPED (0.00s)
RESULTS - buildlzip.BuildLzipTest.test_lzip: SKIPPED (0.00s)
RESULTS - dnf.DnfRepoTest.test_dnf_installroot_usrmerge: SKIPPED (0.00s)
RESULTS - gcc.GccCompileTest.test_gcc_compile: SKIPPED (0.00s)
RESULTS - gcc.GccCompileTest.test_gpp2_compile: SKIPPED (0.00s)
RESULTS - gcc.GccCompileTest.test_gpp_compile: SKIPPED (0.00s)
RESULTS - gcc.GccCompileTest.test_make: SKIPPED (0.00s)
RESULTS - gi.GObjectIntrospectionTest.test_python: SKIPPED (0.00s)
RESULTS - go.CgoHelloworldTest.test_cgohelloworld: SKIPPED (0.00s)
RESULTS - go.GoCompileTest.test_go_compile: SKIPPED (0.00s)
RESULTS - go.GoCompileTest.test_go_module: SKIPPED (0.00s)
RESULTS - go.GoHelloworldTest.test_gohelloworld: SKIPPED (0.00s)
RESULTS - kernelmodule.KernelModuleTest.test_kernel_module: SKIPPED (0.00s)
RESULTS - ldd.LddTest.test_ldd: SKIPPED (0.00s)
RESULTS - logrotate.LogrotateTest.test_logrotate_newlog: SKIPPED (0.00s)
RESULTS - logrotate.LogrotateTest.test_logrotate_wtmp: SKIPPED (0.00s)
RESULTS - opkg.OpkgRepoTest.test_opkg_install_from_repo: SKIPPED (0.00s)
RESULTS - pam.PamBasicTest.test_pam: SKIPPED (0.00s)
RESULTS - ptest.PtestRunnerTest.test_ptestrunner_expectfail: SKIPPED (0.00s)
RESULTS - ptest.PtestRunnerTest.test_ptestrunner_expectsuccess: SKIPPED (0.00s)
RESULTS - rust.RustCLibExampleTest.test_rust_c_lib_example: SKIPPED (0.00s)
RESULTS - rust.RustCompileTest.test_cargo_compile: SKIPPED (0.00s)
RESULTS - rust.RustCompileTest.test_rust_compile: SKIPPED (0.00s)
RESULTS - stap.StapTest.test_stap: SKIPPED (0.00s)
RESULTS - systemd.SystemdBasicTests.test_systemd_basic: SKIPPED (0.00s)
RESULTS - systemd.SystemdBasicTests.test_systemd_failed: SKIPPED (0.00s)
RESULTS - systemd.SystemdBasicTests.test_systemd_list: SKIPPED (0.00s)
RESULTS - systemd.SystemdJournalTests.test_systemd_boot_time: SKIPPED (0.00s)
RESULTS - systemd.SystemdJournalTests.test_systemd_journal: SKIPPED (0.00s)
RESULTS - systemd.SystemdServiceTests.test_systemd_coredump_minidebuginfo: SKIPPED (0.00s)
RESULTS - systemd.SystemdServiceTests.test_systemd_disable_enable: SKIPPED (0.00s)
RESULTS - systemd.SystemdServiceTests.test_systemd_disable_enable_ro: SKIPPED (0.00s)
RESULTS - systemd.SystemdServiceTests.test_systemd_status: SKIPPED (0.00s)
RESULTS - systemd.SystemdServiceTests.test_systemd_stop_start: SKIPPED (0.00s)
RESULTS - weston.WestonTest.test_wayland_info: SKIPPED (0.00s)
RESULTS - weston.WestonTest.test_weston_can_initialize_new_wayland_compositor: SKIPPED (0.00s)
RESULTS - weston.WestonTest.test_weston_running: SKIPPED (0.00s)
RESULTS - weston.WestonTest.test_weston_supports_xwayland: SKIPPED (0.00s)
RESULTS - parselogs.ParseLogsTest.test_parselogs: FAILED (6.28s)
SUMMARY:
core-image-sato () - Ran 76 tests in 260.354s
core-image-sato - FAIL - Required tests failed (successes=35, skipped=40, failures=1, errors=0)
core-image-sato - FAILED - Last lines of QEMU boot logs:
--- qemu_boot_log.20261020125451 ---
> Warning: Could not resolve keysym XF86ContextualQuery
Errors from xkbcomp are not fatal to the X server
D-BUS per-session daemon address is: unix:path=/tmp/dbus-3qe7fSr1cr,guid=4e054e22f9f99a8cf3f02f666ad764b8
Using calibration data stored in /etc/pointercal.xinput
/usr/bin/start-pulseaudio-x11: line 41: /usr/bin/pactl: No such file or directory
Using calibration data stored in /etc/pointercal.xinput
matchbox: Cant find a keycode for keysym 269025056
matchbox: ignoring key shortcut XF86Calendar=!$contacts
matchbox: Cant find a keycode for keysym 2809
matchbox: ignoring key shortcut telephone=!$dates
matchbox: Cant find a keycode for keysym 269025050
matchbox: ignoring key shortcut XF86Start=!matchbox-remote -desktop
[settings daemon] Forking. run with -n to prevent fork
dbus-daemon[583]: Activating service name='org.a11y.atspi.Registry' requested by ':1.1' (uid=0 pid=564 comm="connman-applet")
matchbox-wm: X error warning (0xa00002): BadWindow (invalid Window parameter) (opcode: 12)
dbus-daemon[583]: Successfully activated service 'org.a11y.atspi.Registry'
SpiRegistry daemon is running with well-known name - org.a11y.atspi.Registry
--- qemu_boot_log.20261020125451.2 ---
Starting syslogd/klogd: done
* Starting Avahi mDNS/DNS-SD Daemon: avahi-daemon
...done.
Starting Telephony daemon
Poky (Yocto Project Reference Distro) 6.1.99+snapshot-afed99fe638ec1e2c0db3292cc4ae55d84aa3473 qemuarm /dev/ttyAMA0
Type 'root' to login with superuser privileges (no password will be asked).
qemuarm login:
ERROR: core-image-sato-1.0-r0 do_testimage: core-image-sato - FAILED - also check the logs in /srv/pokybuild/yocto-worker/qemuarm/build/build/tmp/log
NOTE: recipe core-image-sato-1.0-r0: task do_testimage: Succeeded
RESULTS:
RESULTS - autotools.AutotoolsTest.test_cpio: PASSED (22.49s)
RESULTS - cmake.CMakeTest.test_assimp: PASSED (70.10s)
RESULTS - gcc.GccCompileTest.test_gcc_compile: PASSED (0.08s)
RESULTS - gcc.GccCompileTest.test_gpp2_compile: PASSED (0.07s)
RESULTS - gcc.GccCompileTest.test_gpp_compile: PASSED (0.23s)
RESULTS - gcc.GccCompileTest.test_make: PASSED (0.09s)
RESULTS - makefile.MakefileTest.test_lzip: PASSED (1.46s)
RESULTS - manifest.ManifestTest.test_manifests: PASSED (0.00s)
RESULTS - maturin.MaturinTest.test_maturin_list_python: PASSED (3.32s)
RESULTS - perl.PerlTest.test_perl: PASSED (0.01s)
RESULTS - python.Python3Test.test_python3: PASSED (4.04s)
RESULTS - devtool.DevtoolTest.test_devtool_add_reset: PASSED (10.24s)
RESULTS - devtool.DevtoolTest.test_devtool_build_cmake: PASSED (26.37s)
RESULTS - devtool.DevtoolTest.test_devtool_build_esdk_package: PASSED (21.57s)
RESULTS - devtool.DevtoolTest.test_devtool_build_make: PASSED (25.67s)
RESULTS - devtool.DevtoolTest.test_devtool_kernelmodule: PASSED (267.22s)
RESULTS - devtool.DevtoolTest.test_devtool_location: PASSED (0.01s)
RESULTS - devtool.DevtoolTest.test_extend_autotools_recipe_creation: PASSED (71.94s)
RESULTS - devtool.DevtoolTest.test_recipes_for_nodejs: PASSED (14.34s)
RESULTS - devtool.SdkUpdateTest.test_sdk_update_http: PASSED (0.72s)
RESULTS - go.GoCompileTest.test_go_build: SKIPPED (0.00s)
RESULTS - go.GoCompileTest.test_go_module: SKIPPED (0.00s)
RESULTS - go.GoHostCompileTest.test_go_cross_compile: SKIPPED (0.00s)
RESULTS - go.GoHostCompileTest.test_go_module_cross_compile: SKIPPED (0.00s)
RESULTS - gtk3.GTK3Test.test_libhandy: SKIPPED (0.00s)
RESULTS - kmod.KernelModuleTest.test_cryptodev: SKIPPED (0.00s)
RESULTS - maturin.MaturinDevelopTest.test_maturin_develop: SKIPPED (20.14s)
RESULTS - meson.MesonTest.test_iputils: SKIPPED (0.00s)
RESULTS - rust.RustCompileTest.test_cargo_build: SKIPPED (0.00s)
RESULTS - rust.RustHostCompileTest.test_cargo_build: SKIPPED (0.00s)
SUMMARY:
core-image-minimal esdk (poky-glibc-x86_64-core-image-minimal-cortexa15t2hf-neon-qemuarm-toolchain-ext-6.1.99+snapshot.sh:environment-setup-cortexa15t2hf-neon-poky-linux-gnueabi) - Ran 30 tests in 569.916s
core-image-minimal esdk - OK - All required tests passed (successes=20, skipped=10, failures=0, errors=0)
NOTE: recipe core-image-minimal-1.0-r0: task do_testsdkext: Succeeded
RESULTS:
RESULTS - autotools.AutotoolsTest.test_cpio: PASSED (22.42s)
RESULTS - cmake.CMakeTest.test_assimp: PASSED (70.24s)
RESULTS - gcc.GccCompileTest.test_gcc_compile: PASSED (0.08s)
RESULTS - gcc.GccCompileTest.test_gpp2_compile: PASSED (0.07s)
RESULTS - gcc.GccCompileTest.test_gpp_compile: PASSED (0.23s)
RESULTS - gcc.GccCompileTest.test_make: PASSED (0.08s)
RESULTS - makefile.MakefileTest.test_lzip: PASSED (1.46s)
RESULTS - manifest.ManifestTest.test_manifests: PASSED (0.00s)
RESULTS - maturin.MaturinTest.test_maturin_list_python: PASSED (3.38s)
RESULTS - perl.PerlTest.test_perl: PASSED (0.01s)
RESULTS - python.Python3Test.test_python3: PASSED (4.06s)
RESULTS - devtool.DevtoolTest.test_devtool_add_reset: PASSED (10.26s)
RESULTS - devtool.DevtoolTest.test_devtool_build_cmake: PASSED (25.86s)
RESULTS - devtool.DevtoolTest.test_devtool_build_esdk_package: PASSED (22.44s)
RESULTS - devtool.DevtoolTest.test_devtool_build_make: PASSED (25.05s)
RESULTS - devtool.DevtoolTest.test_devtool_kernelmodule: PASSED (268.35s)
RESULTS - devtool.DevtoolTest.test_devtool_location: PASSED (0.01s)
RESULTS - devtool.DevtoolTest.test_extend_autotools_recipe_creation: PASSED (71.19s)
RESULTS - devtool.DevtoolTest.test_recipes_for_nodejs: PASSED (15.23s)
RESULTS - devtool.SdkUpdateTest.test_sdk_update_http: PASSED (0.97s)
RESULTS - go.GoCompileTest.test_go_build: SKIPPED (0.00s)
RESULTS - go.GoCompileTest.test_go_module: SKIPPED (0.00s)
RESULTS - go.GoHostCompileTest.test_go_cross_compile: SKIPPED (0.00s)
RESULTS - go.GoHostCompileTest.test_go_module_cross_compile: SKIPPED (0.00s)
RESULTS - gtk3.GTK3Test.test_libhandy: SKIPPED (0.00s)
RESULTS - kmod.KernelModuleTest.test_cryptodev: SKIPPED (0.00s)
RESULTS - maturin.MaturinDevelopTest.test_maturin_develop: SKIPPED (20.45s)
RESULTS - meson.MesonTest.test_iputils: SKIPPED (0.00s)
RESULTS - rust.RustCompileTest.test_cargo_build: SKIPPED (0.00s)
RESULTS - rust.RustHostCompileTest.test_cargo_build: SKIPPED (0.00s)
SUMMARY:
core-image-sato esdk (poky-glibc-x86_64-core-image-sato-cortexa15t2hf-neon-qemuarm-toolchain-ext-6.1.99+snapshot.sh:environment-setup-cortexa15t2hf-neon-poky-linux-gnueabi) - Ran 30 tests in 571.479s
core-image-sato esdk - OK - All required tests passed (successes=20, skipped=10, failures=0, errors=0)
NOTE: recipe core-image-sato-1.0-r0: task do_testsdkext: Succeeded
Test requires gtk+3 to be installed
Test run when enable usrmerge
Test requires opkg to be installed
Test requires pam to be in DISTRO_FEATURES
Test requires ptest-runner to be installed
Test requires ptest-runner to be installed
Test requires rust-c-lib-example-bin to be installed
systemd is not the init manager for this image
Test case systemd.SystemdBasicTests.test_systemd_failed depends on systemd.SystemdBasicTests.test_systemd_basic but it didn't pass/run.
Test case systemd.SystemdBasicTests.test_systemd_list depends on systemd.SystemdBasicTests.test_systemd_basic but it didn't pass/run.
Test case systemd.SystemdJournalTests.test_systemd_boot_time depends on systemd.SystemdBasicTests.test_systemd_basic but it didn't pass/run.
Test case systemd.SystemdJournalTests.test_systemd_journal depends on systemd.SystemdBasicTests.test_systemd_basic but it didn't pass/run.
Test requires minidebuginfo to be in DISTRO_FEATURES
Test case systemd.SystemdServiceTests.test_systemd_status depends on systemd.SystemdBasicTests.test_systemd_basic but it didn't pass/run.
Test case systemd.SystemdServiceTests.test_systemd_disable_enable depends on systemd.SystemdServiceTests.test_systemd_status but it didn't pass/run.
Test is only meant to run with read-only-rootfs in IMAGE_FEATURES
Test case systemd.SystemdServiceTests.test_systemd_stop_start depends on systemd.SystemdServiceTests.test_systemd_status but it didn't pass/run.
Test requires wayland-utils to be installed
Test requires weston to be installed
Test requires weston to be installed
Test requires weston to be installed
Output from runqemu:
runqemu - INFO - Received signal: 15
runqemu - INFO - Cleaning up
runqemu - INFO - Host uptime: 64359.47
runqemu - INFO - Removing /srv/pokybuild/yocto-worker/qemuarm/build/build/tmp/deploy/images/qemuarm/core-image-sato-sdk-qemuarm.rootfs-20261020115930.ext4
runqemu - INFO - Removing /home/pokybuild/tmp/core-image-sato-sdk-qemuarm.rootfs-20261020115930.ext4.1031066
tput: No value for $TERM and no -T specified
RESULTS:
RESULTS - buildcpio.BuildCpioTest.test_cpio: PASSED (680.86s)
RESULTS - buildlzip.BuildLzipTest.test_lzip: PASSED (129.79s)
RESULTS - connman.ConnmanTest.test_connmand_help: PASSED (0.86s)
RESULTS - connman.ConnmanTest.test_connmand_running: PASSED (0.96s)
RESULTS - date.DateTest.test_date: PASSED (3.24s)
RESULTS - df.DfTest.test_df: PASSED (0.82s)
RESULTS - dnf.DnfBasicTest.test_dnf_help: PASSED (9.89s)
RESULTS - dnf.DnfBasicTest.test_dnf_history: PASSED (5.09s)
RESULTS - dnf.DnfBasicTest.test_dnf_info: PASSED (4.69s)
RESULTS - dnf.DnfBasicTest.test_dnf_search: PASSED (4.58s)
RESULTS - dnf.DnfBasicTest.test_dnf_version: PASSED (4.50s)
RESULTS - dnf.DnfRepoTest.test_dnf_exclude: PASSED (16.67s)
RESULTS - dnf.DnfRepoTest.test_dnf_install: PASSED (13.62s)
RESULTS - dnf.DnfRepoTest.test_dnf_install_dependency: PASSED (18.36s)
RESULTS - dnf.DnfRepoTest.test_dnf_install_from_disk: PASSED (19.25s)
RESULTS - dnf.DnfRepoTest.test_dnf_install_from_http: PASSED (13.73s)
RESULTS - dnf.DnfRepoTest.test_dnf_installroot: PASSED (61.47s)
RESULTS - dnf.DnfRepoTest.test_dnf_makecache: PASSED (3.57s)
RESULTS - dnf.DnfRepoTest.test_dnf_reinstall: PASSED (6.56s)
RESULTS - dnf.DnfRepoTest.test_dnf_repoinfo: PASSED (4.64s)
RESULTS - gcc.GccCompileTest.test_gcc_compile: PASSED (5.17s)
RESULTS - gcc.GccCompileTest.test_gpp2_compile: PASSED (4.84s)
RESULTS - gcc.GccCompileTest.test_gpp_compile: PASSED (10.42s)
RESULTS - gcc.GccCompileTest.test_make: PASSED (3.92s)
RESULTS - gi.GObjectIntrospectionTest.test_python: PASSED (2.55s)
RESULTS - go.CgoHelloworldTest.test_cgohelloworld: PASSED (1.33s)
RESULTS - go.GoCompileTest.test_go_compile: PASSED (70.46s)
RESULTS - go.GoCompileTest.test_go_module: PASSED (18.99s)
RESULTS - go.GoHelloworldTest.test_gohelloworld: PASSED (3.67s)
RESULTS - kernelmodule.KernelModuleTest.test_kernel_module: PASSED (301.08s)
RESULTS - ldd.LddTest.test_ldd: PASSED (5.74s)
RESULTS - logrotate.LogrotateTest.test_logrotate_newlog: PASSED (16.41s)
RESULTS - logrotate.LogrotateTest.test_logrotate_wtmp: PASSED (9.87s)
RESULTS - oe_syslog.SyslogTest.test_syslog_running: PASSED (2.65s)
RESULTS - oe_syslog.SyslogTestConfig.test_syslog_logger: PASSED (4.16s)
RESULTS - oe_syslog.SyslogTestConfig.test_syslog_restart: PASSED (16.47s)
RESULTS - oe_syslog.SyslogTestConfig.test_syslog_startup_config: PASSED (41.96s)
RESULTS - parselogs.ParseLogsTest.test_get_context: PASSED (0.00s)
RESULTS - parselogs.ParseLogsTest.test_parselogs: PASSED (14.25s)
RESULTS - perl.PerlTest.test_perl_works: PASSED (1.30s)
RESULTS - ping.PingTest.test_ping: PASSED (0.03s)
RESULTS - python.PythonTest.test_python3: PASSED (2.36s)
RESULTS - rpm.RpmBasicTest.test_rpm_help: PASSED (1.72s)
RESULTS - rpm.RpmBasicTest.test_rpm_query: PASSED (4.62s)
RESULTS - rpm.RpmBasicTest.test_rpm_query_nonroot: PASSED (15.75s)
RESULTS - rpm.RpmInstallRemoveTest.test_check_rpm_install_removal_log_file_size: PASSED (64.77s)
RESULTS - rpm.RpmInstallRemoveTest.test_rpm_install: PASSED (5.56s)
RESULTS - rpm.RpmInstallRemoveTest.test_rpm_remove: PASSED (2.69s)
RESULTS - rust.RustCompileTest.test_cargo_compile: PASSED (13.93s)
RESULTS - rust.RustCompileTest.test_rust_compile: PASSED (11.24s)
RESULTS - scp.ScpTest.test_scp_file: PASSED (7.55s)
RESULTS - ssh.SSHTest.test_ssh: PASSED (0.99s)
RESULTS - stap.StapTest.test_stap: PASSED (194.89s)
RESULTS - xorg.XorgTest.test_xorg_running: PASSED (1.91s)
RESULTS - apt.AptRepoTest.test_apt_install_from_repo: SKIPPED (0.00s)
RESULTS - buildgalculator.GalculatorTest.test_galculator: SKIPPED (0.00s)
RESULTS - dnf.DnfRepoTest.test_dnf_installroot_usrmerge: SKIPPED (0.00s)
RESULTS - opkg.OpkgRepoTest.test_opkg_install_from_repo: SKIPPED (0.00s)
RESULTS - pam.PamBasicTest.test_pam: SKIPPED (0.00s)
RESULTS - ptest.PtestRunnerTest.test_ptestrunner_expectfail: SKIPPED (0.00s)
RESULTS - ptest.PtestRunnerTest.test_ptestrunner_expectsuccess: SKIPPED (0.00s)
RESULTS - rust.RustCLibExampleTest.test_rust_c_lib_example: SKIPPED (0.00s)
RESULTS - systemd.SystemdBasicTests.test_systemd_basic: SKIPPED (0.00s)
RESULTS - systemd.SystemdBasicTests.test_systemd_failed: SKIPPED (0.00s)
RESULTS - systemd.SystemdBasicTests.test_systemd_list: SKIPPED (0.00s)
RESULTS - systemd.SystemdJournalTests.test_systemd_boot_time: SKIPPED (0.00s)
RESULTS - systemd.SystemdJournalTests.test_systemd_journal: SKIPPED (0.00s)
RESULTS - systemd.SystemdServiceTests.test_systemd_coredump_minidebuginfo: SKIPPED (0.00s)
RESULTS - systemd.SystemdServiceTests.test_systemd_disable_enable: SKIPPED (0.00s)
RESULTS - systemd.SystemdServiceTests.test_systemd_disable_enable_ro: SKIPPED (0.00s)
RESULTS - systemd.SystemdServiceTests.test_systemd_status: SKIPPED (0.00s)
RESULTS - systemd.SystemdServiceTests.test_systemd_stop_start: SKIPPED (0.00s)
RESULTS - weston.WestonTest.test_wayland_info: SKIPPED (0.00s)
RESULTS - weston.WestonTest.test_weston_can_initialize_new_wayland_compositor: SKIPPED (0.00s)
RESULTS - weston.WestonTest.test_weston_running: SKIPPED (0.00s)
RESULTS - weston.WestonTest.test_weston_supports_xwayland: SKIPPED (0.00s)
SUMMARY:
core-image-sato-sdk () - Ran 76 tests in 1868.334s
core-image-sato-sdk - OK - All required tests passed (successes=54, skipped=22, failures=0, errors=0)
NOTE: recipe core-image-sato-sdk-1.0-r0: task do_testimage: Succeeded
NOTE: Tasks Summary: Attempted 1552 tasks of which 1546 didn't need to be rerun and all succeeded.
Summary: There was 1 ERROR message, returning a non-zero exit code.