Running '. ./init-build-env; bitbake core-image-full-cmdline:do_testimage core-image-sato:do_testimage core-image-sato-sdk:do_testimage -k' with output to /srv/pokybuild/yocto-worker/qemuarm-alt/build/build/command-1-test-targets.log in /srv/pokybuild/yocto-worker/qemuarm-alt/build/build
Poky - The Yocto Project testing distribution
NOTE: Reconnecting to bitbake server...
NOTE: Retrying server connection (#1)... (13:56:18.644545)
NOTE: Reconnecting to bitbake server...
NOTE: Previous bitbake instance shutting down?, waiting to retry... (13:56:18.645096)
NOTE: Directory listing: ['cache', 'command-1-build-targets.log', 'oe-time-dd-test.dat', 'README', 'bitbake-cookerdaemon.log', 'command-1-test-targets.log', 'command-1-write-config.log', 'init-build-env', 'conf', 'tmp']
NOTE: Retrying server connection (#2)... (13:56:18.751318)
Loading cache...done.
Loaded 0 entries from dependency cache.
Parsing recipes...done.
Parsing of 958 .bb files complete (0 cached, 958 parsed). 1998 targets, 65 skipped, 0 masked, 0 errors.
NOTE: Resolving any missing task queue dependencies

Build Configuration:
BB_VERSION           = "2.20.0"
BUILD_SYS            = "x86_64-linux"
NATIVELSBSTRING      = "universal"
TARGET_SYS           = "arm-poky-linux-gnueabi"
MACHINE              = "qemuarm"
SDKMACHINE           = "x86_64"
DISTRO               = "poky-altcfg"
DISTRO_VERSION       = "6.1.99+snapshot-7599f382b70437d89decd46834cd8ed8d8439493"
TUNE_FEATURES        = "arm vfp cortexa15 neon thumb callconvention-hard"
meta                 = "mathieu/master-next:7599f382b70437d89decd46834cd8ed8d8439493"
meta-yocto-bsp       
meta-poky            = "contrib/mathieu/master-next:03d0c19e6eb089e9dd91c5e84ebeb2bfd2aec9e7"

Initialising tasks...NOTE: The /proc/pressure files can't be read. Continuing build without monitoring pressure
Sstate summary: Wanted 179 Local 179 Mirrors 0 Missed 0 Current 269 (100% match, 100% complete)
done.
NOTE: Executing Tasks
NOTE: Running setscene task 281 of 448 (virtual:native:/srv/pokybuild/yocto-worker/qemuarm-alt/build/layers/openembedded-core/meta/recipes-devtools/apt/apt_3.0.3.bb:do_populate_sysroot_setscene)
NOTE: Running setscene task 292 of 448 (virtual:native:/srv/pokybuild/yocto-worker/qemuarm-alt/build/layers/openembedded-core/meta/recipes-devtools/createrepo-c/createrepo-c_1.2.5.bb:do_populate_sysroot_setscene)
NOTE: recipe apt-native-3.0.3-r0: task do_populate_sysroot_setscene: Started
NOTE: recipe createrepo-c-native-1.2.5-r0: task do_populate_sysroot_setscene: Started
NOTE: recipe createrepo-c-native-1.2.5-r0: task do_populate_sysroot_setscene: Succeeded
NOTE: Running setscene task 425 of 448 (virtual:native:/srv/pokybuild/yocto-worker/qemuarm-alt/build/layers/openembedded-core/meta/recipes-devtools/createrepo-c/createrepo-c_1.2.5.bb:do_recipe_qa_setscene)
NOTE: recipe apt-native-3.0.3-r0: task do_populate_sysroot_setscene: Succeeded
NOTE: Running setscene task 427 of 448 (virtual:native:/srv/pokybuild/yocto-worker/qemuarm-alt/build/layers/openembedded-core/meta/recipes-devtools/apt/apt_3.0.3.bb:do_recipe_qa_setscene)
NOTE: Running setscene task 428 of 448 (virtual:native:/srv/pokybuild/yocto-worker/qemuarm-alt/build/layers/openembedded-core/meta/recipes-support/db/db_5.3.28.bb:do_populate_sysroot_setscene)
NOTE: Running setscene task 431 of 448 (virtual:native:/srv/pokybuild/yocto-worker/qemuarm-alt/build/layers/openembedded-core/meta/recipes-support/lz4/lz4_1.10.0.bb:do_populate_sysroot_setscene)
NOTE: Running setscene task 433 of 448 (virtual:native:/srv/pokybuild/yocto-worker/qemuarm-alt/build/layers/openembedded-core/meta/recipes-support/xxhash/xxhash_0.8.4.bb:do_populate_sysroot_setscene)
NOTE: recipe createrepo-c-native-1.2.5-r0: task do_recipe_qa_setscene: Started
NOTE: recipe db-native-1_5.3.28-r0: task do_populate_sysroot_setscene: Started
NOTE: recipe xxhash-native-0.8.4-r0: task do_populate_sysroot_setscene: Started
NOTE: recipe lz4-native-1_1.10.0-r0: task do_populate_sysroot_setscene: Started
NOTE: recipe apt-native-3.0.3-r0: task do_recipe_qa_setscene: Started
NOTE: recipe createrepo-c-native-1.2.5-r0: task do_recipe_qa_setscene: Succeeded
NOTE: recipe apt-native-3.0.3-r0: task do_recipe_qa_setscene: Succeeded
NOTE: recipe xxhash-native-0.8.4-r0: task do_populate_sysroot_setscene: Succeeded
NOTE: Running setscene task 438 of 448 (virtual:native:/srv/pokybuild/yocto-worker/qemuarm-alt/build/layers/openembedded-core/meta/recipes-support/xxhash/xxhash_0.8.4.bb:do_recipe_qa_setscene)
NOTE: recipe lz4-native-1_1.10.0-r0: task do_populate_sysroot_setscene: Succeeded
NOTE: Running setscene task 440 of 448 (virtual:native:/srv/pokybuild/yocto-worker/qemuarm-alt/build/layers/openembedded-core/meta/recipes-support/lz4/lz4_1.10.0.bb:do_recipe_qa_setscene)
NOTE: recipe db-native-1_5.3.28-r0: task do_populate_sysroot_setscene: Succeeded
NOTE: Running setscene task 445 of 448 (virtual:native:/srv/pokybuild/yocto-worker/qemuarm-alt/build/layers/openembedded-core/meta/recipes-support/db/db_5.3.28.bb:do_recipe_qa_setscene)
NOTE: recipe xxhash-native-0.8.4-r0: task do_recipe_qa_setscene: Started
NOTE: recipe lz4-native-1_1.10.0-r0: task do_recipe_qa_setscene: Started
NOTE: recipe db-native-1_5.3.28-r0: task do_recipe_qa_setscene: Started
NOTE: recipe xxhash-native-0.8.4-r0: task do_recipe_qa_setscene: Succeeded
NOTE: recipe lz4-native-1_1.10.0-r0: task do_recipe_qa_setscene: Succeeded
NOTE: recipe db-native-1_5.3.28-r0: task do_recipe_qa_setscene: Succeeded
NOTE: Setscene tasks completed
NOTE: Running task 1532 of 1535 (/srv/pokybuild/yocto-worker/qemuarm-alt/build/layers/openembedded-core/meta/recipes-core/meta/package-index.bb:do_package_index)
NOTE: recipe package-index-1.0-r0: task do_package_index: Started
NOTE: recipe package-index-1.0-r0: task do_package_index: Succeeded
NOTE: Running task 1533 of 1535 (/srv/pokybuild/yocto-worker/qemuarm-alt/build/layers/openembedded-core/meta/recipes-sato/images/core-image-sato-sdk.bb:do_testimage)
NOTE: Running task 1534 of 1535 (/srv/pokybuild/yocto-worker/qemuarm-alt/build/layers/openembedded-core/meta/recipes-sato/images/core-image-sato.bb:do_testimage)
NOTE: Running task 1535 of 1535 (/srv/pokybuild/yocto-worker/qemuarm-alt/build/layers/openembedded-core/meta/recipes-extended/images/core-image-full-cmdline.bb:do_testimage)
NOTE: recipe core-image-sato-sdk-1.0-r0: task do_testimage: Started
NOTE: recipe core-image-sato-1.0-r0: task do_testimage: Started
NOTE: recipe core-image-full-cmdline-1.0-r0: task do_testimage: Started
QMP Available for connection at /srv/pokybuild/yocto-worker/qemuarm-alt/build/build/tmp/.1v6jwxqa
QMP Available for connection at /srv/pokybuild/yocto-worker/qemuarm-alt/build/build/tmp/.k1ry63q1
QMP Available for connection at /srv/pokybuild/yocto-worker/qemuarm-alt/build/build/tmp/.5agnm3r4
QMP connected to QEMU at 10/22/26 13:56:55 and took 1.04 seconds
QMP connected to QEMU at 10/22/26 13:56:55 and took 1.06 seconds
QMP released QEMU at 10/22/26 13:56:55 and took 0.09 seconds from connect
QMP released QEMU at 10/22/26 13:56:55 and took 0.10 seconds from connect
QMP connected to QEMU at 10/22/26 13:56:58 and took 4.08 seconds
QMP released QEMU at 10/22/26 13:56:58 and took 0.08 seconds from connect
Test requires apt to be installed
Test requires autoconf to be installed
Test requires gtk+3 to be installed
Test requires autoconf to be installed
Test requires connman to be installed
Test case connman.ConnmanTest.test_connmand_running depends on connman.ConnmanTest.test_connmand_help but it didn't pass/run.
Test requires apt to be installed
Test requires dnf to be installed
Test case dnf.DnfBasicTest.test_dnf_history depends on dnf.DnfBasicTest.test_dnf_help but it didn't pass/run.
Test case dnf.DnfBasicTest.test_dnf_info depends on dnf.DnfBasicTest.test_dnf_help but it didn't pass/run.
Test case dnf.DnfBasicTest.test_dnf_search depends on dnf.DnfBasicTest.test_dnf_help but it didn't pass/run.
Test case dnf.DnfBasicTest.test_dnf_version depends on dnf.DnfBasicTest.test_dnf_help but it didn't pass/run.
Test case dnf.DnfRepoTest.test_dnf_makecache depends on dnf.DnfBasicTest.test_dnf_help but it didn't pass/run.
Test case dnf.DnfRepoTest.test_dnf_exclude depends on dnf.DnfRepoTest.test_dnf_makecache but it didn't pass/run.
Test case dnf.DnfRepoTest.test_dnf_install depends on dnf.DnfRepoTest.test_dnf_makecache but it didn't pass/run.
Test case dnf.DnfRepoTest.test_dnf_install_dependency depends on dnf.DnfRepoTest.test_dnf_install but it didn't pass/run.
Test case dnf.DnfRepoTest.test_dnf_install_from_disk depends on dnf.DnfRepoTest.test_dnf_install_dependency but it didn't pass/run.
Test case dnf.DnfRepoTest.test_dnf_install_from_http depends on dnf.DnfRepoTest.test_dnf_install_from_disk but it didn't pass/run.
Test run when not enable usrmerge
Test case dnf.DnfRepoTest.test_dnf_installroot_usrmerge depends on dnf.DnfRepoTest.test_dnf_makecache but it didn't pass/run.
Test case dnf.DnfRepoTest.test_dnf_reinstall depends on dnf.DnfRepoTest.test_dnf_install but it didn't pass/run.
Test case dnf.DnfRepoTest.test_dnf_repoinfo depends on dnf.DnfRepoTest.test_dnf_makecache but it didn't pass/run.
Test requires gcc to be installed
Test requires g++ to be installed
Test requires g++ to be installed
Test requires gcc to be installed
Test requires python3-pygobject to be installed
Test requires cgo-helloworld to be installed
Test requires go-runtime-dev to be installed
Test requires go-runtime-dev to be installed
Test requires go-helloworld to be installed
Test requires gcc to be installed
Test requires ldd to be installed
Not appropriate for systemd image
Test requires ptest-runner to be installed
Test requires ptest-runner to be installed
Test requires python3-core to be installed
Test requires rpm to be installed
Test case rpm.RpmBasicTest.test_rpm_query depends on rpm.RpmBasicTest.test_rpm_help but it didn't pass/run.
Test case rpm.RpmBasicTest.test_rpm_query_nonroot depends on rpm.RpmBasicTest.test_rpm_query but it didn't pass/run.
Test case rpm.RpmInstallRemoveTest.test_rpm_install depends on rpm.RpmBasicTest.test_rpm_query but it didn't pass/run.
Test case rpm.RpmInstallRemoveTest.test_rpm_remove depends on rpm.RpmInstallRemoveTest.test_rpm_install but it didn't pass/run.
Test case rpm.RpmInstallRemoveTest.test_check_rpm_install_removal_log_file_size depends on rpm.RpmInstallRemoveTest.test_rpm_remove but it didn't pass/run.
Test requires rust-c-lib-example-bin to be installed
Test requires cargo to be installed
Test requires rust to be installed
Test requires kernel-devsrc to be installed
Test requires apt to be installed
Test requires autoconf to be installed
Test requires gtk+3 to be installed
Test requires autoconf to be installed
Startup finished in 3.820s (kernel) + 22.530s (userspace) = 26.351s.
Test requires minidebuginfo to be in DISTRO_FEATURES
Test requires avahi-daemon to be installed
Test case systemd.SystemdServiceTests.test_systemd_disable_enable depends on systemd.SystemdServiceTests.test_systemd_status but it didn't pass/run.
Test is only meant to run with read-only-rootfs in IMAGE_FEATURES
Test case systemd.SystemdServiceTests.test_systemd_stop_start depends on systemd.SystemdServiceTests.test_systemd_status but it didn't pass/run.
Test requires wayland-utils to be installed
Test requires weston to be installed
Test requires weston to be installed
Test requires weston to be installed
Test requires xserver-nodm-init to be installed
Output from runqemu:
runqemu - INFO - Received signal: 15
runqemu - INFO - Cleaning up
runqemu - INFO - Host uptime: 239212.41

runqemu - INFO - Removing /srv/pokybuild/yocto-worker/qemuarm-alt/build/build/tmp/deploy/images/qemuarm/core-image-full-cmdline-qemuarm.rootfs-20261022134542.ext4
runqemu - INFO - Removing /home/pokybuild/tmp/core-image-full-cmdline-qemuarm.rootfs-20261022134542.ext4.2605603
tput: No value for $TERM and no -T specified

RESULTS:
RESULTS - date.DateTest.test_date: PASSED (27.64s)
RESULTS - df.DfTest.test_df: PASSED (2.03s)
RESULTS - logrotate.LogrotateTest.test_logrotate_newlog: PASSED (18.94s)
RESULTS - logrotate.LogrotateTest.test_logrotate_wtmp: PASSED (12.24s)
RESULTS - oe_syslog.SyslogTest.test_syslog_running: PASSED (1.98s)
RESULTS - oe_syslog.SyslogTestConfig.test_syslog_logger: PASSED (5.51s)
RESULTS - oe_syslog.SyslogTestConfig.test_syslog_restart: PASSED (5.32s)
RESULTS - opkg.OpkgRepoTest.test_opkg_install_from_repo: PASSED (40.65s)
RESULTS - pam.PamBasicTest.test_pam: PASSED (6.32s)
RESULTS - parselogs.ParseLogsTest.test_get_context: PASSED (0.00s)
RESULTS - parselogs.ParseLogsTest.test_parselogs: PASSED (18.36s)
RESULTS - perl.PerlTest.test_perl_works: PASSED (2.29s)
RESULTS - ping.PingTest.test_ping: PASSED (0.02s)
RESULTS - scp.ScpTest.test_scp_file: PASSED (10.12s)
RESULTS - ssh.SSHTest.test_ssh: PASSED (1.92s)
RESULTS - systemd.SystemdBasicTests.test_systemd_basic: PASSED (1.84s)
RESULTS - systemd.SystemdBasicTests.test_systemd_failed: PASSED (4.21s)
RESULTS - systemd.SystemdBasicTests.test_systemd_list: PASSED (29.44s)
RESULTS - systemd.SystemdJournalTests.test_systemd_boot_time: PASSED (1.81s)
RESULTS - systemd.SystemdJournalTests.test_systemd_journal: PASSED (2.31s)
RESULTS - apt.AptRepoTest.test_apt_install_from_repo: SKIPPED (0.00s)
RESULTS - buildcpio.BuildCpioTest.test_cpio: SKIPPED (0.00s)
RESULTS - buildgalculator.GalculatorTest.test_galculator: SKIPPED (0.00s)
RESULTS - buildlzip.BuildLzipTest.test_lzip: SKIPPED (0.00s)
RESULTS - connman.ConnmanTest.test_connmand_help: SKIPPED (0.00s)
RESULTS - connman.ConnmanTest.test_connmand_running: SKIPPED (0.00s)
RESULTS - dnf.DnfBasicTest.test_dnf_help: SKIPPED (0.00s)
RESULTS - dnf.DnfBasicTest.test_dnf_history: SKIPPED (0.00s)
RESULTS - dnf.DnfBasicTest.test_dnf_info: SKIPPED (0.00s)
RESULTS - dnf.DnfBasicTest.test_dnf_search: SKIPPED (0.00s)
RESULTS - dnf.DnfBasicTest.test_dnf_version: SKIPPED (0.00s)
RESULTS - dnf.DnfRepoTest.test_dnf_exclude: SKIPPED (0.00s)
RESULTS - dnf.DnfRepoTest.test_dnf_install: SKIPPED (0.00s)
RESULTS - dnf.DnfRepoTest.test_dnf_install_dependency: SKIPPED (0.00s)
RESULTS - dnf.DnfRepoTest.test_dnf_install_from_disk: SKIPPED (0.00s)
RESULTS - dnf.DnfRepoTest.test_dnf_install_from_http: SKIPPED (0.00s)
RESULTS - dnf.DnfRepoTest.test_dnf_installroot: SKIPPED (0.00s)
RESULTS - dnf.DnfRepoTest.test_dnf_installroot_usrmerge: SKIPPED (0.00s)
RESULTS - dnf.DnfRepoTest.test_dnf_makecache: SKIPPED (0.00s)
RESULTS - dnf.DnfRepoTest.test_dnf_reinstall: SKIPPED (0.00s)
RESULTS - dnf.DnfRepoTest.test_dnf_repoinfo: SKIPPED (0.00s)
RESULTS - gcc.GccCompileTest.test_gcc_compile: SKIPPED (0.00s)
RESULTS - gcc.GccCompileTest.test_gpp2_compile: SKIPPED (0.00s)
RESULTS - gcc.GccCompileTest.test_gpp_compile: SKIPPED (0.00s)
RESULTS - gcc.GccCompileTest.test_make: SKIPPED (0.00s)
RESULTS - gi.GObjectIntrospectionTest.test_python: SKIPPED (0.00s)
RESULTS - go.CgoHelloworldTest.test_cgohelloworld: SKIPPED (0.00s)
RESULTS - go.GoCompileTest.test_go_compile: SKIPPED (0.00s)
RESULTS - go.GoCompileTest.test_go_module: SKIPPED (0.00s)
RESULTS - go.GoHelloworldTest.test_gohelloworld: SKIPPED (0.00s)
RESULTS - kernelmodule.KernelModuleTest.test_kernel_module: SKIPPED (0.00s)
RESULTS - ldd.LddTest.test_ldd: SKIPPED (0.00s)
RESULTS - oe_syslog.SyslogTestConfig.test_syslog_startup_config: SKIPPED (0.00s)
RESULTS - ptest.PtestRunnerTest.test_ptestrunner_expectfail: SKIPPED (0.00s)
RESULTS - ptest.PtestRunnerTest.test_ptestrunner_expectsuccess: SKIPPED (0.00s)
RESULTS - python.PythonTest.test_python3: SKIPPED (0.00s)
RESULTS - rpm.RpmBasicTest.test_rpm_help: SKIPPED (0.00s)
RESULTS - rpm.RpmBasicTest.test_rpm_query: SKIPPED (0.00s)
RESULTS - rpm.RpmBasicTest.test_rpm_query_nonroot: SKIPPED (0.00s)
RESULTS - rpm.RpmInstallRemoveTest.test_check_rpm_install_removal_log_file_size: SKIPPED (0.00s)
RESULTS - rpm.RpmInstallRemoveTest.test_rpm_install: SKIPPED (0.00s)
RESULTS - rpm.RpmInstallRemoveTest.test_rpm_remove: SKIPPED (0.00s)
RESULTS - rust.RustCLibExampleTest.test_rust_c_lib_example: SKIPPED (0.00s)
RESULTS - rust.RustCompileTest.test_cargo_compile: SKIPPED (0.00s)
RESULTS - rust.RustCompileTest.test_rust_compile: SKIPPED (0.00s)
RESULTS - stap.StapTest.test_stap: SKIPPED (0.00s)
RESULTS - systemd.SystemdServiceTests.test_systemd_coredump_minidebuginfo: SKIPPED (0.00s)
RESULTS - systemd.SystemdServiceTests.test_systemd_disable_enable: SKIPPED (0.00s)
RESULTS - systemd.SystemdServiceTests.test_systemd_disable_enable_ro: SKIPPED (0.00s)
RESULTS - systemd.SystemdServiceTests.test_systemd_status: SKIPPED (0.00s)
RESULTS - systemd.SystemdServiceTests.test_systemd_stop_start: SKIPPED (0.00s)
RESULTS - weston.WestonTest.test_wayland_info: SKIPPED (0.00s)
RESULTS - weston.WestonTest.test_weston_can_initialize_new_wayland_compositor: SKIPPED (0.00s)
RESULTS - weston.WestonTest.test_weston_running: SKIPPED (0.00s)
RESULTS - weston.WestonTest.test_weston_supports_xwayland: SKIPPED (0.00s)
RESULTS - xorg.XorgTest.test_xorg_running: SKIPPED (0.00s)
SUMMARY:
core-image-full-cmdline () - Ran 76 tests in 193.111s
core-image-full-cmdline - OK - All required tests passed (successes=20, skipped=56, failures=0, errors=0)
NOTE: recipe core-image-full-cmdline-1.0-r0: task do_testimage: Succeeded
Test requires dnf to be installed
Test case dnf.DnfBasicTest.test_dnf_history depends on dnf.DnfBasicTest.test_dnf_help but it didn't pass/run.
Test case dnf.DnfBasicTest.test_dnf_info depends on dnf.DnfBasicTest.test_dnf_help but it didn't pass/run.
Test case dnf.DnfBasicTest.test_dnf_search depends on dnf.DnfBasicTest.test_dnf_help but it didn't pass/run.
Test case dnf.DnfBasicTest.test_dnf_version depends on dnf.DnfBasicTest.test_dnf_help but it didn't pass/run.
Test case dnf.DnfRepoTest.test_dnf_makecache depends on dnf.DnfBasicTest.test_dnf_help but it didn't pass/run.
Test case dnf.DnfRepoTest.test_dnf_exclude depends on dnf.DnfRepoTest.test_dnf_makecache but it didn't pass/run.
Test case dnf.DnfRepoTest.test_dnf_install depends on dnf.DnfRepoTest.test_dnf_makecache but it didn't pass/run.
Test case dnf.DnfRepoTest.test_dnf_install_dependency depends on dnf.DnfRepoTest.test_dnf_install but it didn't pass/run.
Test case dnf.DnfRepoTest.test_dnf_install_from_disk depends on dnf.DnfRepoTest.test_dnf_install_dependency but it didn't pass/run.
Test case dnf.DnfRepoTest.test_dnf_install_from_http depends on dnf.DnfRepoTest.test_dnf_install_from_disk but it didn't pass/run.
Test run when not enable usrmerge
Test case dnf.DnfRepoTest.test_dnf_installroot_usrmerge depends on dnf.DnfRepoTest.test_dnf_makecache but it didn't pass/run.
Test case dnf.DnfRepoTest.test_dnf_reinstall depends on dnf.DnfRepoTest.test_dnf_install but it didn't pass/run.
Test case dnf.DnfRepoTest.test_dnf_repoinfo depends on dnf.DnfRepoTest.test_dnf_makecache but it didn't pass/run.
Test requires gcc to be installed
Test requires g++ to be installed
Test requires g++ to be installed
Test requires make to be installed
Test requires python3-pygobject to be installed
Test requires cgo-helloworld to be installed
Test requires go-runtime-dev to be installed
Test requires go-runtime-dev to be installed
Test requires go-helloworld to be installed
Test requires gcc to be installed
Test requires ldd to be installed
Test requires logrotate to be installed
Test case logrotate.LogrotateTest.test_logrotate_newlog depends on logrotate.LogrotateTest.test_logrotate_wtmp but it didn't pass/run.
Not appropriate for systemd image
Traceback (most recent call last):
  File "/srv/pokybuild/yocto-worker/qemuarm-alt/build/layers/openembedded-core/meta/lib/oeqa/core/decorator/__init__.py", line 35, in wrapped_f
    return func(*args, **kwargs)
  File "/srv/pokybuild/yocto-worker/qemuarm-alt/build/layers/openembedded-core/meta/lib/oeqa/runtime/cases/parselogs.py", line 185, in test_parselogs
    self.assertEqual(errcount, 0, msg=self.msg)
    ~~~~~~~~~~~~~~~~^^^^^^^^^^^^^^^^^^^^^^^^^^^
AssertionError: 1 != 0 : Log: /srv/pokybuild/yocto-worker/qemuarm-alt/build/build/tmp/work/qemuarm-poky-linux-gnueabi/core-image-sato/1.0/target_logs/dmesg_output.log
-----------------------
Central error: [    1.213134] CPU1: failed to come online
***********************
[    0.071359] Mountpoint-cache hash table entries: 1024 (order: 0, 4096 bytes, linear)
[    0.137121] /cpus/cpu@0 missing clock-frequency property
[    0.137456] /cpus/cpu@1 missing clock-frequency property
[    0.137526] /cpus/cpu@2 missing clock-frequency property
[    0.137599] /cpus/cpu@3 missing clock-frequency property
[    0.137723] CPU0: thread -1, cpu 0, socket 0, mpidr 80000000
[    0.155567] Setting up static identity map for 0x40200000 - 0x40200060
[    0.158877] rcu: Hierarchical SRCU implementation.
[    0.158910] rcu: 	Max phase no-delay instances is 1000.
[    0.163732] smp: Bringing up secondary CPUs ...
[    1.213134] CPU1: failed to come online
[    1.304837] CPU2: thread -1, cpu 2, socket 0, mpidr 80000002
[    1.305682] CPU2: Spectre v2: firmware did not set auxiliary control register IBE bit, system vulnerable
[    1.311230] CPU3: thread -1, cpu 3, socket 0, mpidr 80000003
[    1.312272] CPU3: Spectre v2: firmware did not set auxiliary control register IBE bit, system vulnerable
[    1.313260] smp: Brought up 1 node, 3 CPUs
[    1.313380] SMP: Total of 3 processors activated (375.00 BogoMIPS).
[    1.313459] CPU: All CPU(s) started in SVC mode.
[    1.317819] Memory: 492124K/524288K available (12288K kernel code, 1522K rwdata, 3080K rodata, 2048K init, 347K bss, 28888K reserved, 0K cma-reserved, 0K highmem)
[    1.361818] devtmpfs: initialized
[    1.378788] VFP support v0.3: implementor 41 architecture 4 part 30 variant f rev 0

***********************
1 errors found in logs.

Test requires perl to be installed
Test requires ptest-runner to be installed
Test requires ptest-runner to be installed
Test requires rpm to be installed
Test case rpm.RpmBasicTest.test_rpm_query depends on rpm.RpmBasicTest.test_rpm_help but it didn't pass/run.
Test case rpm.RpmBasicTest.test_rpm_query_nonroot depends on rpm.RpmBasicTest.test_rpm_query but it didn't pass/run.
Test case rpm.RpmInstallRemoveTest.test_rpm_install depends on rpm.RpmBasicTest.test_rpm_query but it didn't pass/run.
Test case rpm.RpmInstallRemoveTest.test_rpm_remove depends on rpm.RpmInstallRemoveTest.test_rpm_install but it didn't pass/run.
Test case rpm.RpmInstallRemoveTest.test_check_rpm_install_removal_log_file_size depends on rpm.RpmInstallRemoveTest.test_rpm_remove but it didn't pass/run.
Test requires rust-c-lib-example-bin to be installed
Test requires openssh-scp to be installed
Test requires openssh-scp to be installed
Test requires kernel-devsrc to be installed
Startup finished in 1min 46.495s (kernel) + 50.248s (userspace) = 2min 36.743s.
Target boot time 156.743 exceeds systemd's TimeoutStartSec 90
Test requires minidebuginfo to be in DISTRO_FEATURES
Test is only meant to run with read-only-rootfs in IMAGE_FEATURES
Test requires wayland-utils to be installed
Test requires weston to be installed
Test requires weston to be installed
Test requires weston to be installed
Output from runqemu:
runqemu - INFO - Received signal: 15
runqemu - INFO - Cleaning up
runqemu - INFO - Host uptime: 239430.58

runqemu - INFO - Removing /srv/pokybuild/yocto-worker/qemuarm-alt/build/build/tmp/deploy/images/qemuarm/core-image-sato-qemuarm.rootfs-20261022134542.ext4
runqemu - INFO - Removing /home/pokybuild/tmp/core-image-sato-qemuarm.rootfs-20261022134542.ext4.2605611
tput: No value for $TERM and no -T specified

RESULTS:
RESULTS - connman.ConnmanTest.test_connmand_help: PASSED (1.57s)
RESULTS - connman.ConnmanTest.test_connmand_running: PASSED (1.53s)
RESULTS - date.DateTest.test_date: PASSED (36.46s)
RESULTS - df.DfTest.test_df: PASSED (1.23s)
RESULTS - oe_syslog.SyslogTest.test_syslog_running: PASSED (1.28s)
RESULTS - oe_syslog.SyslogTestConfig.test_syslog_logger: PASSED (3.26s)
RESULTS - oe_syslog.SyslogTestConfig.test_syslog_restart: PASSED (3.24s)
RESULTS - opkg.OpkgRepoTest.test_opkg_install_from_repo: PASSED (70.87s)
RESULTS - pam.PamBasicTest.test_pam: PASSED (7.60s)
RESULTS - parselogs.ParseLogsTest.test_get_context: PASSED (0.00s)
RESULTS - ping.PingTest.test_ping: PASSED (0.02s)
RESULTS - python.PythonTest.test_python3: PASSED (2.19s)
RESULTS - scp.ScpTest.test_scp_file: PASSED (3.91s)
RESULTS - ssh.SSHTest.test_ssh: PASSED (3.25s)
RESULTS - systemd.SystemdBasicTests.test_systemd_basic: PASSED (1.20s)
RESULTS - systemd.SystemdBasicTests.test_systemd_failed: PASSED (2.47s)
RESULTS - systemd.SystemdBasicTests.test_systemd_list: PASSED (28.41s)
RESULTS - systemd.SystemdJournalTests.test_systemd_boot_time: PASSED (1.33s)
RESULTS - systemd.SystemdJournalTests.test_systemd_journal: PASSED (1.50s)
RESULTS - systemd.SystemdServiceTests.test_systemd_disable_enable: PASSED (31.32s)
RESULTS - systemd.SystemdServiceTests.test_systemd_status: PASSED (1.44s)
RESULTS - systemd.SystemdServiceTests.test_systemd_stop_start: PASSED (10.50s)
RESULTS - xorg.XorgTest.test_xorg_running: PASSED (2.64s)
RESULTS - apt.AptRepoTest.test_apt_install_from_repo: SKIPPED (0.00s)
RESULTS - buildcpio.BuildCpioTest.test_cpio: SKIPPED (0.00s)
RESULTS - buildgalculator.GalculatorTest.test_galculator: SKIPPED (0.00s)
RESULTS - buildlzip.BuildLzipTest.test_lzip: SKIPPED (0.00s)
RESULTS - dnf.DnfBasicTest.test_dnf_help: SKIPPED (0.00s)
RESULTS - dnf.DnfBasicTest.test_dnf_history: SKIPPED (0.00s)
RESULTS - dnf.DnfBasicTest.test_dnf_info: SKIPPED (0.00s)
RESULTS - dnf.DnfBasicTest.test_dnf_search: SKIPPED (0.00s)
RESULTS - dnf.DnfBasicTest.test_dnf_version: SKIPPED (0.00s)
RESULTS - dnf.DnfRepoTest.test_dnf_exclude: SKIPPED (0.00s)
RESULTS - dnf.DnfRepoTest.test_dnf_install: SKIPPED (0.00s)
RESULTS - dnf.DnfRepoTest.test_dnf_install_dependency: SKIPPED (0.00s)
RESULTS - dnf.DnfRepoTest.test_dnf_install_from_disk: SKIPPED (0.00s)
RESULTS - dnf.DnfRepoTest.test_dnf_install_from_http: SKIPPED (0.00s)
RESULTS - dnf.DnfRepoTest.test_dnf_installroot: SKIPPED (0.00s)
RESULTS - dnf.DnfRepoTest.test_dnf_installroot_usrmerge: SKIPPED (0.00s)
RESULTS - dnf.DnfRepoTest.test_dnf_makecache: SKIPPED (0.00s)
RESULTS - dnf.DnfRepoTest.test_dnf_reinstall: SKIPPED (0.00s)
RESULTS - dnf.DnfRepoTest.test_dnf_repoinfo: SKIPPED (0.00s)
RESULTS - gcc.GccCompileTest.test_gcc_compile: SKIPPED (0.00s)
RESULTS - gcc.GccCompileTest.test_gpp2_compile: SKIPPED (0.00s)
RESULTS - gcc.GccCompileTest.test_gpp_compile: SKIPPED (0.00s)
RESULTS - gcc.GccCompileTest.test_make: SKIPPED (0.00s)
RESULTS - gi.GObjectIntrospectionTest.test_python: SKIPPED (0.00s)
RESULTS - go.CgoHelloworldTest.test_cgohelloworld: SKIPPED (0.00s)
RESULTS - go.GoCompileTest.test_go_compile: SKIPPED (0.00s)
RESULTS - go.GoCompileTest.test_go_module: SKIPPED (0.00s)
RESULTS - go.GoHelloworldTest.test_gohelloworld: SKIPPED (0.00s)
RESULTS - kernelmodule.KernelModuleTest.test_kernel_module: SKIPPED (0.00s)
RESULTS - ldd.LddTest.test_ldd: SKIPPED (0.00s)
RESULTS - logrotate.LogrotateTest.test_logrotate_newlog: SKIPPED (0.00s)
RESULTS - logrotate.LogrotateTest.test_logrotate_wtmp: SKIPPED (0.00s)
RESULTS - oe_syslog.SyslogTestConfig.test_syslog_startup_config: SKIPPED (0.00s)
RESULTS - perl.PerlTest.test_perl_works: SKIPPED (0.00s)
RESULTS - ptest.PtestRunnerTest.test_ptestrunner_expectfail: SKIPPED (0.00s)
RESULTS - ptest.PtestRunnerTest.test_ptestrunner_expectsuccess: SKIPPED (0.00s)
RESULTS - rpm.RpmBasicTest.test_rpm_help: SKIPPED (0.00s)
RESULTS - rpm.RpmBasicTest.test_rpm_query: SKIPPED (0.00s)
RESULTS - rpm.RpmBasicTest.test_rpm_query_nonroot: SKIPPED (0.00s)
RESULTS - rpm.RpmInstallRemoveTest.test_check_rpm_install_removal_log_file_size: SKIPPED (0.00s)
RESULTS - rpm.RpmInstallRemoveTest.test_rpm_install: SKIPPED (0.00s)
RESULTS - rpm.RpmInstallRemoveTest.test_rpm_remove: SKIPPED (0.00s)
RESULTS - rust.RustCLibExampleTest.test_rust_c_lib_example: SKIPPED (0.00s)
RESULTS - rust.RustCompileTest.test_cargo_compile: SKIPPED (0.00s)
RESULTS - rust.RustCompileTest.test_rust_compile: SKIPPED (0.00s)
RESULTS - stap.StapTest.test_stap: SKIPPED (0.00s)
RESULTS - systemd.SystemdServiceTests.test_systemd_coredump_minidebuginfo: SKIPPED (0.00s)
RESULTS - systemd.SystemdServiceTests.test_systemd_disable_enable_ro: SKIPPED (0.00s)
RESULTS - weston.WestonTest.test_wayland_info: SKIPPED (0.00s)
RESULTS - weston.WestonTest.test_weston_can_initialize_new_wayland_compositor: SKIPPED (0.00s)
RESULTS - weston.WestonTest.test_weston_running: SKIPPED (0.00s)
RESULTS - weston.WestonTest.test_weston_supports_xwayland: SKIPPED (0.00s)
RESULTS - parselogs.ParseLogsTest.test_parselogs: FAILED (9.10s)
SUMMARY:
core-image-sato () - Ran 76 tests in 226.558s
core-image-sato - FAIL - Required tests failed (successes=23, skipped=52, failures=1, errors=0)
core-image-sato - FAILED - Last lines of QEMU boot logs:
--- qemu_boot_log.20261022135633 ---

[  OK  ] Started Serial Getty on ttyAMA0.

[  OK  ] Reached target Login Prompts.

[  OK  ] Started Hostname Service.

[  OK  ] Started Avahi mDNS/DNS-SD Stack.

[  OK  ] Reached target Multi-User System.

[  OK  ] Reached target Graphical Interface.

[!p]104\[?7h78[!p]104\[?7h78]3008;start=97102156e14441abada5bf7b4877ef18;user=root;hostname=qemuarm;machineid=b753170ea569415bae7518ba817a7e6d;bootid=7c41f8f4cf184fd0b725ea810331301e;pid=229;pidfdid=230;comm=(agetty);servicename=serial-getty@hvc0.service;invocationid=aa1853b5de3a475d8def5c8a65151476;type=service\P+q6E616D65\

Poky (Yocto Project Reference Distro) 6.1.99+snapshot-7599f382b70437d89decd46834cd8ed8d8439493 qemuarm hvc0

Type 'root' to login with superuser privileges (no password will be asked).

qemuarm login: [  203.255744] systemd-journald[103]: Time jumped backwards, rotating.

--- qemu_boot_log.20261022135633.2 ---
[  123.471703] systemd-journald[103]: Collecting audit messages is disabled.
[  124.517694] systemd[1]: Mounted POSIX Message Queue File System.
[  124.522965] systemd[1]: Mounted Kernel Debug File System.
[  124.527278] systemd[1]: Mounted Kernel Trace File System.
[  124.531395] systemd[1]: Mounted Temporary Directory /tmp.
[  124.544903] systemd[1]: Finished Create List of Static Device Nodes.
[  124.619619] systemd[1]: modprobe@configfs.service: Deactivated successfully.
[  124.637437] systemd[1]: Finished Load Kernel Module configfs.
[  124.669616] systemd[1]: modprobe@fuse.service: Deactivated successfully.
[  124.704429] systemd[1]: Finished Load Kernel Module fuse.
[  124.735945] systemd[1]: Finished Generate Network Units from Kernel Command Line.
[  125.271833] systemd[1]: Started Journal Service.
[  129.118870] systemd-journald[103]: Received client request to flush runtime journal.
[!p]104\[?7h78[!p]104\[?7h78]3008;start=5a9569215a8a4a448335ec82f2d8b128;user=root;hostname=qemuarm;machineid=b753170ea569415bae7518ba817a7e6d;bootid=7c41f8f4cf184fd0b725ea810331301e;pid=230;pidfdid=231;comm=(agetty);servicename=serial-getty@ttyAMA0.service;invocationid=4879544b17bd467ebcefdccf6cfdb8ab;type=service\P+q6E616D65\

Poky (Yocto Project Reference Distro) 6.1.99+snapshot-7599f382b70437d89decd46834cd8ed8d8439493 qemuarm ttyAMA0

Type 'root' to login with superuser privileges (no password will be asked).

qemuarm login: [  203.255744] systemd-journald[103]: Time jumped backwards, rotating.

ERROR: core-image-sato-1.0-r0 do_testimage: core-image-sato - FAILED - also check the logs in /srv/pokybuild/yocto-worker/qemuarm-alt/build/build/tmp/log
NOTE: recipe core-image-sato-1.0-r0: task do_testimage: Succeeded
Bitbake still alive (no events for 600s). Active tasks:
/srv/pokybuild/yocto-worker/qemuarm-alt/build/layers/openembedded-core/meta/recipes-sato/images/core-image-sato-sdk.bb:do_testimage
Test requires gtk+3 to be installed
Test requires dnf to be installed
Test case dnf.DnfBasicTest.test_dnf_history depends on dnf.DnfBasicTest.test_dnf_help but it didn't pass/run.
Test case dnf.DnfBasicTest.test_dnf_info depends on dnf.DnfBasicTest.test_dnf_help but it didn't pass/run.
Test case dnf.DnfBasicTest.test_dnf_search depends on dnf.DnfBasicTest.test_dnf_help but it didn't pass/run.
Test case dnf.DnfBasicTest.test_dnf_version depends on dnf.DnfBasicTest.test_dnf_help but it didn't pass/run.
Test case dnf.DnfRepoTest.test_dnf_makecache depends on dnf.DnfBasicTest.test_dnf_help but it didn't pass/run.
Test case dnf.DnfRepoTest.test_dnf_exclude depends on dnf.DnfRepoTest.test_dnf_makecache but it didn't pass/run.
Test case dnf.DnfRepoTest.test_dnf_install depends on dnf.DnfRepoTest.test_dnf_makecache but it didn't pass/run.
Test case dnf.DnfRepoTest.test_dnf_install_dependency depends on dnf.DnfRepoTest.test_dnf_install but it didn't pass/run.
Test case dnf.DnfRepoTest.test_dnf_install_from_disk depends on dnf.DnfRepoTest.test_dnf_install_dependency but it didn't pass/run.
Test case dnf.DnfRepoTest.test_dnf_install_from_http depends on dnf.DnfRepoTest.test_dnf_install_from_disk but it didn't pass/run.
Test run when not enable usrmerge
Test case dnf.DnfRepoTest.test_dnf_installroot_usrmerge depends on dnf.DnfRepoTest.test_dnf_makecache but it didn't pass/run.
Test case dnf.DnfRepoTest.test_dnf_reinstall depends on dnf.DnfRepoTest.test_dnf_install but it didn't pass/run.
Test case dnf.DnfRepoTest.test_dnf_repoinfo depends on dnf.DnfRepoTest.test_dnf_makecache but it didn't pass/run.
Not appropriate for systemd image
Test requires ptest-runner to be installed
Test requires ptest-runner to be installed
No /var/lib/rpm on target
Test case rpm.RpmBasicTest.test_rpm_query_nonroot depends on rpm.RpmBasicTest.test_rpm_query but it didn't pass/run.
Test case rpm.RpmInstallRemoveTest.test_rpm_install depends on rpm.RpmBasicTest.test_rpm_query but it didn't pass/run.
Test case rpm.RpmInstallRemoveTest.test_rpm_remove depends on rpm.RpmInstallRemoveTest.test_rpm_install but it didn't pass/run.
Test case rpm.RpmInstallRemoveTest.test_check_rpm_install_removal_log_file_size depends on rpm.RpmInstallRemoveTest.test_rpm_remove but it didn't pass/run.
Test requires rust-c-lib-example-bin to be installed
Startup finished in 3.813s (kernel) + 31.849s (userspace) = 35.662s.
Test requires minidebuginfo to be in DISTRO_FEATURES
Test is only meant to run with read-only-rootfs in IMAGE_FEATURES
Test requires wayland-utils to be installed
Test requires weston to be installed
Test requires weston to be installed
Test requires weston to be installed
Output from runqemu:
runqemu - INFO - Received signal: 15
runqemu - INFO - Cleaning up
runqemu - INFO - Host uptime: 241930.48

runqemu - INFO - Removing /srv/pokybuild/yocto-worker/qemuarm-alt/build/build/tmp/deploy/images/qemuarm/core-image-sato-sdk-qemuarm.rootfs-20261022134542.ext4
runqemu - INFO - Removing /home/pokybuild/tmp/core-image-sato-sdk-qemuarm.rootfs-20261022134542.ext4.2605612
tput: No value for $TERM and no -T specified

RESULTS:
RESULTS - buildcpio.BuildCpioTest.test_cpio: PASSED (1109.36s)
RESULTS - buildlzip.BuildLzipTest.test_lzip: PASSED (247.43s)
RESULTS - connman.ConnmanTest.test_connmand_help: PASSED (1.72s)
RESULTS - connman.ConnmanTest.test_connmand_running: PASSED (1.98s)
RESULTS - date.DateTest.test_date: PASSED (23.63s)
RESULTS - df.DfTest.test_df: PASSED (1.62s)
RESULTS - gcc.GccCompileTest.test_gcc_compile: PASSED (11.09s)
RESULTS - gcc.GccCompileTest.test_gpp2_compile: PASSED (14.35s)
RESULTS - gcc.GccCompileTest.test_gpp_compile: PASSED (32.23s)
RESULTS - gcc.GccCompileTest.test_make: PASSED (11.13s)
RESULTS - gi.GObjectIntrospectionTest.test_python: PASSED (13.25s)
RESULTS - go.CgoHelloworldTest.test_cgohelloworld: PASSED (3.72s)
RESULTS - go.GoCompileTest.test_go_compile: PASSED (194.66s)
RESULTS - go.GoCompileTest.test_go_module: PASSED (34.77s)
RESULTS - go.GoHelloworldTest.test_gohelloworld: PASSED (3.02s)
RESULTS - kernelmodule.KernelModuleTest.test_kernel_module: PASSED (556.91s)
RESULTS - ldd.LddTest.test_ldd: PASSED (6.82s)
RESULTS - logrotate.LogrotateTest.test_logrotate_newlog: PASSED (30.93s)
RESULTS - logrotate.LogrotateTest.test_logrotate_wtmp: PASSED (10.34s)
RESULTS - oe_syslog.SyslogTest.test_syslog_running: PASSED (3.46s)
RESULTS - oe_syslog.SyslogTestConfig.test_syslog_logger: PASSED (5.96s)
RESULTS - oe_syslog.SyslogTestConfig.test_syslog_restart: PASSED (5.41s)
RESULTS - opkg.OpkgRepoTest.test_opkg_install_from_repo: PASSED (120.70s)
RESULTS - pam.PamBasicTest.test_pam: PASSED (13.58s)
RESULTS - parselogs.ParseLogsTest.test_get_context: PASSED (0.00s)
RESULTS - parselogs.ParseLogsTest.test_parselogs: PASSED (25.76s)
RESULTS - perl.PerlTest.test_perl_works: PASSED (4.29s)
RESULTS - ping.PingTest.test_ping: PASSED (0.02s)
RESULTS - python.PythonTest.test_python3: PASSED (4.08s)
RESULTS - rpm.RpmBasicTest.test_rpm_help: PASSED (4.07s)
RESULTS - rust.RustCompileTest.test_cargo_compile: PASSED (30.60s)
RESULTS - rust.RustCompileTest.test_rust_compile: PASSED (18.03s)
RESULTS - scp.ScpTest.test_scp_file: PASSED (19.75s)
RESULTS - ssh.SSHTest.test_ssh: PASSED (3.45s)
RESULTS - stap.StapTest.test_stap: PASSED (264.71s)
RESULTS - systemd.SystemdBasicTests.test_systemd_basic: PASSED (1.38s)
RESULTS - systemd.SystemdBasicTests.test_systemd_failed: PASSED (2.85s)
RESULTS - systemd.SystemdBasicTests.test_systemd_list: PASSED (21.43s)
RESULTS - systemd.SystemdJournalTests.test_systemd_boot_time: PASSED (1.61s)
RESULTS - systemd.SystemdJournalTests.test_systemd_journal: PASSED (1.84s)
RESULTS - systemd.SystemdServiceTests.test_systemd_disable_enable: PASSED (13.85s)
RESULTS - systemd.SystemdServiceTests.test_systemd_status: PASSED (1.62s)
RESULTS - systemd.SystemdServiceTests.test_systemd_stop_start: PASSED (6.33s)
RESULTS - xorg.XorgTest.test_xorg_running: PASSED (3.13s)
RESULTS - apt.AptRepoTest.test_apt_install_from_repo: SKIPPED (0.00s)
RESULTS - buildgalculator.GalculatorTest.test_galculator: SKIPPED (0.00s)
RESULTS - dnf.DnfBasicTest.test_dnf_help: SKIPPED (0.00s)
RESULTS - dnf.DnfBasicTest.test_dnf_history: SKIPPED (0.00s)
RESULTS - dnf.DnfBasicTest.test_dnf_info: SKIPPED (0.00s)
RESULTS - dnf.DnfBasicTest.test_dnf_search: SKIPPED (0.00s)
RESULTS - dnf.DnfBasicTest.test_dnf_version: SKIPPED (0.00s)
RESULTS - dnf.DnfRepoTest.test_dnf_exclude: SKIPPED (0.00s)
RESULTS - dnf.DnfRepoTest.test_dnf_install: SKIPPED (0.00s)
RESULTS - dnf.DnfRepoTest.test_dnf_install_dependency: SKIPPED (0.00s)
RESULTS - dnf.DnfRepoTest.test_dnf_install_from_disk: SKIPPED (0.00s)
RESULTS - dnf.DnfRepoTest.test_dnf_install_from_http: SKIPPED (0.00s)
RESULTS - dnf.DnfRepoTest.test_dnf_installroot: SKIPPED (0.00s)
RESULTS - dnf.DnfRepoTest.test_dnf_installroot_usrmerge: SKIPPED (0.00s)
RESULTS - dnf.DnfRepoTest.test_dnf_makecache: SKIPPED (0.00s)
RESULTS - dnf.DnfRepoTest.test_dnf_reinstall: SKIPPED (0.00s)
RESULTS - dnf.DnfRepoTest.test_dnf_repoinfo: SKIPPED (0.00s)
RESULTS - oe_syslog.SyslogTestConfig.test_syslog_startup_config: SKIPPED (0.00s)
RESULTS - ptest.PtestRunnerTest.test_ptestrunner_expectfail: SKIPPED (0.00s)
RESULTS - ptest.PtestRunnerTest.test_ptestrunner_expectsuccess: SKIPPED (0.00s)
RESULTS - rpm.RpmBasicTest.test_rpm_query: SKIPPED (2.89s)
RESULTS - rpm.RpmBasicTest.test_rpm_query_nonroot: SKIPPED (0.00s)
RESULTS - rpm.RpmInstallRemoveTest.test_check_rpm_install_removal_log_file_size: SKIPPED (0.00s)
RESULTS - rpm.RpmInstallRemoveTest.test_rpm_install: SKIPPED (0.00s)
RESULTS - rpm.RpmInstallRemoveTest.test_rpm_remove: SKIPPED (0.00s)
RESULTS - rust.RustCLibExampleTest.test_rust_c_lib_example: SKIPPED (0.00s)
RESULTS - systemd.SystemdServiceTests.test_systemd_coredump_minidebuginfo: SKIPPED (0.00s)
RESULTS - systemd.SystemdServiceTests.test_systemd_disable_enable_ro: SKIPPED (0.00s)
RESULTS - weston.WestonTest.test_wayland_info: SKIPPED (0.00s)
RESULTS - weston.WestonTest.test_weston_can_initialize_new_wayland_compositor: SKIPPED (0.00s)
RESULTS - weston.WestonTest.test_weston_running: SKIPPED (0.00s)
RESULTS - weston.WestonTest.test_weston_supports_xwayland: SKIPPED (0.00s)
SUMMARY:
core-image-sato-sdk () - Ran 76 tests in 2895.166s
core-image-sato-sdk - OK - All required tests passed (successes=44, skipped=32, failures=0, errors=0)
NOTE: recipe core-image-sato-sdk-1.0-r0: task do_testimage: Succeeded
NOTE: Tasks Summary: Attempted 1535 tasks of which 1531 didn't need to be rerun and all succeeded.

Summary: There was 1 ERROR message, returning a non-zero exit code.

Error details

Submitted on:
22/10/26 09:46
Error type:
Core
Command:
bitbake core-image-full-cmdline:do_testimage core-image-sato:do_testimage core-image-sato-sdk:do_testimage -k
Machine:
qemuarm
Distro:
poky-altcfg
Build system:
unknown
Target system:
unknown
Host distro:
unknown
Branch:
mathieu/master-next
Commit:
unknown
Build:
#253335
Submitter:
yp-ab-opensuse160-vk-1.yocto.io
Link back:
https://autobuilder.yoctoproject.org/valkyrie/#/builders/74/builds/4827
Similar errors:
0
Open a bug