Running '. ./init-build-env; bitbake-selftest' with output to /srv/pokybuild/yocto-worker/oe-selftest-armhost/build/build/command-1-cmds.log in /srv/pokybuild/yocto-worker/oe-selftest-armhost/build/build
Poky - The Yocto Project testing distribution
.........................................................................................................................................................................................................................................................s............................................................ssss.s..sssss..........................................................................sssssssssssssssssss......s.s.sss...................F.................................................ssssssss..............................................................................ssssssssssssssssssssssssssssssssssssssssssssss............................................................................................................................................ssssssssssssssssssssssssssssssssssssssssssssss........Sending SIGTERM to pr-server.
...................
======================================================================
FAIL: test_duplicate_bbpath (bb.tests.parse.ParseTest.test_duplicate_bbpath) (dup='/srv/pokybuild/yocto-worker/oe-selftest-armhost/build/layers/bitbake/lib/bb/tests/parse-tests')
----------------------------------------------------------------------
Traceback (most recent call last):
File "/srv/pokybuild/yocto-worker/oe-selftest-armhost/build/layers/bitbake/lib/bb/tests/parse.py", line 554, in test_duplicate_bbpath
self.assertIn("BBPATH contains duplicate entries:\n %s %s\n" % (bbpath, dup), result.stdout)
AssertionError: 'BBPATH contains duplicate entries:\n /srv/pokybuild/yocto-worker/oe-selftest-armhost/build/layers/bitbake/lib/bb/tests/parse-tests /srv/pokybuild/yocto-worker/oe-selftest-armhost/build/layers/bitbake/lib/bb/tests/parse-tests\n' not found in ''
----------------------------------------------------------------------
Ran 843 tests in 779.743s
FAILED (failures=1, skipped=135)